Guest User

Untitled

a guest
Feb 25th, 2015
458
Never
Not a member of Pastebin yet? Sign Up, it unlocks many cool features!
  1. W/System.err( 1580): java.lang.ClassNotFoundException: android.graphics.drawable.RippleDrawable
  2. W/System.err( 1580):    at java.lang.Class.classForName(Native Method)
  3. W/System.err( 1580):    at java.lang.Class.forName(Class.java:217)
  4. W/System.err( 1580):    at java.lang.Class.forName(Class.java:172)
  5. W/System.err( 1580):    at org.qtproject.qt5.android.ExtractStyle.getClass(ExtractStyle.java:396)
  6. W/System.err( 1580):    at org.qtproject.qt5.android.ExtractStyle.<init>(ExtractStyle.java:100)
  7. W/System.err( 1580):    at org.qtproject.qt5.android.QtActivityDelegate.loadApplication(QtActivityDelegate.java:438)
  8. W/System.err( 1580):    at java.lang.reflect.Method.invokeNative(Native Method)
  9. W/System.err( 1580):    at java.lang.reflect.Method.invoke(Method.java:511)
  10. W/System.err( 1580):    at org.qtproject.qt5.android.bindings.QtActivity.loadApplication(QtActivity.java:245)
  11. W/System.err( 1580):    at org.qtproject.qt5.android.bindings.QtActivity.startApp(QtActivity.java:655)
  12. W/System.err( 1580):    at org.qtproject.qt5.android.bindings.QtActivity.onCreate(QtActivity.java:895)
  13. W/System.err( 1580):    at android.app.Activity.performCreate(Activity.java:5008)
  14. W/System.err( 1580):    at android.app.Instrumentation.callActivityOnCreate(Instrumentation.java:1079)
  15. W/System.err( 1580):    at android.app.ActivityThread.performLaunchActivity(ActivityThread.java:2023)
  16. W/System.err( 1580):    at android.app.ActivityThread.handleLaunchActivity(ActivityThread.java:2084)
  17. W/System.err( 1580):    at android.app.ActivityThread.access$600(ActivityThread.java:130)
  18. W/System.err( 1580):    at android.app.ActivityThread$H.handleMessage(ActivityThread.java:1195)
  19. W/System.err( 1580):    at android.os.Handler.dispatchMessage(Handler.java:99)
  20. W/System.err( 1580):    at android.os.Looper.loop(Looper.java:137)
  21. W/System.err( 1580):    at android.app.ActivityThread.main(ActivityThread.java:4745)
  22. W/System.err( 1580):    at java.lang.reflect.Method.invokeNative(Native Method)
  23. W/System.err( 1580):    at java.lang.reflect.Method.invoke(Method.java:511)
  24. W/System.err( 1580):    at com.android.internal.os.ZygoteInit$MethodAndArgsCaller.run(ZygoteInit.java:786)
  25. W/System.err( 1580):    at com.android.internal.os.ZygoteInit.main(ZygoteInit.java:553)
  26. W/System.err( 1580):    at dalvik.system.NativeStart.main(Native Method)
  27. W/System.err( 1580): Caused by: java.lang.NoClassDefFoundError: android/graphics/drawable/RippleDrawable
  28. W/System.err( 1580):    ... 25 more
  29. W/System.err( 1580): Caused by: java.lang.ClassNotFoundException: android.graphics.drawable.RippleDrawable
  30. W/System.err( 1580):    at dalvik.system.BaseDexClassLoader.findClass(BaseDexClassLoader.java:61)
  31. W/System.err( 1580):    at java.lang.ClassLoader.loadClass(ClassLoader.java:501)
  32. W/System.err( 1580):    at java.lang.ClassLoader.loadClass(ClassLoader.java:461)
  33. W/System.err( 1580):    ... 25 more
  34. W/System.err( 1580): java.lang.ClassNotFoundException: android.graphics.drawable.AnimatedStateListDrawable
  35. W/System.err( 1580):    at java.lang.Class.classForName(Native Method)
  36. W/System.err( 1580):    at java.lang.Class.forName(Class.java:217)
  37. W/System.err( 1580):    at java.lang.Class.forName(Class.java:172)
  38. W/System.err( 1580):    at org.qtproject.qt5.android.ExtractStyle.getClass(ExtractStyle.java:396)
  39. W/System.err( 1580):    at org.qtproject.qt5.android.ExtractStyle.<init>(ExtractStyle.java:101)
  40. W/System.err( 1580):    at org.qtproject.qt5.android.QtActivityDelegate.loadApplication(QtActivityDelegate.java:438)
  41. W/System.err( 1580):    at java.lang.reflect.Method.invokeNative(Native Method)
  42. W/System.err( 1580):    at java.lang.reflect.Method.invoke(Method.java:511)
  43. W/System.err( 1580):    at org.qtproject.qt5.android.bindings.QtActivity.loadApplication(QtActivity.java:245)
  44. W/System.err( 1580):    at org.qtproject.qt5.android.bindings.QtActivity.startApp(QtActivity.java:655)
  45. W/System.err( 1580):    at org.qtproject.qt5.android.bindings.QtActivity.onCreate(QtActivity.java:895)
  46. W/System.err( 1580):    at android.app.Activity.performCreate(Activity.java:5008)
  47. W/System.err( 1580):    at android.app.Instrumentation.callActivityOnCreate(Instrumentation.java:1079)
  48. W/System.err( 1580):    at android.app.ActivityThread.performLaunchActivity(ActivityThread.java:2023)
  49. W/System.err( 1580):    at android.app.ActivityThread.handleLaunchActivity(ActivityThread.java:2084)
  50. W/System.err( 1580):    at android.app.ActivityThread.access$600(ActivityThread.java:130)
  51. W/System.err( 1580):    at android.app.ActivityThread$H.handleMessage(ActivityThread.java:1195)
  52. W/System.err( 1580):    at android.os.Handler.dispatchMessage(Handler.java:99)
  53. W/System.err( 1580):    at android.os.Looper.loop(Looper.java:137)
  54. W/System.err( 1580):    at android.app.ActivityThread.main(ActivityThread.java:4745)
  55. W/System.err( 1580):    at java.lang.reflect.Method.invokeNative(Native Method)
  56. W/System.err( 1580):    at java.lang.reflect.Method.invoke(Method.java:511)
  57. W/System.err( 1580):    at com.android.internal.os.ZygoteInit$MethodAndArgsCaller.run(ZygoteInit.java:786)
  58. W/System.err( 1580):    at com.android.internal.os.ZygoteInit.main(ZygoteInit.java:553)
  59. W/System.err( 1580):    at dalvik.system.NativeStart.main(Native Method)
  60. W/System.err( 1580): Caused by: java.lang.NoClassDefFoundError: android/graphics/drawable/AnimatedStateListDrawable
  61. W/System.err( 1580):    ... 25 more
  62. W/System.err( 1580): Caused by: java.lang.ClassNotFoundException: android.graphics.drawable.AnimatedStateListDrawable
  63. W/System.err( 1580):    at dalvik.system.BaseDexClassLoader.findClass(BaseDexClassLoader.java:61)
  64. W/System.err( 1580):    at java.lang.ClassLoader.loadClass(ClassLoader.java:501)
  65. W/System.err( 1580):    at java.lang.ClassLoader.loadClass(ClassLoader.java:461)
  66. W/System.err( 1580):    ... 25 more
  67. W/System.err( 1580): java.lang.ClassNotFoundException: android.graphics.drawable.VectorDrawable
  68. W/System.err( 1580):    at java.lang.Class.classForName(Native Method)
  69. W/System.err( 1580):    at java.lang.Class.forName(Class.java:217)
  70. W/System.err( 1580):    at java.lang.Class.forName(Class.java:172)
  71. W/System.err( 1580):    at org.qtproject.qt5.android.ExtractStyle.getClass(ExtractStyle.java:396)
  72. W/System.err( 1580):    at org.qtproject.qt5.android.ExtractStyle.<init>(ExtractStyle.java:102)
  73. W/System.err( 1580):    at org.qtproject.qt5.android.QtActivityDelegate.loadApplication(QtActivityDelegate.java:438)
  74. W/System.err( 1580):    at java.lang.reflect.Method.invokeNative(Native Method)
  75. W/System.err( 1580):    at java.lang.reflect.Method.invoke(Method.java:511)
  76. W/System.err( 1580):    at org.qtproject.qt5.android.bindings.QtActivity.loadApplication(QtActivity.java:245)
  77. W/System.err( 1580):    at org.qtproject.qt5.android.bindings.QtActivity.startApp(QtActivity.java:655)
  78. W/System.err( 1580):    at org.qtproject.qt5.android.bindings.QtActivity.onCreate(QtActivity.java:895)
  79. W/System.err( 1580):    at android.app.Activity.performCreate(Activity.java:5008)
  80. W/System.err( 1580):    at android.app.Instrumentation.callActivityOnCreate(Instrumentation.java:1079)
  81. W/System.err( 1580):    at android.app.ActivityThread.performLaunchActivity(ActivityThread.java:2023)
  82. W/System.err( 1580):    at android.app.ActivityThread.handleLaunchActivity(ActivityThread.java:2084)
  83. W/System.err( 1580):    at android.app.ActivityThread.access$600(ActivityThread.java:130)
  84. W/System.err( 1580):    at android.app.ActivityThread$H.handleMessage(ActivityThread.java:1195)
  85. W/System.err( 1580):    at android.os.Handler.dispatchMessage(Handler.java:99)
  86. W/System.err( 1580):    at android.os.Looper.loop(Looper.java:137)
  87. W/System.err( 1580):    at android.app.ActivityThread.main(ActivityThread.java:4745)
  88. W/System.err( 1580):    at java.lang.reflect.Method.invokeNative(Native Method)
  89. W/System.err( 1580):    at java.lang.reflect.Method.invoke(Method.java:511)
  90. W/System.err( 1580):    at com.android.internal.os.ZygoteInit$MethodAndArgsCaller.run(ZygoteInit.java:786)
  91. W/System.err( 1580):    at com.android.internal.os.ZygoteInit.main(ZygoteInit.java:553)
  92. W/System.err( 1580):    at dalvik.system.NativeStart.main(Native Method)
  93. W/System.err( 1580): Caused by: java.lang.NoClassDefFoundError: android/graphics/drawable/VectorDrawable
  94. W/System.err( 1580):    ... 25 more
  95. W/System.err( 1580): Caused by: java.lang.ClassNotFoundException: android.graphics.drawable.VectorDrawable
  96. W/System.err( 1580):    at dalvik.system.BaseDexClassLoader.findClass(BaseDexClassLoader.java:61)
  97. W/System.err( 1580):    at java.lang.ClassLoader.loadClass(ClassLoader.java:501)
  98. W/System.err( 1580):    at java.lang.ClassLoader.loadClass(ClassLoader.java:461)
  99. W/System.err( 1580):    ... 25 more
  100. W/System.err( 1580): java.lang.NoSuchFieldException: View_paddingStart
  101. W/System.err( 1580):    at java.lang.Class.getDeclaredField(Class.java:631)
  102. W/System.err( 1580):    at org.qtproject.qt5.android.ExtractStyle.getField(ExtractStyle.java:435)
  103. W/System.err( 1580):    at org.qtproject.qt5.android.ExtractStyle.<init>(ExtractStyle.java:181)
  104. W/System.err( 1580):    at org.qtproject.qt5.android.QtActivityDelegate.loadApplication(QtActivityDelegate.java:438)
  105. W/System.err( 1580):    at java.lang.reflect.Method.invokeNative(Native Method)
  106. W/System.err( 1580):    at java.lang.reflect.Method.invoke(Method.java:511)
  107. W/System.err( 1580):    at org.qtproject.qt5.android.bindings.QtActivity.loadApplication(QtActivity.java:245)
  108. W/System.err( 1580):    at org.qtproject.qt5.android.bindings.QtActivity.startApp(QtActivity.java:655)
  109. W/System.err( 1580):    at org.qtproject.qt5.android.bindings.QtActivity.onCreate(QtActivity.java:895)
  110. W/System.err( 1580):    at android.app.Activity.performCreate(Activity.java:5008)
  111. W/System.err( 1580):    at android.app.Instrumentation.callActivityOnCreate(Instrumentation.java:1079)
  112. W/System.err( 1580):    at android.app.ActivityThread.performLaunchActivity(ActivityThread.java:2023)
  113. W/System.err( 1580):    at android.app.ActivityThread.handleLaunchActivity(ActivityThread.java:2084)
  114. W/System.err( 1580):    at android.app.ActivityThread.access$600(ActivityThread.java:130)
  115. W/System.err( 1580):    at android.app.ActivityThread$H.handleMessage(ActivityThread.java:1195)
  116. W/System.err( 1580):    at android.os.Handler.dispatchMessage(Handler.java:99)
  117. W/System.err( 1580):    at android.os.Looper.loop(Looper.java:137)
  118. W/System.err( 1580):    at android.app.ActivityThread.main(ActivityThread.java:4745)
  119. W/System.err( 1580):    at java.lang.reflect.Method.invokeNative(Native Method)
  120. W/System.err( 1580):    at java.lang.reflect.Method.invoke(Method.java:511)
  121. W/System.err( 1580):    at com.android.internal.os.ZygoteInit$MethodAndArgsCaller.run(ZygoteInit.java:786)
  122. W/System.err( 1580):    at com.android.internal.os.ZygoteInit.main(ZygoteInit.java:553)
  123. W/System.err( 1580):    at dalvik.system.NativeStart.main(Native Method)
  124. W/System.err( 1580): java.lang.NoSuchFieldException: View_paddingEnd
  125. W/System.err( 1580):    at java.lang.Class.getDeclaredField(Class.java:631)
  126. W/System.err( 1580):    at org.qtproject.qt5.android.ExtractStyle.getField(ExtractStyle.java:435)
  127. W/System.err( 1580):    at org.qtproject.qt5.android.ExtractStyle.<init>(ExtractStyle.java:182)
  128. W/System.err( 1580):    at org.qtproject.qt5.android.QtActivityDelegate.loadApplication(QtActivityDelegate.java:438)
  129. W/System.err( 1580):    at java.lang.reflect.Method.invokeNative(Native Method)
  130. W/System.err( 1580):    at java.lang.reflect.Method.invoke(Method.java:511)
  131. W/System.err( 1580):    at org.qtproject.qt5.android.bindings.QtActivity.loadApplication(QtActivity.java:245)
  132. W/System.err( 1580):    at org.qtproject.qt5.android.bindings.QtActivity.startApp(QtActivity.java:655)
  133. W/System.err( 1580):    at org.qtproject.qt5.android.bindings.QtActivity.onCreate(QtActivity.java:895)
  134. W/System.err( 1580):    at android.app.Activity.performCreate(Activity.java:5008)
  135. W/System.err( 1580):    at android.app.Instrumentation.callActivityOnCreate(Instrumentation.java:1079)
  136. W/System.err( 1580):    at android.app.ActivityThread.performLaunchActivity(ActivityThread.java:2023)
  137. W/System.err( 1580):    at android.app.ActivityThread.handleLaunchActivity(ActivityThread.java:2084)
  138. W/System.err( 1580):    at android.app.ActivityThread.access$600(ActivityThread.java:130)
  139. W/System.err( 1580):    at android.app.ActivityThread$H.handleMessage(ActivityThread.java:1195)
  140. W/System.err( 1580):    at android.os.Handler.dispatchMessage(Handler.java:99)
  141. W/System.err( 1580):    at android.os.Looper.loop(Looper.java:137)
  142. W/System.err( 1580):    at android.app.ActivityThread.main(ActivityThread.java:4745)
  143. W/System.err( 1580):    at java.lang.reflect.Method.invokeNative(Native Method)
  144. W/System.err( 1580):    at java.lang.reflect.Method.invoke(Method.java:511)
  145. W/System.err( 1580):    at com.android.internal.os.ZygoteInit$MethodAndArgsCaller.run(ZygoteInit.java:786)
  146. W/System.err( 1580):    at com.android.internal.os.ZygoteInit.main(ZygoteInit.java:553)
  147. W/System.err( 1580):    at dalvik.system.NativeStart.main(Native Method)
  148. W/ResourceType( 1580): Skipping entry 0x10804be in package table 0 because it is not complex!
  149. D/dalvikvm( 1580): GC_CONCURRENT freed 318K, 4% free 11006K/11463K, paused 17ms+1ms, total 19ms
  150. D/dalvikvm( 1580): GC_CONCURRENT freed 322K, 4% free 11129K/11591K, paused 17ms+0ms, total 18ms
  151. D/dalvikvm( 1580): GC_CONCURRENT freed 341K, 5% free 11173K/11655K, paused 14ms+0ms, total 15ms
  152. D/dalvikvm( 1580): GC_CONCURRENT freed 318K, 4% free 11261K/11719K, paused 11ms+0ms, total 13ms
  153. D/dalvikvm( 1580): GC_FOR_ALLOC freed 292K, 5% free 11398K/11911K, paused 2ms, total 3ms
  154. D/dalvikvm( 1580): GC_CONCURRENT freed 336K, 4% free 11508K/11975K, paused 21ms+0ms, total 22ms
  155. D/dalvikvm( 1580): GC_CONCURRENT freed 224K, 4% free 11673K/12039K, paused 17ms+0ms, total 18ms
  156. D/dalvikvm( 1580): GC_CONCURRENT freed 408K, 5% free 11683K/12231K, paused 14ms+0ms, total 16ms
  157. D/dalvikvm( 1580): GC_CONCURRENT freed 340K, 4% free 11750K/12231K, paused 15ms+0ms, total 16ms
  158. D/dalvikvm( 1580): GC_CONCURRENT freed 316K, 4% free 11838K/12295K, paused 18ms+0ms, total 19ms
  159. D/dalvikvm( 1580): GC_CONCURRENT freed 429K, 5% free 11853K/12423K, paused 12ms+0ms, total 14ms
  160. D/dalvikvm( 1580): GC_CONCURRENT freed 436K, 5% free 11847K/12423K, paused 16ms+0ms, total 17ms
  161. D/dalvikvm( 1580): GC_CONCURRENT freed 352K, 4% free 11930K/12423K, paused 19ms+0ms, total 21ms
  162. D/dalvikvm( 1580): GC_CONCURRENT freed 217K, 4% free 12156K/12551K, paused 21ms+0ms, total 22ms
  163. D/dalvikvm( 1580): GC_CONCURRENT freed 455K, 5% free 12150K/12743K, paused 11ms+0ms, total 13ms
  164. D/dalvikvm( 1580): GC_CONCURRENT freed 342K, 5% free 12204K/12743K, paused 15ms+0ms, total 17ms
  165. D/dalvikvm( 1580): GC_CONCURRENT freed 352K, 4% free 12252K/12743K, paused 16ms+0ms, total 17ms
  166. D/dalvikvm( 1580): Trying to load lib /data/data/org.qtproject.example.TestProj2/lib/libTestProj2.so 0xb3a5bb80
  167. D/        ( 1580): (null):0 ((null)): QML debugging is enabled. Only use this in a safe environment.
  168. D/dalvikvm( 1580): Added shared lib /data/data/org.qtproject.example.TestProj2/lib/libTestProj2.so 0xb3a5bb80
  169. D/dalvikvm( 1580): No JNI_OnLoad found in /data/data/org.qtproject.example.TestProj2/lib/libTestProj2.so 0xb3a5bb80, skipping init
  170. W/Qt A11Y ( 1580): Could not activate platform accessibility.
  171. D/libEGL  ( 1580): loaded /system/lib/egl/libEGL_emulation.so
  172. D/        ( 1580): HostConnection::get() New Host Connection established 0xb8883c50, tid 1597
  173. D/libEGL  ( 1580): loaded /system/lib/egl/libGLESv1_CM_emulation.so
  174. D/libEGL  ( 1580): loaded /system/lib/egl/libGLESv2_emulation.so
  175. D/        ( 1580): HostConnection::get() New Host Connection established 0xb889c408, tid 1580
  176. W/EGL_emulation( 1580): eglSurfaceAttrib not implemented
  177. D/OpenGLRenderer( 1580): Enabling debug mode 0
  178. W/EGL_emulation( 1580): eglSurfaceAttrib not implemented
  179. D/        ( 1580): HostConnection::get() New Host Connection established 0xb8a7c020, tid 1599
  180. W/libTestProj2.so( 1580): (null):0 ((null)): QOpenGLShader::compile(Vertex): Vertex shader failed to compile with the following errors:
  181. W/libTestProj2.so( 1580): ERROR: 0:2: error(#101) Macro redefined: lowp
  182. W/libTestProj2.so( 1580): ERROR: 0:3: error(#101) Macro redefined: mediump
  183. W/libTestProj2.so( 1580): ERROR: 0:4: error(#101) Macro redefined: highp
  184. W/libTestProj2.so( 1580): ERROR: error(#273) 3 compilation errors.  No code generated
  185. W/libTestProj2.so( 1580):
  186. W/libTestProj2.so( 1580):
  187. W/libTestProj2.so( 1580): (null):0 ((null)): *** Problematic Vertex shader source code ***
  188. W/libTestProj2.so( 1580): (null):0 ((null)): #define lowp
  189. W/libTestProj2.so( 1580): #define mediump
  190. W/libTestProj2.so( 1580): #define highp
  191. W/libTestProj2.so( 1580): uniform highp mat4 qt_Matrix;
  192. W/libTestProj2.so( 1580):
  193. W/libTestProj2.so( 1580): attribute highp vec4 qt_VertexPosition;
  194. W/libTestProj2.so( 1580): attribute highp vec2 qt_VertexTexCoord;
  195. W/libTestProj2.so( 1580):
  196. W/libTestProj2.so( 1580): varying highp vec2 qt_TexCoord;
  197. W/libTestProj2.so( 1580):
  198. W/libTestProj2.so( 1580): attribute highp float _qt_order;
  199. W/libTestProj2.so( 1580): uniform highp float _qt_zRange;
  200. W/libTestProj2.so( 1580): void main()
  201. W/libTestProj2.so( 1580): {
  202. W/libTestProj2.so( 1580):     qt_TexCoord = qt_VertexTexCoord;
  203. W/libTestProj2.so( 1580):     gl_Position = qt_Matrix * qt_VertexPosition;
  204. W/libTestProj2.so( 1580):     gl_Position.z = (gl_Position.z * _qt_zRange + _qt_order) * gl_Position.w;
  205. W/libTestProj2.so( 1580): }
  206. W/libTestProj2.so( 1580): (null):0 ((null)): ***
  207. W/libTestProj2.so( 1580): (null):0 ((null)): QOpenGLShader::compile(Fragment): Fragment shader failed to compile with the following errors:
  208. W/libTestProj2.so( 1580): ERROR: 0:2: error(#101) Macro redefined: lowp
  209. W/libTestProj2.so( 1580): ERROR: 0:3: error(#101) Macro redefined: mediump
  210. W/libTestProj2.so( 1580): ERROR: 0:4: error(#101) Macro redefined: highp
  211. W/libTestProj2.so( 1580): ERROR: error(#273) 3 compilation errors.  No code generated
  212. W/libTestProj2.so( 1580):
  213. W/libTestProj2.so( 1580):
  214. W/libTestProj2.so( 1580): (null):0 ((null)): *** Problematic Fragment shader source code ***
  215. W/libTestProj2.so( 1580): (null):0 ((null)): #define lowp
  216. W/libTestProj2.so( 1580): #define mediump
  217. W/libTestProj2.so( 1580): #define highp
  218. W/libTestProj2.so( 1580): varying highp vec2 qt_TexCoord;
  219. W/libTestProj2.so( 1580):
  220. W/libTestProj2.so( 1580): uniform sampler2D qt_Texture;
  221. W/libTestProj2.so( 1580):
  222. W/libTestProj2.so( 1580): void main()
  223. W/libTestProj2.so( 1580): {
  224. W/libTestProj2.so( 1580):     gl_FragColor = texture2D(qt_Texture, qt_TexCoord);
  225. W/libTestProj2.so( 1580): }
  226. W/libTestProj2.so( 1580): (null):0 ((null)): ***
  227. W/libTestProj2.so( 1580): (null):0 ((null)): shader compilation failed:
  228. W/libTestProj2.so( 1580): ""
  229. W/libTestProj2.so( 1580): (null):0 ((null)): QOpenGLShaderProgram::uniformLocation( qt_Matrix ): shader program is not linked
  230. W/libTestProj2.so( 1580): (null):0 ((null)): QOpenGLShader::compile(Vertex): Vertex shader failed to compile with the following errors:
  231. W/libTestProj2.so( 1580): ERROR: 0:2: error(#101) Macro redefined: lowp
  232. W/libTestProj2.so( 1580): ERROR: 0:3: error(#101) Macro redefined: mediump
  233. W/libTestProj2.so( 1580): ERROR: 0:4: error(#101) Macro redefined: highp
  234. W/libTestProj2.so( 1580): ERROR: error(#273) 3 compilation errors.  No code generated
  235. W/libTestProj2.so( 1580):
  236. W/libTestProj2.so( 1580):
  237. W/libTestProj2.so( 1580): (null):0 ((null)): *** Problematic Vertex shader source code ***
  238. W/libTestProj2.so( 1580): (null):0 ((null)): #define lowp
  239. W/libTestProj2.so( 1580): #define mediump
  240. W/libTestProj2.so( 1580): #define highp
  241. W/libTestProj2.so( 1580): uniform highp mat4 qt_Matrix;
  242. W/libTestProj2.so( 1580):
  243. W/libTestProj2.so( 1580): attribute highp vec4 qt_VertexPosition;
  244. W/libTestProj2.so( 1580): attribute highp vec2 qt_VertexTexCoord;
  245. W/libTestProj2.so( 1580):
  246. W/libTestProj2.so( 1580): varying highp vec2 qt_TexCoord;
  247. W/libTestProj2.so( 1580):
  248. W/libTestProj2.so( 1580): attribute highp float _qt_order;
  249. W/libTestProj2.so( 1580): uniform highp float _qt_zRange;
  250. W/libTestProj2.so( 1580): void main()
  251. W/libTestProj2.so( 1580): {
  252. W/libTestProj2.so( 1580):     qt_TexCoord = qt_VertexTexCoord;
  253. W/libTestProj2.so( 1580):     gl_Position = qt_Matrix * qt_VertexPosition;
  254. W/libTestProj2.so( 1580):     gl_Position.z = (gl_Position.z * _qt_zRange + _qt_order) * gl_Position.w;
  255. W/libTestProj2.so( 1580): }
  256. W/libTestProj2.so( 1580): (null):0 ((null)): ***
  257. W/libTestProj2.so( 1580): (null):0 ((null)): *** Problematic Vertex shader source code ***
  258. W/libTestProj2.so( 1580): (null):0 ((null)): #define lowp
  259. W/libTestProj2.so( 1580): #define mediump
  260. W/libTestProj2.so( 1580): #define highp
  261. W/libTestProj2.so( 1580): uniform highp mat4 qt_Matrix;
  262. W/libTestProj2.so( 1580):
  263. W/libTestProj2.so( 1580): attribute highp vec4 qt_VertexPosition;
  264. W/libTestProj2.so( 1580): attribute highp vec2 qt_VertexTexCoord;
  265. W/libTestProj2.so( 1580):
  266. W/libTestProj2.so( 1580): varying highp vec2 qt_TexCoord;
  267. W/libTestProj2.so( 1580):
  268. W/libTestProj2.so( 1580): attribute highp float _qt_order;
  269. W/libTestProj2.so( 1580): uniform highp float _qt_zRange;
  270. W/libTestProj2.so( 1580): void main()
  271. W/libTestProj2.so( 1580): {
  272. W/libTestProj2.so( 1580):     qt_TexCoord = qt_VertexTexCoord;
  273. W/libTestProj2.so( 1580):     gl_Position = qt_Matrix * qt_VertexPosition;
  274. W/libTestProj2.so( 1580):     gl_Position.z = (gl_Position.z * _qt_zRange + _qt_order) * gl_Position.w;
  275. W/libTestProj2.so( 1580): }
  276. W/libTestProj2.so( 1580): (null):0 ((null)): ***
  277. W/libTestProj2.so( 1580): (null):0 ((null)): QOpenGLShader::compile(Fragment): Fragment shader failed to compile with the following errors:
  278. W/libTestProj2.so( 1580): ERROR: 0:2: error(#101) Macro redefined: lowp
  279. W/libTestProj2.so( 1580): ERROR: 0:3: error(#101) Macro redefined: mediump
  280. W/libTestProj2.so( 1580): ERROR: 0:4: error(#101) Macro redefined: highp
  281. W/libTestProj2.so( 1580): ERROR: error(#273) 3 compilation errors.  No code generated
  282. W/libTestProj2.so( 1580):
  283. W/libTestProj2.so( 1580):
  284. W/libTestProj2.so( 1580): (null):0 ((null)): *** Problematic Fragment shader source code ***
  285. W/libTestProj2.so( 1580): (null):0 ((null)): #define lowp
  286. W/libTestProj2.so( 1580): #define mediump
  287. W/libTestProj2.so( 1580): #define highp
  288. W/libTestProj2.so( 1580): varying highp vec2 qt_TexCoord;
  289. W/libTestProj2.so( 1580):
  290. W/libTestProj2.so( 1580): uniform sampler2D qt_Texture;
  291. W/libTestProj2.so( 1580):
  292. W/libTestProj2.so( 1580): void main()
  293. W/libTestProj2.so( 1580): {
  294. W/libTestProj2.so( 1580):     gl_FragColor = texture2D(qt_Texture, qt_TexCoord);
  295. W/libTestProj2.so( 1580): }
  296. W/libTestProj2.so( 1580): (null):0 ((null)): ***
  297. W/libTestProj2.so( 1580): (null):0 ((null)): shader compilation failed:
  298. W/libTestProj2.so( 1580): ""
  299. W/libTestProj2.so( 1580): (null):0 ((null)): QOpenGLShaderProgram::uniformLocation( qt_Matrix ): shader program is not linked
  300. W/libTestProj2.so( 1580): (null):0 ((null)): QOpenGLShader::compile(Vertex): Vertex shader failed to compile with the following errors:
  301. W/libTestProj2.so( 1580): ERROR: 0:2: error(#101) Macro redefined: lowp
  302. W/libTestProj2.so( 1580): ERROR: 0:3: error(#101) Macro redefined: mediump
  303. W/libTestProj2.so( 1580): ERROR: 0:4: error(#101) Macro redefined: highp
  304. W/libTestProj2.so( 1580): ERROR: error(#273) 3 compilation errors.  No code generated
  305. W/libTestProj2.so( 1580):
  306. W/libTestProj2.so( 1580):
  307. W/libTestProj2.so( 1580): (null):0 ((null)): *** Problematic Vertex shader source code ***
  308. W/libTestProj2.so( 1580): (null):0 ((null)): #define lowp
  309. W/libTestProj2.so( 1580): #define mediump
  310. W/libTestProj2.so( 1580): #define highp
  311. W/libTestProj2.so( 1580): uniform highp mat4 qt_Matrix;
  312. W/libTestProj2.so( 1580):
  313. W/libTestProj2.so( 1580): attribute highp vec4 qt_VertexPosition;
  314. W/libTestProj2.so( 1580): attribute highp vec2 qt_VertexTexCoord;
  315. W/libTestProj2.so( 1580):
  316. W/libTestProj2.so( 1580): varying highp vec2 qt_TexCoord;
  317. W/libTestProj2.so( 1580):
  318. W/libTestProj2.so( 1580): attribute highp float _qt_order;
  319. W/libTestProj2.so( 1580): uniform highp float _qt_zRange;
  320. W/libTestProj2.so( 1580): void main()
  321. W/libTestProj2.so( 1580): {
  322. W/libTestProj2.so( 1580):     qt_TexCoord = qt_VertexTexCoord;
  323. W/libTestProj2.so( 1580):     gl_Position = qt_Matrix * qt_VertexPosition;
  324. W/libTestProj2.so( 1580):     gl_Position.z = (gl_Position.z * _qt_zRange + _qt_order) * gl_Position.w;
  325. W/libTestProj2.so( 1580): }
  326. W/libTestProj2.so( 1580): (null):0 ((null)): ***
  327. W/libTestProj2.so( 1580): (null):0 ((null)): QOpenGLShader::compile(Fragment): Fragment shader failed to compile with the following errors:
  328. W/libTestProj2.so( 1580): ERROR: 0:2: error(#101) Macro redefined: lowp
  329. W/libTestProj2.so( 1580): ERROR: 0:3: error(#101) Macro redefined: mediump
  330. W/libTestProj2.so( 1580): ERROR: 0:4: error(#101) Macro redefined: highp
  331. W/libTestProj2.so( 1580): ERROR: error(#273) 3 compilation errors.  No code generated
  332. W/libTestProj2.so( 1580):
  333. W/libTestProj2.so( 1580):
  334. W/libTestProj2.so( 1580): (null):0 ((null)): *** Problematic Fragment shader source code ***
  335. W/libTestProj2.so( 1580): (null):0 ((null)): #define lowp
  336. W/libTestProj2.so( 1580): #define mediump
  337. W/libTestProj2.so( 1580): #define highp
  338. W/libTestProj2.so( 1580): varying highp vec2 qt_TexCoord;
  339. W/libTestProj2.so( 1580):
  340. W/libTestProj2.so( 1580): uniform sampler2D qt_Texture;
  341. W/libTestProj2.so( 1580):
  342. W/libTestProj2.so( 1580): void main()
  343. W/libTestProj2.so( 1580): {
  344. W/libTestProj2.so( 1580):     gl_FragColor = texture2D(qt_Texture, qt_TexCoord);
  345. W/libTestProj2.so( 1580): }
  346. W/libTestProj2.so( 1580): (null):0 ((null)): ***
  347. W/libTestProj2.so( 1580): (null):0 ((null)): shader compilation failed:
  348. W/libTestProj2.so( 1580): ""
  349. W/libTestProj2.so( 1580): (null):0 ((null)): QOpenGLShaderProgram::uniformLocation( qt_Matrix ): shader program is not linked
  350. W/libTestProj2.so( 1580): (null):0 ((null)): QOpenGLShader::compile(Vertex): Vertex shader failed to compile with the following errors:
  351. W/libTestProj2.so( 1580): ERROR: 0:2: error(#101) Macro redefined: lowp
  352. W/libTestProj2.so( 1580): ERROR: 0:3: error(#101) Macro redefined: mediump
  353. W/libTestProj2.so( 1580): ERROR: 0:4: error(#101) Macro redefined: highp
  354. W/libTestProj2.so( 1580): ERROR: error(#273) 3 compilation errors.  No code generated
  355. W/libTestProj2.so( 1580):
  356. W/libTestProj2.so( 1580):
  357. W/libTestProj2.so( 1580): (null):0 ((null)): *** Problematic Vertex shader source code ***
  358. W/libTestProj2.so( 1580): (null):0 ((null)): #define lowp
  359. W/libTestProj2.so( 1580): #define mediump
  360. W/libTestProj2.so( 1580): #define highp
  361. W/libTestProj2.so( 1580): uniform highp mat4 qt_Matrix;
  362. W/libTestProj2.so( 1580):
  363. W/libTestProj2.so( 1580): attribute highp vec4 qt_VertexPosition;
  364. W/libTestProj2.so( 1580): attribute highp vec2 qt_VertexTexCoord;
RAW Paste Data

Adblocker detected! Please consider disabling it...

We've detected AdBlock Plus or some other adblocking software preventing Pastebin.com from fully loading.

We don't have any obnoxious sound, or popup ads, we actively block these annoying types of ads!

Please add Pastebin.com to your ad blocker whitelist or disable your adblocking software.

×