Advertisement
Guest User

Untitled

a guest
Jan 31st, 2021
68
Never
Not a member of Pastebin yet? Sign Up, it unlocks many cool features!
C++ 35.21 KB | None
  1. 1>------ Rebuild All started: Project: ZERO_CHECK, Configuration: Debug x64 ------
  2. 1>Build started 1/31/2021 4:45:04 PM.
  3. 1>Target _PrepareForClean:
  4. 1>  Deleting file "x64\Debug\ZERO_CHECK\ZERO_CHECK.tlog\ZERO_CHECK.lastbuildstate".
  5. 1>Target InitializeBuildStatus:
  6. 1>  Creating "x64\Debug\ZERO_CHECK\ZERO_CHECK.tlog\unsuccessfulbuild" because "AlwaysCreate" was specified.
  7. 1>Target CustomBuild:
  8. 1>  Checking Build System
  9. 1>  CMake is re-running because G:/programming/cplusplus/CTK/build/CMakeFiles/generate.stamp is out-of-date.
  10. 1>    the file 'G:/programming/cplusplus/CTK/Libs/mbilog/target_libraries.cmake'
  11. 1>    is newer than 'G:/programming/cplusplus/CTK/build/CMakeFiles/generate.stamp.depend'
  12. 1>    result='-1'
  13. 1>  -- Selecting Windows SDK version 10.0.18362.0 to target Windows 10.0.19041.
  14. 1>  ITK_VERSION:             5.2.0
  15. 1>  -- Generated: G:/programming/cplusplus/CTK/build/DGraphInput-alldep.txt
  16. 1>  -- Generated: G:/programming/cplusplus/CTK/build/DGraphInput-alldep-withext.txt
  17. 1>  -- Generated: G:/programming/cplusplus/CTK/build/DGraphInput.txt
  18. 1>  -- SuperBuild - First pass
  19. 1>  -- SuperBuild - First pass - done
  20. 1>  -- SuperBuild - Log4Qt[OPTIONAL]
  21. 1>  -- SuperBuild - VTK[OPTIONAL]
  22. 1>  -- SuperBuild - PythonQt[OPTIONAL]
  23. 1>  -- SuperBuild - DCMTK[OPTIONAL]
  24. 1>  -- SuperBuild - ZMQ[OPTIONAL]
  25. 1>  -- SuperBuild - QtSOAP[OPTIONAL]
  26. 1>  -- SuperBuild - qxmlrpc[OPTIONAL]
  27. 1>  -- SuperBuild - qRestAPI[OPTIONAL]
  28. 1>  -- SuperBuild - OpenIGTLink[OPTIONAL]
  29. 1>  -- SuperBuild - ITK[OPTIONAL]
  30. 1>  -- SuperBuild - QtTesting[OPTIONAL]
  31. 1>  -- SuperBuild - CTK[OK]
  32. 1>  -- Configuring done
  33. 1>  -- Generating done
  34. 1>  -- Build files have been written to: G:/programming/cplusplus/CTK/build
  35. 1>Target FinalizeBuildStatus:
  36. 1>  Deleting file "x64\Debug\ZERO_CHECK\ZERO_CHECK.tlog\unsuccessfulbuild".
  37. 1>  Touching "x64\Debug\ZERO_CHECK\ZERO_CHECK.tlog\ZERO_CHECK.lastbuildstate".
  38. 1>
  39. 1>Build succeeded.
  40. 1>    0 Warning(s)
  41. 1>    0 Error(s)
  42. 1>
  43. 1>Time Elapsed 00:00:09.25
  44. 2>------ Rebuild All started: Project: CTK, Configuration: Debug x64 ------
  45. 2>Build started 1/31/2021 4:45:13 PM.
  46. 2>Target _PrepareForClean:
  47. 2>  Deleting file "x64\Debug\CTK\CTK.tlog\CTK.lastbuildstate".
  48. 2>Target ResolveProjectReferences:
  49. 2>Target InitializeBuildStatus:
  50. 2>  Touching "x64\Debug\CTK\CTK.tlog\unsuccessfulbuild".
  51. 2>Target CustomBuild:
  52. 2>  "The build of 'G:\programming\cplusplus\CTK\build\CMakeFiles\7bb6d10cf9d22863946eab39249063a3\CTK-download.rule' depends on 'G:\PROGRAMMING\CPLUSPLUS\CTK\BUILD\CTK-PREFIX\SRC\CTK-STAMP\DEBUG\CTK-MKDIR' which is produced by the build of 'G:\programming\cplusplus\CTK\build\CMakeFiles\7bb6d10cf9d22863946eab39249063a3\CTK-mkdir.rule'. The items cannot be built in parallel."
  53. 2>  "The build of 'G:\programming\cplusplus\CTK\build\CMakeFiles\7bb6d10cf9d22863946eab39249063a3\CTK-update.rule' depends on 'G:\PROGRAMMING\CPLUSPLUS\CTK\BUILD\CTK-PREFIX\SRC\CTK-STAMP\DEBUG\CTK-DOWNLOAD' which is produced by the build of 'G:\programming\cplusplus\CTK\build\CMakeFiles\7bb6d10cf9d22863946eab39249063a3\CTK-download.rule'. The items cannot be built in parallel."
  54. 2>  "The build of 'G:\programming\cplusplus\CTK\build\CMakeFiles\7bb6d10cf9d22863946eab39249063a3\CTK-patch.rule' depends on 'G:\PROGRAMMING\CPLUSPLUS\CTK\BUILD\CTK-PREFIX\SRC\CTK-STAMP\DEBUG\CTK-UPDATE' which is produced by the build of 'G:\programming\cplusplus\CTK\build\CMakeFiles\7bb6d10cf9d22863946eab39249063a3\CTK-update.rule'. The items cannot be built in parallel."
  55. 2>  "The build of 'G:\programming\cplusplus\CTK\build\CMakeFiles\7bb6d10cf9d22863946eab39249063a3\CTK-configure.rule' depends on 'G:\PROGRAMMING\CPLUSPLUS\CTK\BUILD\CTK-PREFIX\SRC\CTK-STAMP\DEBUG\CTK-PATCH' which is produced by the build of 'G:\programming\cplusplus\CTK\build\CMakeFiles\7bb6d10cf9d22863946eab39249063a3\CTK-patch.rule'. The items cannot be built in parallel."
  56. 2>  "The build of 'G:\programming\cplusplus\CTK\build\CMakeFiles\7bb6d10cf9d22863946eab39249063a3\CTK-build.rule' depends on 'G:\PROGRAMMING\CPLUSPLUS\CTK\BUILD\CTK-PREFIX\SRC\CTK-STAMP\DEBUG\CTK-CONFIGURE' which is produced by the build of 'G:\programming\cplusplus\CTK\build\CMakeFiles\7bb6d10cf9d22863946eab39249063a3\CTK-configure.rule'. The items cannot be built in parallel."
  57. 2>  "The build of 'G:\programming\cplusplus\CTK\build\CMakeFiles\7bb6d10cf9d22863946eab39249063a3\CTK-install.rule' depends on 'G:\PROGRAMMING\CPLUSPLUS\CTK\BUILD\CTK-PREFIX\SRC\CTK-STAMP\DEBUG\CTK-BUILD' which is produced by the build of 'G:\programming\cplusplus\CTK\build\CMakeFiles\7bb6d10cf9d22863946eab39249063a3\CTK-build.rule'. The items cannot be built in parallel."
  58. 2>  "The build of 'G:\programming\cplusplus\CTK\build\CMakeFiles\7bb6d10cf9d22863946eab39249063a3\CTK-forceconfigure.rule' depends on 'G:\PROGRAMMING\CPLUSPLUS\CTK\BUILD\CTK-PREFIX\SRC\CTK-STAMP\DEBUG\CTK-BUILD' which is produced by the build of 'G:\programming\cplusplus\CTK\build\CMakeFiles\7bb6d10cf9d22863946eab39249063a3\CTK-build.rule'. The items cannot be built in parallel."
  59. 2>  "The build of 'G:\programming\cplusplus\CTK\build\CMakeFiles\e3b53e276c6c7ab93bdcf23146530f56\CTK-complete.rule' depends on 'G:\PROGRAMMING\CPLUSPLUS\CTK\BUILD\CTK-PREFIX\SRC\CTK-STAMP\DEBUG\CTK-INSTALL' which is produced by the build of 'G:\programming\cplusplus\CTK\build\CMakeFiles\7bb6d10cf9d22863946eab39249063a3\CTK-install.rule'. The items cannot be built in parallel."
  60. 2>  "The build of 'G:\programming\cplusplus\CTK\build\CMakeFiles\36161454dc3a55cd79af0104e2c07415\CTK.rule' depends on 'G:\PROGRAMMING\CPLUSPLUS\CTK\BUILD\CMAKEFILES\DEBUG\CTK-COMPLETE' which is produced by the build of 'G:\programming\cplusplus\CTK\build\CMakeFiles\e3b53e276c6c7ab93bdcf23146530f56\CTK-complete.rule'. The items cannot be built in parallel."
  61. 2>  Creating directories for 'CTK'
  62. 2>  No download step for 'CTK'
  63. 2>  No update step for 'CTK'
  64. 2>  No patch step for 'CTK'
  65. 2>  Performing configure step for 'CTK'
  66. 2>  loading initial cache file G:/programming/cplusplus/CTK/build/CTK-prefix/tmp/CTK-cache-Debug.cmake
  67. 2>  -- Selecting Windows SDK version 10.0.18362.0 to target Windows 10.0.19041.
  68. 2>  ITK_VERSION:             5.2.0
  69. 2>  -- Generated: G:/programming/cplusplus/CTK/build/CTK-build/DGraphInput-alldep.txt
  70. 2>  -- Generated: G:/programming/cplusplus/CTK/build/CTK-build/DGraphInput-alldep-withext.txt
  71. 2>  -- Generated: G:/programming/cplusplus/CTK/build/CTK-build/DGraphInput.txt
  72. 2>  -- SuperBuild - First pass
  73. 2>  -- SuperBuild - First pass - done
  74. 2>  -- CTKCore: BFD support disabled
  75. 2>  NAME OF TARGET :  itksys
  76. 2>  NAME OF TARGET :  itksys
  77. 2>  NAME OF MODULE :  ITKKWSys
  78. 2>  ITKKWSys-targets-build :  G:/programming/cplusplus/CTK//Modules/Targets/ITKKWSysTargets.cmake
  79. 2>  NAME OF TARGET :  itkvcl
  80. 2>  NAME OF TARGET :  itkvcl
  81. 2>  NAME OF MODULE :  ITKVNL
  82. 2>  ITKVNL-targets-build :  G:/programming/cplusplus/CTK//Modules/Targets/ITKVNLTargets.cmake
  83. 2>  NAME OF TARGET :  itkv3p_netlib
  84. 2>  NAME OF TARGET :  itkv3p_netlib
  85. 2>  NAME OF MODULE :  ITKVNL
  86. 2>  ITKVNL-targets-build :  G:/programming/cplusplus/CTK//Modules/Targets/ITKVNLTargets.cmake
  87. 2>  NAME OF TARGET :  itktestlib
  88. 2>  NAME OF TARGET :  itktestlib
  89. 2>  NAME OF MODULE :  ITKVNL
  90. 2>  ITKVNL-targets-build :  G:/programming/cplusplus/CTK//Modules/Targets/ITKVNLTargets.cmake
  91. 2>  NAME OF TARGET :  itkvnl
  92. 2>  NAME OF TARGET :  itkvnl
  93. 2>  NAME OF MODULE :  ITKVNL
  94. 2>  ITKVNL-targets-build :  G:/programming/cplusplus/CTK//Modules/Targets/ITKVNLTargets.cmake
  95. 2>  NAME OF TARGET :  itkvnl_algo
  96. 2>  NAME OF TARGET :  itkvnl_algo
  97. 2>  NAME OF MODULE :  ITKVNL
  98. 2>  ITKVNL-targets-build :  G:/programming/cplusplus/CTK//Modules/Targets/ITKVNLTargets.cmake
  99. 2>  -- Including CMake built-in module CMakePackageConfigHelpers
  100. 2>  -- Including CMake built-in module CMakePackageConfigHelpers - ok
  101. 2>  ITK_INSTALL_PACKAGE_DIR :                  lib/cmake/itk-.
  102. 2>  -- Configuring done
  103. 2>  -- Generating done
  104. 2>  -- Build files have been written to: G:/programming/cplusplus/CTK/build/CTK-build
  105. 2>  Performing build step for 'CTK'
  106. 2>  Microsoft (R) Build Engine version 16.8.3+39993bd9d for .NET Framework
  107. 2>  Copyright (C) Microsoft Corporation. All rights reserved.
  108. 2>
  109. 2>    Checking Build System
  110. 2>    Building Custom Rule G:/programming/cplusplus/CTK/External/KWSys/src/KWSys/CMakeLists.txt
  111. 2>    itksys.vcxproj -> G:\programming\cplusplus\CTK\build\CTK-build\bin\Debug\itksys-5.2.lib
  112. 2>    itkvcl.vcxproj -> G:\programming\cplusplus\CTK\build\CTK-build\bin\Debug\itkvcl-5.2.lib
  113. 2>    itktestlib.vcxproj -> G:\programming\cplusplus\CTK\build\CTK-build\bin\Debug\itktestlib-5.2.lib
  114. 2>    itkv3p_netlib.vcxproj -> G:\programming\cplusplus\CTK\build\CTK-build\bin\Debug\itkv3p_netlib-5.2.lib
  115. 2>    vnl_c_na_vector+double-.cxx
  116. 2>    vnl_c_na_vector+float-.cxx
  117. 2>    vnl_c_vector+char-.cxx
  118. 2>    vnl_c_vector+double-.cxx
  119. 2>    vnl_c_vector+double_complex-.cxx
  120. 2>    vnl_c_vector+float-.cxx
  121. 2>    vnl_c_vector+float_complex-.cxx
  122. 2>    vnl_c_vector+int-.cxx
  123. 2>    vnl_c_vector+long-.cxx
  124. 2>    vnl_c_vector+long_double-.cxx
  125. 2>    vnl_c_vector+long_double_complex-.cxx
  126. 2>    vnl_c_vector+longlong-.cxx
  127. 2>    vnl_c_vector+schar-.cxx
  128. 2>    vnl_c_vector+sshort-.cxx
  129. 2>    vnl_c_vector+uchar-.cxx
  130. 2>    vnl_c_vector+uint-.cxx
  131. 2>    vnl_c_vector+ulong-.cxx
  132. 2>    vnl_c_vector+ulonglong-.cxx
  133. 2>    vnl_c_vector+ushort-.cxx
  134. 2>    vnl_c_vector+vnl_bignum-.cxx
  135. 2>    vnl_c_vector+vnl_rational-.cxx
  136. 2>    vnl_complex_ops+double-.cxx
  137. 2>    vnl_complex_ops+float-.cxx
  138. 2>    vnl_complex_ops+long_double-.cxx
  139. 2>    vnl_det+complex+double--.cxx
  140. 2>    vnl_det+complex+float--.cxx
  141. 2>    vnl_det+complex+long_double--.cxx
  142. 2>    vnl_det+double-.cxx
  143. 2>    vnl_det+float-.cxx
  144. 2>    vnl_det+long_double-.cxx
  145. 2>    vnl_det+vnl_bignum-.cxx
  146. 2>    vnl_det+vnl_rational-.cxx
  147. 2>    vnl_diag_matrix+complex+double--.cxx
  148. 2>    vnl_diag_matrix+complex+float--.cxx
  149. 2>    vnl_diag_matrix+double-.cxx
  150. 2>    vnl_diag_matrix+float-.cxx
  151. 2>    vnl_diag_matrix+int-.cxx
  152. 2>    vnl_diag_matrix+long_double-.cxx
  153. 2>    vnl_diag_matrix+vnl_bignum-.cxx
  154. 2>    vnl_diag_matrix+vnl_rational-.cxx
  155. 2>    vnl_diag_matrix_fixed+complex_double.allsizes-.cxx
  156. 2>    vnl_diag_matrix_fixed+complex_float.allsizes-.cxx
  157. 2>    vnl_diag_matrix_fixed+double.allsizes-.cxx
  158. 2>    vnl_diag_matrix_fixed+float.allsizes-.cxx
  159. 2>    vnl_file_matrix+double-.cxx
  160. 2>    vnl_file_matrix+float-.cxx
  161. 2>    vnl_file_matrix+long_double-.cxx
  162. 2>    vnl_file_matrix+vnl_rational-.cxx
  163. 2>    vnl_file_vector+double-.cxx
  164. 2>    vnl_fortran_copy+complex+double--.cxx
  165. 2>    vnl_fortran_copy+complex+float--.cxx
  166. 2>    vnl_fortran_copy+complex+long_double--.cxx
  167. 2>    vnl_fortran_copy+double-.cxx
  168. 2>    vnl_fortran_copy+float-.cxx
  169. 2>    vnl_fortran_copy+long_double-.cxx
  170. 2>    vnl_fortran_copy_fixed+double.allsizes-.cxx
  171. 2>    vnl_fortran_copy_fixed+float.allsizes-.cxx
  172. 2>    vnl_hungarian_algorithm+double-.cxx
  173. 2>    vnl_hungarian_algorithm+int-.cxx
  174. 2>    vnl_matlab_print+complex+double--.cxx
  175. 2>    vnl_matlab_print+complex+float--.cxx
  176. 2>    vnl_matlab_print+complex+long_double--.cxx
  177. 2>    vnl_matlab_print+double-.cxx
  178. 2>    vnl_matlab_print+float-.cxx
  179. 2>    vnl_matlab_print+int-.cxx
  180. 2>    vnl_matlab_print+long_double-.cxx
  181. 2>    vnl_matlab_print+uint-.cxx
  182. 2>    vnl_matrix+char-.cxx
  183. 2>    vnl_matrix+complex+double--.cxx
  184. 2>    vnl_matrix+complex+float--.cxx
  185. 2>    vnl_matrix+complex+long_double--.cxx
  186. 2>    vnl_matrix+double-.cxx
  187. 2>    vnl_matrix+float-.cxx
  188. 2>    vnl_matrix+int-.cxx
  189. 2>    vnl_matrix+long-.cxx
  190. 2>    vnl_matrix+long_double-.cxx
  191. 2>    vnl_matrix+longlong-.cxx
  192. 2>    vnl_matrix+schar-.cxx
  193. 2>    vnl_matrix+sshort-.cxx
  194. 2>    vnl_matrix+uchar-.cxx
  195. 2>    vnl_matrix+uint-.cxx
  196. 2>    vnl_matrix+ulong-.cxx
  197. 2>    vnl_matrix+ulonglong-.cxx
  198. 2>    vnl_matrix+ushort-.cxx
  199. 2>    vnl_matrix+vnl_bignum-.cxx
  200. 2>    vnl_matrix+vnl_rational-.cxx
  201. 2>    vnl_matrix_exp+vnl_matrix+double--.cxx
  202. 2>    vnl_matrix_exp+vnl_matrix_fixed+double.allsizes-.cxx
  203. 2>    vnl_matrix_fixed+complex_double.allsizes-.cxx
  204. 2>    vnl_matrix_fixed+complex_float.allsizes-.cxx
  205. 2>    vnl_matrix_fixed+double.allsizes-.cxx
  206. 2>    vnl_matrix_fixed+float.allsizes-.cxx
  207. 2>    vnl_matrix_fixed+int.allsizes-.cxx
  208. 2>    vnl_matrix_fixed+vnl_bignum.allsizes-.cxx
  209. 2>    vnl_matrix_fixed+vnl_rational.allsizes-.cxx
  210. 2>    vnl_matrix_fixed_ref+double.allsizes-.cxx
  211. 2>    vnl_matrix_fixed_ref+float.allsizes-.cxx
  212. 2>    vnl_matrix_ref+double-.cxx
  213. 2>    vnl_matrix_ref+float-.cxx
  214. 2>    vnl_matrix_ref+vnl_bignum-.cxx
  215. 2>    vnl_matrix_ref+vnl_rational-.cxx
  216. 2>    vnl_quaternion+double-.cxx
  217. 2>    vnl_quaternion+float-.cxx
  218. 2>    vnl_quaternion+vnl_rational-.cxx
  219. 2>    vnl_rank+double-.cxx
  220. 2>    vnl_rank+int-.cxx
  221. 2>    vnl_sparse_matrix+complex+double--.cxx
  222. 2>    vnl_sparse_matrix+complex+float--.cxx
  223. 2>    vnl_sparse_matrix+double-.cxx
  224. 2>    vnl_sparse_matrix+float-.cxx
  225. 2>    vnl_sparse_matrix+int-.cxx
  226. 2>    vnl_sparse_matrix+vnl_bignum-.cxx
  227. 2>    vnl_sparse_matrix+vnl_rational-.cxx
  228. 2>    vnl_sym_matrix+complex+double--.cxx
  229. 2>    vnl_sym_matrix+complex+float--.cxx
  230. 2>    vnl_sym_matrix+complex+long_double--.cxx
  231. 2>    vnl_sym_matrix+double-.cxx
  232. 2>    vnl_sym_matrix+float-.cxx
  233. 2>    vnl_sym_matrix+int-.cxx
  234. 2>    vnl_unary_function+double.vnl_vector+double--.cxx
  235. 2>    vnl_vector+char-.cxx
  236. 2>    vnl_vector+complex+double--.cxx
  237. 2>    vnl_vector+complex+float--.cxx
  238. 2>    vnl_vector+complex+long_double--.cxx
  239. 2>    vnl_vector+double-.cxx
  240. 2>    vnl_vector+float-.cxx
  241. 2>    vnl_vector+int-.cxx
  242. 2>    vnl_vector+long-.cxx
  243. 2>    vnl_vector+long_double-.cxx
  244. 2>    vnl_vector+longlong-.cxx
  245. 2>    vnl_vector+schar-.cxx
  246. 2>    vnl_vector+sshort-.cxx
  247. 2>    vnl_vector+uchar-.cxx
  248. 2>    vnl_vector+uint-.cxx
  249. 2>    vnl_vector+ulong-.cxx
  250. 2>    vnl_vector+ulonglong-.cxx
  251. 2>    vnl_vector+ushort-.cxx
  252. 2>    vnl_vector+vnl_bignum-.cxx
  253. 2>    vnl_vector+vnl_rational-.cxx
  254. 2>    vnl_vector_fixed+complex_double.allsizes-.cxx
  255. 2>    vnl_vector_fixed+complex_float.allsizes-.cxx
  256. 2>    vnl_vector_fixed+double.allsizes-.cxx
  257. 2>    vnl_vector_fixed+float.allsizes-.cxx
  258. 2>    vnl_vector_fixed+int.allsizes-.cxx
  259. 2>    vnl_vector_fixed+slonglong.allsizes-.cxx
  260. 2>    vnl_vector_fixed+sshort.allsizes-.cxx
  261. 2>    vnl_vector_fixed+uchar.allsizes-.cxx
  262. 2>    vnl_vector_fixed+uint.allsizes-.cxx
  263. 2>    vnl_vector_fixed+ulonglong.allsizes-.cxx
  264. 2>    vnl_vector_fixed+ushort.allsizes-.cxx
  265. 2>    vnl_vector_fixed+vnl_bignum.allsizes-.cxx
  266. 2>    vnl_vector_fixed+vnl_rational.allsizes-.cxx
  267. 2>    vnl_vector_fixed_ref+double.allsizes-.cxx
  268. 2>    vnl_vector_fixed_ref+float.allsizes-.cxx
  269. 2>    vnl_vector_ref+alltypes.cxx
  270. 2>    vnl_bessel.cxx
  271. 2>    vnl_bignum.cxx
  272. 2>    vnl_bignum_traits.cxx
  273. 2>    vnl_copy.cxx
  274. 2>    vnl_cost_function.cxx
  275. 2>    vnl_decnum_traits.cxx
  276. 2>    vnl_drand48.cpp
  277. 2>    vnl_erf.cxx
  278. 2>    vnl_fastops.cxx
  279. 2>    vnl_int_matrix.cxx
  280. 2>    vnl_least_squares_cost_function.cxx
  281. 2>    vnl_least_squares_function.cxx
  282. 2>    vnl_linear_system.cxx
  283. 2>    vnl_math.cxx
  284. 2>    vnl_matlab_filewrite.cxx
  285. 2>    vnl_matlab_read.cxx
  286. 2>    vnl_matlab_write.cxx
  287. 2>    vnl_matops.cxx
  288. 2>    vnl_na.cxx
  289. 2>    vnl_nonlinear_minimizer.cxx
  290. 2>    vnl_numeric_traits.cxx
  291. 2>    vnl_rational.cxx
  292. 2>    vnl_rational_traits.cxx
  293. 2>    vnl_real_npolynomial.cxx
  294. 2>    vnl_real_polynomial.cxx
  295. 2>    vnl_rotation_matrix.cxx
  296. 2>    vnl_sample.cxx
  297. 2>    vnl_sparse_lst_sqr_function.cxx
  298. 2>    vnl_sparse_matrix_linear_system.cxx
  299. 2>    itkvnl.vcxproj -> G:\programming\cplusplus\CTK\build\CTK-build\bin\Debug\itkvnl-5.2.lib
  300. 2>    vnl_adjugate+double-.cxx
  301. 2>    vnl_adjugate+float-.cxx
  302. 2>    vnl_adjugate+int-.cxx
  303. 2>    vnl_convolve+double.double-.cxx
  304. 2>    vnl_convolve+float.float-.cxx
  305. 2>    vnl_convolve+int.double-.cxx
  306. 2>    vnl_convolve+int.float-.cxx
  307. 2>    vnl_convolve+int.int-.cxx
  308. 2>    vnl_determinant+double-.cxx
  309. 2>    vnl_determinant+float-.cxx
  310. 2>    vnl_determinant+int-.cxx
  311. 2>    vnl_determinant+vcl_complex+double--.cxx
  312. 2>    vnl_determinant+vcl_complex+float--.cxx
  313. 2>    vnl_fft_1d+double-.cxx
  314. 2>    vnl_fft_1d+float-.cxx
  315. 2>    vnl_fft_2d+double-.cxx
  316. 2>    vnl_fft_2d+float-.cxx
  317. 2>    vnl_matrix_inverse+double-.cxx
  318. 2>    vnl_matrix_inverse+float-.cxx
  319. 2>    vnl_orthogonal_complement+double-.cxx
  320. 2>    vnl_orthogonal_complement+float-.cxx
  321. 2>    vnl_orthogonal_complement+vcl_complex+double--.cxx
  322. 2>    vnl_orthogonal_complement+vcl_complex+float--.cxx
  323. 2>    vnl_qr+double-.cxx
  324. 2>    vnl_qr+float-.cxx
  325. 2>    vnl_qr+vcl_complex+double--.cxx
  326. 2>    vnl_qr+vcl_complex+float--.cxx
  327. 2>    vnl_scatter_3x3+double-.cxx
  328. 2>    vnl_scatter_3x3+float-.cxx
  329. 2>    vnl_svd+double-.cxx
  330. 2>    vnl_svd+float-.cxx
  331. 2>    vnl_svd+vcl_complex+double--.cxx
  332. 2>    vnl_svd+vcl_complex+float--.cxx
  333. 2>    vnl_svd_economy+double-.cxx
  334. 2>    vnl_svd_economy+float-.cxx
  335. 2>    vnl_svd_economy+vcl_complex+double--.cxx
  336. 2>    vnl_svd_economy+vcl_complex+float--.cxx
  337. 2>    vnl_svd_fixed+double.allsizes-.cxx
  338. 2>    vnl_svd_fixed+float.allsizes-.cxx
  339. 2>    vnl_symmetric_eigensystem+double-.cxx
  340. 2>    vnl_symmetric_eigensystem+float-.cxx
  341. 2>    vnl_amoeba.cxx
  342. 2>    vnl_bracket_minimum.cxx
  343. 2>    vnl_brent.cxx
  344. 2>    vnl_brent_minimizer.cxx
  345. 2>    vnl_cholesky.cxx
  346. 2>    vnl_complex_eigensystem.cxx
  347. 2>    vnl_complex_generalized_schur.cxx
  348. 2>    vnl_conjugate_gradient.cxx
  349. 2>    vnl_cpoly_roots.cxx
  350. 2>    vnl_determinant.cxx
  351. 2>    vnl_discrete_diff.cxx
  352. 2>    vnl_gaussian_kernel_1d.cxx
  353. 2>    vnl_generalized_eigensystem.cxx
  354. 2>    vnl_generalized_schur.cxx
  355. 2>    vnl_lbfgs.cxx
  356. 2>    vnl_lbfgsb.cxx
  357. 2>    vnl_ldl_cholesky.cxx
  358. 2>    vnl_levenberg_marquardt.cxx
  359. 2>    vnl_lsqr.cxx
  360. 2>    vnl_powell.cxx
  361. 2>    vnl_real_eigensystem.cxx
  362. 2>    vnl_rnpoly_solve.cxx
  363. 2>    vnl_rpoly_roots.cxx
  364. 2>    vnl_solve_qp.cxx
  365. 2>    vnl_sparse_lm.cxx
  366. 2>    vnl_sparse_lu.cxx
  367. 2>    vnl_sparse_symmetric_eigensystem.cxx
  368. 2>    itkvnl_algo.vcxproj -> G:\programming\cplusplus\CTK\build\CTK-build\bin\Debug\itkvnl_algo-5.2.lib
  369. 2>    CTKCore.vcxproj -> G:\programming\cplusplus\CTK\build\CTK-build\bin\Debug\CTKCore.dll
  370. 2>    CTKPluginFramework.vcxproj -> G:\programming\cplusplus\CTK\build\CTK-build\bin\Debug\CTKPluginFramework.dll
  371. 2>    mbilog.cpp
  372. 2>    mbilogLogMessage.cpp
  373. 2>    mbilogBackendCout.cpp
  374. 2>    mbilogBackendBase.cpp
  375. 2>    mbilogTextBackendBase.cpp
  376. 2>  G:\programming\cplusplus\CTK\Libs\mbilog\mbilogTextBackendBase.cpp(401,26): warning C4996: 'ctime': This function or variable may be unsafe. Consider using ctime_s instead. To disable deprecation, use _CRT_SECURE_NO_WARNINGS. See online help for details. [G:\programming\cplusplus\CTK\build\CTK-build\Libs\mbilog\CTKmbilog.vcxproj]
  377. 2>    mitkException.cpp
  378. 2>  G:\programming\cplusplus\CTK\Libs\mbilog\mitkException.cpp(43,26): error C2247: 'itk::ExceptionObject::GetDescription' not accessible because 'mitk::Exception' uses 'private' to inherit from 'itk::ExceptionObject' [G:\programming\cplusplus\CTK\build\CTK-build\Libs\mbilog\CTKmbilog.vcxproj]
  379. 2>  G:\programming\cplusplus\CTK\Libs\mbilog\itkExceptionObject.h(111): message : see declaration of 'itk::ExceptionObject::GetDescription' [G:\programming\cplusplus\CTK\build\CTK-build\Libs\mbilog\CTKmbilog.vcxproj]
  380. 2>  G:\programming\cplusplus\CTK\Libs\mbilog\mitkException.h(48): message : see declaration of 'mitk::Exception' [G:\programming\cplusplus\CTK\build\CTK-build\Libs\mbilog\CTKmbilog.vcxproj]
  381. 2>  G:\programming\cplusplus\CTK\Libs\mbilog\itkExceptionObject.h(49): message : see declaration of 'itk::ExceptionObject' [G:\programming\cplusplus\CTK\build\CTK-build\Libs\mbilog\CTKmbilog.vcxproj]
  382. 2>    mitkLog.cpp
  383. 2>  G:\programming\cplusplus\CTK\Libs\mbilog\mitkExceptionMacros.h(20,1): warning C4005: 'ITK_LOCATION': macro redefinition [G:\programming\cplusplus\CTK\build\CTK-build\Libs\mbilog\CTKmbilog.vcxproj]
  384. 2>  G:\programming\cplusplus\CTK\Libs\mbilog\itkMacro.h(479): message : see previous definition of 'ITK_LOCATION' [G:\programming\cplusplus\CTK\build\CTK-build\Libs\mbilog\CTKmbilog.vcxproj]
  385. 2>    itkSimpleFastMutexLock.cxx
  386. 2>    itkExceptionObject.cxx
  387. 2>    itkLightObject.cxx
  388. 2>    itkSingleton.cxx
  389. 2>    itkObject.cxx
  390. 2>    itkEventObject.cxx
  391. 2>    itkCommand.cxx
  392. 2>    itkIndent.cxx
  393. 2>    itkMetaDataDictionary.cxx
  394. 2>    itkMetaDataObjectBase.cxx
  395. 2>    itkNumericTraits.cxx
  396. 2>    itkThreadPool.cxx
  397. 2>  G:\programming\cplusplus\CTK\Libs\mbilog\itkThreadPool.cxx(21,10): fatal error C1083: Cannot open include file: 'itksys/SystemTools.hxx': No such file or directory [G:\programming\cplusplus\CTK\build\CTK-build\Libs\mbilog\CTKmbilog.vcxproj]
  398. 2>    itkMultiThreaderBase.cxx
  399. 2>  G:\programming\cplusplus\CTK\Libs\mbilog\itkVector.h(23,10): fatal error C1083: Cannot open include file: 'vnl/vnl_vector_ref.h': No such file or directory [G:\programming\cplusplus\CTK\build\CTK-build\Libs\mbilog\CTKmbilog.vcxproj]
  400. 2>    Generating Code...
  401. 2>    Compiling...
  402. 2>    itkOutputWindow.cxx
  403. 2>  G:\programming\cplusplus\CTK\Libs\mbilog\itkOutputWindow.cxx(83,3): error C3861: 'GetPimplGlobalsPointer': identifier not found [G:\programming\cplusplus\CTK\build\CTK-build\Libs\mbilog\CTKmbilog.vcxproj]
  404. 2>  G:\programming\cplusplus\CTK\Libs\mbilog\itkOutputWindow.cxx(83,3): error C3535: cannot deduce type for 'auto *' from 'unknown-type' [G:\programming\cplusplus\CTK\build\CTK-build\Libs\mbilog\CTKmbilog.vcxproj]
  405. 2>  G:\programming\cplusplus\CTK\Libs\mbilog\itkOutputWindow.cxx(86,65): error C2065: 'm_PimplGlobals': undeclared identifier [G:\programming\cplusplus\CTK\build\CTK-build\Libs\mbilog\CTKmbilog.vcxproj]
  406. 2>  G:\programming\cplusplus\CTK\Libs\mbilog\itkOutputWindow.cxx(116,3): error C3861: 'GetPimplGlobalsPointer': identifier not found [G:\programming\cplusplus\CTK\build\CTK-build\Libs\mbilog\CTKmbilog.vcxproj]
  407. 2>  G:\programming\cplusplus\CTK\Libs\mbilog\itkOutputWindow.cxx(116,3): error C3535: cannot deduce type for 'auto *' from 'unknown-type' [G:\programming\cplusplus\CTK\build\CTK-build\Libs\mbilog\CTKmbilog.vcxproj]
  408. 2>  G:\programming\cplusplus\CTK\Libs\mbilog\itkOutputWindow.cxx(117,8): error C2065: 'm_PimplGlobals': undeclared identifier [G:\programming\cplusplus\CTK\build\CTK-build\Libs\mbilog\CTKmbilog.vcxproj]
  409. 2>  G:\programming\cplusplus\CTK\Libs\mbilog\itkOutputWindow.cxx(120,5): error C2065: 'm_PimplGlobals': undeclared identifier [G:\programming\cplusplus\CTK\build\CTK-build\Libs\mbilog\CTKmbilog.vcxproj]
  410. 2>  G:\programming\cplusplus\CTK\Libs\mbilog\itkOutputWindow.cxx(122,10): error C2065: 'm_PimplGlobals': undeclared identifier [G:\programming\cplusplus\CTK\build\CTK-build\Libs\mbilog\CTKmbilog.vcxproj]
  411. 2>  G:\programming\cplusplus\CTK\Libs\mbilog\itkOutputWindow.cxx(124,7): error C2065: 'm_PimplGlobals': undeclared identifier [G:\programming\cplusplus\CTK\build\CTK-build\Libs\mbilog\CTKmbilog.vcxproj]
  412. 2>  G:\programming\cplusplus\CTK\Libs\mbilog\itkOutputWindow.cxx(126,7): error C2065: 'm_PimplGlobals': undeclared identifier [G:\programming\cplusplus\CTK\build\CTK-build\Libs\mbilog\CTKmbilog.vcxproj]
  413. 2>  G:\programming\cplusplus\CTK\Libs\mbilog\itkOutputWindow.cxx(132,10): error C2065: 'm_PimplGlobals': undeclared identifier [G:\programming\cplusplus\CTK\build\CTK-build\Libs\mbilog\CTKmbilog.vcxproj]
  414. 2>  G:\programming\cplusplus\CTK\Libs\mbilog\itkOutputWindow.cxx(135,1): error C2039: 'GetPimplGlobalsPointer': is not a member of 'itk::OutputWindow' [G:\programming\cplusplus\CTK\build\CTK-build\Libs\mbilog\CTKmbilog.vcxproj]
  415. 2>  G:\programming\cplusplus\CTK\Libs\mbilog\itkOutputWindow.h(44): message : see declaration of 'itk::OutputWindow' [G:\programming\cplusplus\CTK\build\CTK-build\Libs\mbilog\CTKmbilog.vcxproj]
  416. 2>  G:\programming\cplusplus\CTK\Libs\mbilog\itkOutputWindow.cxx(135,1): error C2065: 'm_PimplGlobals': undeclared identifier [G:\programming\cplusplus\CTK\build\CTK-build\Libs\mbilog\CTKmbilog.vcxproj]
  417. 2>  G:\programming\cplusplus\CTK\Libs\mbilog\itkOutputWindow.cxx(135,1): error C2541: 'delete': cannot delete objects that are not pointers [G:\programming\cplusplus\CTK\build\CTK-build\Libs\mbilog\CTKmbilog.vcxproj]
  418. 2>  G:\programming\cplusplus\CTK\Libs\mbilog\itkOutputWindow.cxx(137,37): error C2039: 'm_PimplGlobals': is not a member of 'itk::OutputWindow' [G:\programming\cplusplus\CTK\build\CTK-build\Libs\mbilog\CTKmbilog.vcxproj]
  419. 2>  G:\programming\cplusplus\CTK\Libs\mbilog\itkOutputWindow.h(44): message : see declaration of 'itk::OutputWindow' [G:\programming\cplusplus\CTK\build\CTK-build\Libs\mbilog\CTKmbilog.vcxproj]
  420. 2>    itkRegion.cxx
  421. 2>    itkMath.cxx
  422. 2>  G:\programming\cplusplus\CTK\Libs\mbilog\itkMath.h(34,10): fatal error C1083: Cannot open include file: 'vnl/vnl_math.h': No such file or directory [G:\programming\cplusplus\CTK\build\CTK-build\Libs\mbilog\CTKmbilog.vcxproj]
  423. 2>    itkNumericTraitsPointPixel.cxx
  424. 2>  G:\programming\cplusplus\CTK\Libs\mbilog\itkVector.h(23,10): fatal error C1083: Cannot open include file: 'vnl/vnl_vector_ref.h': No such file or directory [G:\programming\cplusplus\CTK\build\CTK-build\Libs\mbilog\CTKmbilog.vcxproj]
  425. 2>    itkNumericTraitsFixedArrayPixel.cxx
  426. 2>    itkVector.cxx
  427. 2>  G:\programming\cplusplus\CTK\Libs\mbilog\itkVector.h(23,10): fatal error C1083: Cannot open include file: 'vnl/vnl_vector_ref.h': No such file or directory [G:\programming\cplusplus\CTK\build\CTK-build\Libs\mbilog\CTKmbilog.vcxproj]
  428. 2>    itkVersion.cxx
  429. 2>    itkWin32OutputWindow.cxx
  430. 2>  G:\programming\cplusplus\CTK\Libs\mbilog\itkWin32OutputWindow.cxx(112,7): warning C4996: 'strncpy': This function or variable may be unsafe. Consider using strncpy_s instead. To disable deprecation, use _CRT_SECURE_NO_WARNINGS. See online help for details. [G:\programming\cplusplus\CTK\build\CTK-build\Libs\mbilog\CTKmbilog.vcxproj]
  431. 2>    itkPoolMultiThreader.cxx
  432. 2>  G:\programming\cplusplus\CTK\Libs\mbilog\itkVector.h(23,10): fatal error C1083: Cannot open include file: 'vnl/vnl_vector_ref.h': No such file or directory [G:\programming\cplusplus\CTK\build\CTK-build\Libs\mbilog\CTKmbilog.vcxproj]
  433. 2>    moc_mbilog.cpp
  434. 2>    moc_mbilogLoggingTypes.cpp
  435. 2>    moc_mbilogTextDictionary.cpp
  436. 2>    moc_mbilogLogMessage.cpp
  437. 2>    moc_mbilogBackendBase.cpp
  438. 2>    moc_mbilogTextBackendBase.cpp
  439. 2>    moc_mbilogBackendCout.cpp
  440. 2>    moc_mitkLog.cpp
  441. 2>    moc_mitkLogMacros.cpp
  442. 2>    moc_mitkException.cpp
  443. 2>    moc_mitkExceptionMacros.cpp
  444. 2>    Generating Code...
  445. 2>    Compiling...
  446. 2>    moc_itkMacro.cpp
  447. 2>    moc_itkExceptionObject.cpp
  448. 2>    moc_itkSmartPointer.cpp
  449. 2>    moc_itkWin32Header.cpp
  450. 2>    moc_itkLightObject.cpp
  451. 2>    moc_itkSingleton.cpp
  452. 2>    moc_itkSingletonMacro.cpp
  453. 2>    moc_itkIntTypes.cpp
  454. 2>    moc_itkObjectFactory.cpp
  455. 2>    moc_itkObjectFactoryBase.cpp
  456. 2>    moc_itkCreateObjectFunction.cpp
  457. 2>    moc_itkObject.cpp
  458. 2>    moc_itkEventObject.cpp
  459. 2>    moc_itkCommand.cpp
  460. 2>    moc_itkIndent.cpp
  461. 2>    moc_itkMetaDataDictionary.cpp
  462. 2>    moc_itkMetaDataObjectBase.cpp
  463. 2>    moc_itkCommonEnums.cpp
  464. 2>    moc_itkSimpleFastMutexLock.cpp
  465. 2>    moc_itkWindows.cpp
  466. 2>    Generating Code...
  467. 2>    Compiling...
  468. 2>    moc_itkOutputWindow.cpp
  469. 2>    moc_itkThreadSupport.cpp
  470. 2>    moc_itkPoolMultiThreader.cpp
  471. 2>    moc_itkMultiThreaderBase.cpp
  472. 2>    moc_itkThreadPool.cpp
  473. 2>    moc_itkNumericTraits.cpp
  474. 2>    moc_itkFixedArray.cpp
  475. 2>    moc_itkNumericTraitsFixedArrayPixel.cpp
  476. 2>    moc_itkPixelTraits.cpp
  477. 2>    moc_itkVector.cpp
  478. 2>    moc_itkRegion.cpp
  479. 2>    moc_itkImageRegion.cpp
  480. 2>    moc_itkConceptChecking.cpp
  481. 2>    moc_itkMath.cpp
  482. 2>    moc_itkMathDetail.cpp
  483. 2>    moc_itkSize.cpp
  484. 2>    moc_itkContinuousIndex.cpp
  485. 2>    moc_itkPoint.cpp
  486. 2>    moc_itkNumericTraitsPointPixel.cpp
  487. 2>    moc_itkVersion.cpp
  488. 2>    Generating Code...
  489. 2>    CTKqtsingleapplication.vcxproj -> G:\programming\cplusplus\CTK\build\CTK-build\bin\Debug\CTKqtsingleapplication.dll
  490. 2>  C:\Program Files (x86)\Microsoft Visual Studio\2019\Community\MSBuild\Microsoft\VC\v160\Microsoft.CppCommon.targets(238,5): error MSB8066: Custom build for 'G:\programming\cplusplus\CTK\build\CMakeFiles\7bb6d10cf9d22863946eab39249063a3\CTK-mkdir.rule;G:\programming\cplusplus\CTK\build\CMakeFiles\7bb6d10cf9d22863946eab39249063a3\CTK-download.rule;G:\programming\cplusplus\CTK\build\CMakeFiles\7bb6d10cf9d22863946eab39249063a3\CTK-update.rule;G:\programming\cplusplus\CTK\build\CMakeFiles\7bb6d10cf9d22863946eab39249063a3\CTK-patch.rule;G:\programming\cplusplus\CTK\build\CMakeFiles\7bb6d10cf9d22863946eab39249063a3\CTK-configure.rule;G:\programming\cplusplus\CTK\build\CMakeFiles\7bb6d10cf9d22863946eab39249063a3\CTK-build.rule;G:\programming\cplusplus\CTK\build\CMakeFiles\7bb6d10cf9d22863946eab39249063a3\CTK-install.rule;G:\programming\cplusplus\CTK\build\CMakeFiles\7bb6d10cf9d22863946eab39249063a3\CTK-forceconfigure.rule;G:\programming\cplusplus\CTK\build\CMakeFiles\e3b53e276c6c7ab93bdcf23146530f56\CTK-complete.rule;G:\programming\cplusplus\CTK\build\CMakeFiles\36161454dc3a55cd79af0104e2c07415\CTK.rule' exited with code 1.
  491. 2>Done building target "CustomBuild" in project "CTK.vcxproj" -- FAILED.
  492. 2>
  493. 2>Done building project "CTK.vcxproj" -- FAILED.
  494. 2>
  495. 2>Build FAILED.
  496. 2>
  497. 2>G:\programming\cplusplus\CTK\Libs\mbilog\mbilogTextBackendBase.cpp(401,26): warning C4996: 'ctime': This function or variable may be unsafe. Consider using ctime_s instead. To disable deprecation, use _CRT_SECURE_NO_WARNINGS. See online help for details. [G:\programming\cplusplus\CTK\build\CTK-build\Libs\mbilog\CTKmbilog.vcxproj]
  498. 2>G:\programming\cplusplus\CTK\Libs\mbilog\mitkExceptionMacros.h(20,1): warning C4005: 'ITK_LOCATION': macro redefinition [G:\programming\cplusplus\CTK\build\CTK-build\Libs\mbilog\CTKmbilog.vcxproj]
  499. 2>G:\programming\cplusplus\CTK\Libs\mbilog\itkWin32OutputWindow.cxx(112,7): warning C4996: 'strncpy': This function or variable may be unsafe. Consider using strncpy_s instead. To disable deprecation, use _CRT_SECURE_NO_WARNINGS. See online help for details. [G:\programming\cplusplus\CTK\build\CTK-build\Libs\mbilog\CTKmbilog.vcxproj]
  500. 2>G:\programming\cplusplus\CTK\Libs\mbilog\mitkException.cpp(43,26): error C2247: 'itk::ExceptionObject::GetDescription' not accessible because 'mitk::Exception' uses 'private' to inherit from 'itk::ExceptionObject' [G:\programming\cplusplus\CTK\build\CTK-build\Libs\mbilog\CTKmbilog.vcxproj]
  501. 2>G:\programming\cplusplus\CTK\Libs\mbilog\itkThreadPool.cxx(21,10): fatal error C1083: Cannot open include file: 'itksys/SystemTools.hxx': No such file or directory [G:\programming\cplusplus\CTK\build\CTK-build\Libs\mbilog\CTKmbilog.vcxproj]
  502. 2>G:\programming\cplusplus\CTK\Libs\mbilog\itkVector.h(23,10): fatal error C1083: Cannot open include file: 'vnl/vnl_vector_ref.h': No such file or directory [G:\programming\cplusplus\CTK\build\CTK-build\Libs\mbilog\CTKmbilog.vcxproj]
  503. 2>G:\programming\cplusplus\CTK\Libs\mbilog\itkOutputWindow.cxx(83,3): error C3861: 'GetPimplGlobalsPointer': identifier not found [G:\programming\cplusplus\CTK\build\CTK-build\Libs\mbilog\CTKmbilog.vcxproj]
  504. 2>G:\programming\cplusplus\CTK\Libs\mbilog\itkOutputWindow.cxx(83,3): error C3535: cannot deduce type for 'auto *' from 'unknown-type' [G:\programming\cplusplus\CTK\build\CTK-build\Libs\mbilog\CTKmbilog.vcxproj]
  505. 2>G:\programming\cplusplus\CTK\Libs\mbilog\itkOutputWindow.cxx(86,65): error C2065: 'm_PimplGlobals': undeclared identifier [G:\programming\cplusplus\CTK\build\CTK-build\Libs\mbilog\CTKmbilog.vcxproj]
  506. 2>G:\programming\cplusplus\CTK\Libs\mbilog\itkOutputWindow.cxx(116,3): error C3861: 'GetPimplGlobalsPointer': identifier not found [G:\programming\cplusplus\CTK\build\CTK-build\Libs\mbilog\CTKmbilog.vcxproj]
  507. 2>G:\programming\cplusplus\CTK\Libs\mbilog\itkOutputWindow.cxx(116,3): error C3535: cannot deduce type for 'auto *' from 'unknown-type' [G:\programming\cplusplus\CTK\build\CTK-build\Libs\mbilog\CTKmbilog.vcxproj]
  508. 2>G:\programming\cplusplus\CTK\Libs\mbilog\itkOutputWindow.cxx(117,8): error C2065: 'm_PimplGlobals': undeclared identifier [G:\programming\cplusplus\CTK\build\CTK-build\Libs\mbilog\CTKmbilog.vcxproj]
  509. 2>G:\programming\cplusplus\CTK\Libs\mbilog\itkOutputWindow.cxx(120,5): error C2065: 'm_PimplGlobals': undeclared identifier [G:\programming\cplusplus\CTK\build\CTK-build\Libs\mbilog\CTKmbilog.vcxproj]
  510. 2>G:\programming\cplusplus\CTK\Libs\mbilog\itkOutputWindow.cxx(122,10): error C2065: 'm_PimplGlobals': undeclared identifier [G:\programming\cplusplus\CTK\build\CTK-build\Libs\mbilog\CTKmbilog.vcxproj]
  511. 2>G:\programming\cplusplus\CTK\Libs\mbilog\itkOutputWindow.cxx(124,7): error C2065: 'm_PimplGlobals': undeclared identifier [G:\programming\cplusplus\CTK\build\CTK-build\Libs\mbilog\CTKmbilog.vcxproj]
  512. 2>G:\programming\cplusplus\CTK\Libs\mbilog\itkOutputWindow.cxx(126,7): error C2065: 'm_PimplGlobals': undeclared identifier [G:\programming\cplusplus\CTK\build\CTK-build\Libs\mbilog\CTKmbilog.vcxproj]
  513. 2>G:\programming\cplusplus\CTK\Libs\mbilog\itkOutputWindow.cxx(132,10): error C2065: 'm_PimplGlobals': undeclared identifier [G:\programming\cplusplus\CTK\build\CTK-build\Libs\mbilog\CTKmbilog.vcxproj]
  514. 2>G:\programming\cplusplus\CTK\Libs\mbilog\itkOutputWindow.cxx(135,1): error C2039: 'GetPimplGlobalsPointer': is not a member of 'itk::OutputWindow' [G:\programming\cplusplus\CTK\build\CTK-build\Libs\mbilog\CTKmbilog.vcxproj]
  515. 2>G:\programming\cplusplus\CTK\Libs\mbilog\itkOutputWindow.cxx(135,1): error C2065: 'm_PimplGlobals': undeclared identifier [G:\programming\cplusplus\CTK\build\CTK-build\Libs\mbilog\CTKmbilog.vcxproj]
  516. 2>G:\programming\cplusplus\CTK\Libs\mbilog\itkOutputWindow.cxx(135,1): error C2541: 'delete': cannot delete objects that are not pointers [G:\programming\cplusplus\CTK\build\CTK-build\Libs\mbilog\CTKmbilog.vcxproj]
  517. 2>G:\programming\cplusplus\CTK\Libs\mbilog\itkOutputWindow.cxx(137,37): error C2039: 'm_PimplGlobals': is not a member of 'itk::OutputWindow' [G:\programming\cplusplus\CTK\build\CTK-build\Libs\mbilog\CTKmbilog.vcxproj]
  518. 2>G:\programming\cplusplus\CTK\Libs\mbilog\itkMath.h(34,10): fatal error C1083: Cannot open include file: 'vnl/vnl_math.h': No such file or directory [G:\programming\cplusplus\CTK\build\CTK-build\Libs\mbilog\CTKmbilog.vcxproj]
  519. 2>G:\programming\cplusplus\CTK\Libs\mbilog\itkVector.h(23,10): fatal error C1083: Cannot open include file: 'vnl/vnl_vector_ref.h': No such file or directory [G:\programming\cplusplus\CTK\build\CTK-build\Libs\mbilog\CTKmbilog.vcxproj]
  520. 2>G:\programming\cplusplus\CTK\Libs\mbilog\itkVector.h(23,10): fatal error C1083: Cannot open include file: 'vnl/vnl_vector_ref.h': No such file or directory [G:\programming\cplusplus\CTK\build\CTK-build\Libs\mbilog\CTKmbilog.vcxproj]
  521. 2>G:\programming\cplusplus\CTK\Libs\mbilog\itkVector.h(23,10): fatal error C1083: Cannot open include file: 'vnl/vnl_vector_ref.h': No such file or directory [G:\programming\cplusplus\CTK\build\CTK-build\Libs\mbilog\CTKmbilog.vcxproj]
  522. 2>C:\Program Files (x86)\Microsoft Visual Studio\2019\Community\MSBuild\Microsoft\VC\v160\Microsoft.CppCommon.targets(238,5): error MSB8066: Custom build for 'G:\programming\cplusplus\CTK\build\CMakeFiles\7bb6d10cf9d22863946eab39249063a3\CTK-mkdir.rule;G:\programming\cplusplus\CTK\build\CMakeFiles\7bb6d10cf9d22863946eab39249063a3\CTK-download.rule;G:\programming\cplusplus\CTK\build\CMakeFiles\7bb6d10cf9d22863946eab39249063a3\CTK-update.rule;G:\programming\cplusplus\CTK\build\CMakeFiles\7bb6d10cf9d22863946eab39249063a3\CTK-patch.rule;G:\programming\cplusplus\CTK\build\CMakeFiles\7bb6d10cf9d22863946eab39249063a3\CTK-configure.rule;G:\programming\cplusplus\CTK\build\CMakeFiles\7bb6d10cf9d22863946eab39249063a3\CTK-build.rule;G:\programming\cplusplus\CTK\build\CMakeFiles\7bb6d10cf9d22863946eab39249063a3\CTK-install.rule;G:\programming\cplusplus\CTK\build\CMakeFiles\7bb6d10cf9d22863946eab39249063a3\CTK-forceconfigure.rule;G:\programming\cplusplus\CTK\build\CMakeFiles\e3b53e276c6c7ab93bdcf23146530f56\CTK-complete.rule;G:\programming\cplusplus\CTK\build\CMakeFiles\36161454dc3a55cd79af0104e2c07415\CTK.rule' exited with code 1.
  523. 2>    3 Warning(s)
  524. 2>    23 Error(s)
  525. 2>
  526. 2>Time Elapsed 00:02:11.46
  527. ========== Rebuild All: 1 succeeded, 1 failed, 0 skipped ==========
Advertisement
RAW Paste Data Copied
Advertisement