SHARE
TWEET

Untitled

a guest Feb 13th, 2016 81 Never
Not a member of Pastebin yet? Sign Up, it unlocks many cool features!
  1. This set of MCP mappings was designed for MC 1.8.8. Use at your own peril.This set of MCP mappings was designed for MC 1.8.8. Use at your own peril.
  2.  
  3. #################################################
  4.          ForgeGradle 2.1-SNAPSHOT-75bb646        
  5.   https://github.com/MinecraftForge/ForgeGradle  
  6. #################################################
  7.                Powered by MCP unknown              
  8.              http://modcoderpack.com            
  9.          by: Searge, ProfMobius, Fesh0r,        
  10.          R4wk, ZeuX, IngisKahn, bspkrs          
  11. #################################################
  12. :deobfCompileDummyTask
  13. :deobfProvidedDummyTask
  14. :getVersionJson
  15. :extractUserdev UP-TO-DATE
  16. :extractDependencyATs SKIPPED
  17. :extractMcpData SKIPPED
  18. :extractMcpMappings SKIPPED
  19. :genSrgs SKIPPED
  20. :downloadClient SKIPPED
  21. :downloadServer SKIPPED
  22. :splitServerJar SKIPPED
  23. :mergeJars SKIPPED
  24. :deobfMcSRG SKIPPED
  25. :decompileMc FAILED
  26.  
  27. FAILURE: Build failed with an exception.
  28.  
  29. * What went wrong:
  30. Execution failed for task ':decompileMc'.
  31. > Java heap space
  32.  
  33. * Try:
  34. Run with --info or --debug option to get more log output.
  35.  
  36. * Exception is:
  37. org.gradle.api.tasks.TaskExecutionException: Execution failed for task ':decompileMc'.
  38.     at org.gradle.api.internal.tasks.execution.ExecuteActionsTaskExecuter.executeActions(ExecuteActionsTaskExecuter.java:69)
  39.     at org.gradle.api.internal.tasks.execution.ExecuteActionsTaskExecuter.execute(ExecuteActionsTaskExecuter.java:46)
  40.     at org.gradle.api.internal.tasks.execution.PostExecutionAnalysisTaskExecuter.execute(PostExecutionAnalysisTaskExecuter.java:35)
  41.     at org.gradle.api.internal.tasks.execution.SkipUpToDateTaskExecuter.execute(SkipUpToDateTaskExecuter.java:64)
  42.     at org.gradle.api.internal.tasks.execution.ValidatingTaskExecuter.execute(ValidatingTaskExecuter.java:58)
  43.     at org.gradle.api.internal.tasks.execution.SkipEmptySourceFilesTaskExecuter.execute(SkipEmptySourceFilesTaskExecuter.java:52)
  44.     at org.gradle.api.internal.tasks.execution.SkipTaskWithNoActionsExecuter.execute(SkipTaskWithNoActionsExecuter.java:52)
  45.     at org.gradle.api.internal.tasks.execution.SkipOnlyIfTaskExecuter.execute(SkipOnlyIfTaskExecuter.java:53)
  46.     at org.gradle.api.internal.tasks.execution.ExecuteAtMostOnceTaskExecuter.execute(ExecuteAtMostOnceTaskExecuter.java:43)
  47.     at org.gradle.execution.taskgraph.DefaultTaskGraphExecuter$EventFiringTaskWorker.execute(DefaultTaskGraphExecuter.java:203)
  48.     at org.gradle.execution.taskgraph.DefaultTaskGraphExecuter$EventFiringTaskWorker.execute(DefaultTaskGraphExecuter.java:185)
  49.     at org.gradle.execution.taskgraph.AbstractTaskPlanExecutor$TaskExecutorWorker.processTask(AbstractTaskPlanExecutor.java:62)
  50.     at org.gradle.execution.taskgraph.AbstractTaskPlanExecutor$TaskExecutorWorker.run(AbstractTaskPlanExecutor.java:50)
  51.     at org.gradle.execution.taskgraph.DefaultTaskPlanExecutor.process(DefaultTaskPlanExecutor.java:25)
  52.     at org.gradle.execution.taskgraph.DefaultTaskGraphExecuter.execute(DefaultTaskGraphExecuter.java:110)
  53.     at org.gradle.execution.SelectedTaskExecutionAction.execute(SelectedTaskExecutionAction.java:37)
  54.     at org.gradle.execution.DefaultBuildExecuter.execute(DefaultBuildExecuter.java:37)
  55.     at org.gradle.execution.DefaultBuildExecuter.access$000(DefaultBuildExecuter.java:23)
  56.     at org.gradle.execution.DefaultBuildExecuter$1.proceed(DefaultBuildExecuter.java:43)
  57.     at org.gradle.execution.DryRunBuildExecutionAction.execute(DryRunBuildExecutionAction.java:32)
  58.     at org.gradle.execution.DefaultBuildExecuter.execute(DefaultBuildExecuter.java:37)
  59.     at org.gradle.execution.DefaultBuildExecuter.execute(DefaultBuildExecuter.java:30)
  60.     at org.gradle.initialization.DefaultGradleLauncher$4.run(DefaultGradleLauncher.java:155)
  61.     at org.gradle.internal.Factories$1.create(Factories.java:22)
  62.     at org.gradle.internal.progress.DefaultBuildOperationExecutor.run(DefaultBuildOperationExecutor.java:90)
  63.     at org.gradle.internal.progress.DefaultBuildOperationExecutor.run(DefaultBuildOperationExecutor.java:52)
  64.     at org.gradle.initialization.DefaultGradleLauncher.doBuildStages(DefaultGradleLauncher.java:152)
  65.     at org.gradle.initialization.DefaultGradleLauncher.access$200(DefaultGradleLauncher.java:33)
  66.     at org.gradle.initialization.DefaultGradleLauncher$1.create(DefaultGradleLauncher.java:100)
  67.     at org.gradle.initialization.DefaultGradleLauncher$1.create(DefaultGradleLauncher.java:94)
  68.     at org.gradle.internal.progress.DefaultBuildOperationExecutor.run(DefaultBuildOperationExecutor.java:90)
  69.     at org.gradle.internal.progress.DefaultBuildOperationExecutor.run(DefaultBuildOperationExecutor.java:62)
  70.     at org.gradle.initialization.DefaultGradleLauncher.doBuild(DefaultGradleLauncher.java:94)
  71.     at org.gradle.initialization.DefaultGradleLauncher.run(DefaultGradleLauncher.java:83)
  72.     at org.gradle.launcher.exec.InProcessBuildActionExecuter$DefaultBuildController.run(InProcessBuildActionExecuter.java:94)
  73.     at org.gradle.tooling.internal.provider.ExecuteBuildActionRunner.run(ExecuteBuildActionRunner.java:28)
  74.     at org.gradle.launcher.exec.ChainingBuildActionRunner.run(ChainingBuildActionRunner.java:35)
  75.     at org.gradle.launcher.exec.InProcessBuildActionExecuter.execute(InProcessBuildActionExecuter.java:43)
  76.     at org.gradle.launcher.exec.InProcessBuildActionExecuter.execute(InProcessBuildActionExecuter.java:28)
  77.     at org.gradle.launcher.exec.ContinuousBuildActionExecuter.execute(ContinuousBuildActionExecuter.java:77)
  78.     at org.gradle.launcher.exec.ContinuousBuildActionExecuter.execute(ContinuousBuildActionExecuter.java:47)
  79.     at org.gradle.launcher.exec.DaemonUsageSuggestingBuildActionExecuter.execute(DaemonUsageSuggestingBuildActionExecuter.java:51)
  80.     at org.gradle.launcher.exec.DaemonUsageSuggestingBuildActionExecuter.execute(DaemonUsageSuggestingBuildActionExecuter.java:28)
  81.     at org.gradle.launcher.cli.RunBuildAction.run(RunBuildAction.java:43)
  82.     at org.gradle.internal.Actions$RunnableActionAdapter.execute(Actions.java:170)
  83.     at org.gradle.launcher.cli.CommandLineActionFactory$ParseAndBuildAction.execute(CommandLineActionFactory.java:237)
  84.     at org.gradle.launcher.cli.CommandLineActionFactory$ParseAndBuildAction.execute(CommandLineActionFactory.java:210)
  85.     at org.gradle.launcher.cli.JavaRuntimeValidationAction.execute(JavaRuntimeValidationAction.java:35)
  86.     at org.gradle.launcher.cli.JavaRuntimeValidationAction.execute(JavaRuntimeValidationAction.java:24)
  87.     at org.gradle.launcher.cli.CommandLineActionFactory$WithLogging.execute(CommandLineActionFactory.java:206)
  88.     at org.gradle.launcher.cli.CommandLineActionFactory$WithLogging.execute(CommandLineActionFactory.java:169)
  89.     at org.gradle.launcher.cli.ExceptionReportingAction.execute(ExceptionReportingAction.java:33)
  90.     at org.gradle.launcher.cli.ExceptionReportingAction.execute(ExceptionReportingAction.java:22)
  91.     at org.gradle.launcher.Main.doAction(Main.java:33)
  92.     at org.gradle.launcher.bootstrap.EntryPoint.run(EntryPoint.java:45)
  93.     at org.gradle.launcher.bootstrap.ProcessBootstrap.runNoExit(ProcessBootstrap.java:54)
  94.     at org.gradle.launcher.bootstrap.ProcessBootstrap.run(ProcessBootstrap.java:35)
  95.     at org.gradle.launcher.GradleMain.main(GradleMain.java:23)
  96.     at org.gradle.wrapper.BootstrapMainStarter.start(BootstrapMainStarter.java:30)
  97.     at org.gradle.wrapper.WrapperExecutor.execute(WrapperExecutor.java:127)
  98.     at org.gradle.wrapper.GradleWrapperMain.main(GradleWrapperMain.java:61)
  99. Caused by: java.lang.OutOfMemoryError: Java heap space
  100.     at org.jetbrains.java.decompiler.struct.StructMember.readAttribute(StructMember.java:89)
  101.     at org.jetbrains.java.decompiler.struct.StructMethod.readAttribute(StructMethod.java:110)
  102.     at org.jetbrains.java.decompiler.struct.StructMember.readAttributes(StructMember.java:57)
  103.     at org.jetbrains.java.decompiler.struct.StructMethod.readAttribute(StructMethod.java:105)
  104.     at org.jetbrains.java.decompiler.struct.StructMember.readAttributes(StructMember.java:57)
  105.     at org.jetbrains.java.decompiler.struct.StructMethod.<init>(StructMethod.java:78)
  106.     at org.jetbrains.java.decompiler.struct.StructClass.<init>(StructClass.java:116)
  107.     at org.jetbrains.java.decompiler.struct.StructClass.<init>(StructClass.java:75)
  108.     at org.jetbrains.java.decompiler.struct.StructContext.addArchive(StructContext.java:167)
  109.     at org.jetbrains.java.decompiler.struct.StructContext.addSpace(StructContext.java:100)
  110.     at org.jetbrains.java.decompiler.struct.StructContext.addSpace(StructContext.java:78)
  111.     at org.jetbrains.java.decompiler.main.Fernflower.addAllClasspath(Fernflower.java:119)
  112.     at org.jetbrains.java.decompiler.main.Fernflower.<init>(Fernflower.java:48)
  113.     at org.jetbrains.java.decompiler.main.decompiler.BaseDecompiler.<init>(BaseDecompiler.java:32)
  114.     at net.minecraftforge.gradle.tasks.ApplyFernFlowerTask.applyFernFlower(ApplyFernFlowerTask.java:94)
  115.     at org.gradle.internal.reflect.JavaMethod.invoke(JavaMethod.java:75)
  116.     at org.gradle.api.internal.project.taskfactory.AnnotationProcessingTaskFactory$StandardTaskAction.doExecute(AnnotationProcessingTaskFactory.java:226)
  117.     at org.gradle.api.internal.project.taskfactory.AnnotationProcessingTaskFactory$StandardTaskAction.execute(AnnotationProcessingTaskFactory.java:219)
  118.     at org.gradle.api.internal.project.taskfactory.AnnotationProcessingTaskFactory$StandardTaskAction.execute(AnnotationProcessingTaskFactory.java:208)
  119.     at org.gradle.api.internal.AbstractTask$TaskActionWrapper.execute(AbstractTask.java:585)
  120.     at org.gradle.api.internal.AbstractTask$TaskActionWrapper.execute(AbstractTask.java:568)
  121.     at org.gradle.api.internal.tasks.execution.ExecuteActionsTaskExecuter.executeAction(ExecuteActionsTaskExecuter.java:80)
  122.     at org.gradle.api.internal.tasks.execution.ExecuteActionsTaskExecuter.executeActions(ExecuteActionsTaskExecuter.java:61)
  123.     at org.gradle.api.internal.tasks.execution.ExecuteActionsTaskExecuter.execute(ExecuteActionsTaskExecuter.java:46)
  124.     at org.gradle.api.internal.tasks.execution.PostExecutionAnalysisTaskExecuter.execute(PostExecutionAnalysisTaskExecuter.java:35)
  125.     at org.gradle.api.internal.tasks.execution.SkipUpToDateTaskExecuter.execute(SkipUpToDateTaskExecuter.java:64)
  126.     at org.gradle.api.internal.tasks.execution.ValidatingTaskExecuter.execute(ValidatingTaskExecuter.java:58)
  127.     at org.gradle.api.internal.tasks.execution.SkipEmptySourceFilesTaskExecuter.execute(SkipEmptySourceFilesTaskExecuter.java:52)
  128.  
  129.  
  130. BUILD FAILED
  131.  
  132. Total time: 33.939 secs
RAW Paste Data
We use cookies for various purposes including analytics. By continuing to use Pastebin, you agree to our use of cookies as described in the Cookies Policy. OK, I Understand
 
Top