Guest User

3.7.5

a guest
Dec 11th, 2019
31
Never
Not a member of Pastebin yet? Sign Up, it unlocks many cool features!
  1. == CPython 3.7.5 (default, Dec 11 2019, 05:42:05) [Clang 11.0.0 (clang-1100.0.33.16)]
  2. == Darwin-19.2.0-x86_64-i386-64bit little-endian
  3. == cwd: /private/var/folders/_v/9r245bv51z77v4_khb_j55y40000gn/T/test_python_2042
  4. == CPU count: 4
  5. == encodings: locale=UTF-8, FS=utf-8
  6. Run tests sequentially
  7. 0:00:00 load avg: 3.76 [ 1/416] test_grammar
  8. 0:00:00 load avg: 3.76 [ 2/416] test_opcodes
  9. 0:00:00 load avg: 3.76 [ 3/416] test_dict
  10. 0:00:00 load avg: 3.76 [ 4/416] test_builtin
  11. 0:00:01 load avg: 3.76 [ 5/416] test_exceptions
  12. 0:00:01 load avg: 3.76 [ 6/416] test_types
  13. 0:00:02 load avg: 3.76 [ 7/416] test_unittest
  14. 0:00:04 load avg: 4.02 [ 8/416] test_doctest
  15. 0:00:06 load avg: 4.02 [ 9/416] test_doctest2
  16. 0:00:06 load avg: 4.02 [ 10/416] test_support
  17. 0:00:10 load avg: 4.26 [ 11/416] test___all__
  18. 0:00:12 load avg: 4.26 [ 12/416] test___future__
  19. 0:00:12 load avg: 4.26 [ 13/416] test__locale
  20. 0:00:12 load avg: 4.26 [ 14/416] test__opcode
  21. 0:00:12 load avg: 4.26 [ 15/416] test__osx_support
  22. 0:00:13 load avg: 4.15 [ 16/416] test_abc
  23. 0:00:14 load avg: 4.15 [ 17/416] test_abstract_numbers
  24. 0:00:14 load avg: 4.15 [ 18/416] test_aifc
  25. 0:00:14 load avg: 4.15 [ 19/416] test_argparse
  26. 0:00:17 load avg: 4.15 [ 20/416] test_array
  27. 0:00:19 load avg: 4.06 [ 21/416] test_asdl_parser
  28. test_asdl_parser skipped -- test irrelevant for an installed Python
  29. 0:00:19 load avg: 4.06 [ 22/416] test_ast -- test_asdl_parser skipped
  30. 0:00:21 load avg: 4.06 [ 23/416] test_asyncgen
  31. 0:00:22 load avg: 4.06 [ 24/416] test_asynchat
  32. 0:00:24 load avg: 3.98 [ 25/416] test_asyncio
  33. 0:02:10 load avg: 10.75 [ 26/416] test_asyncore -- test_asyncio passed in 1 min 46 sec
  34. 0:02:13 load avg: 10.75 [ 27/416] test_atexit
  35. 0:02:13 load avg: 10.75 [ 28/416] test_audioop
  36. 0:02:13 load avg: 10.75 [ 29/416] test_augassign
  37. 0:02:13 load avg: 10.75 [ 30/416] test_base64
  38. 0:02:14 load avg: 10.29 [ 31/416] test_baseexception
  39. 0:02:14 load avg: 10.29 [ 32/416] test_bdb
  40. 0:02:14 load avg: 10.29 [ 33/416] test_bigaddrspace
  41. 0:02:15 load avg: 10.29 [ 34/416] test_bigmem
  42. 0:02:15 load avg: 10.29 [ 35/416] test_binascii
  43. 0:02:15 load avg: 10.29 [ 36/416] test_binhex
  44. 0:02:15 load avg: 10.29 [ 37/416] test_binop
  45. 0:02:15 load avg: 10.29 [ 38/416] test_bisect
  46. 0:02:16 load avg: 10.29 [ 39/416] test_bool
  47. 0:02:16 load avg: 10.29 [ 40/416] test_buffer
  48. 0:02:24 load avg: 9.01 [ 41/416] test_bufio
  49. 0:02:26 load avg: 9.01 [ 42/416] test_bytes
  50. 0:02:27 load avg: 9.01 [ 43/416] test_bz2
  51. 0:02:36 load avg: 8.23 [ 44/416] test_c_locale_coercion
  52. 0:02:39 load avg: 8.23 [ 45/416] test_calendar
  53. 0:02:42 load avg: 7.89 [ 46/416] test_call
  54. 0:02:42 load avg: 7.89 [ 47/416] test_capi
  55. 0:02:47 load avg: 8.06 [ 48/416] test_cgi
  56. 0:02:47 load avg: 8.06 [ 49/416] test_cgitb
  57. 0:02:48 load avg: 8.06 [ 50/416] test_charmapcodec
  58. 0:02:48 load avg: 8.06 [ 51/416] test_class
  59. 0:02:49 load avg: 8.06 [ 52/416] test_clinic
  60. test_clinic skipped -- '/Users/<username>/.pyenv/versions/3.7.5/lib/Tools/clinic' path does not exist
  61. 0:02:49 load avg: 8.29 [ 53/416] test_cmath -- test_clinic skipped
  62. 0:02:49 load avg: 8.29 [ 54/416] test_cmd
  63. 0:02:50 load avg: 8.29 [ 55/416] test_cmd_line
  64. 0:02:53 load avg: 8.29 [ 56/416] test_cmd_line_script
  65. 0:02:57 load avg: 8.03 [ 57/416] test_code
  66. 0:02:57 load avg: 8.03 [ 58/416] test_code_module
  67. 0:02:57 load avg: 8.03 [ 59/416] test_codeccallbacks
  68. 0:02:58 load avg: 8.03 [ 60/416] test_codecencodings_cn
  69. 0:02:58 load avg: 8.03 [ 61/416] test_codecencodings_hk
  70. 0:02:59 load avg: 7.63 [ 62/416] test_codecencodings_iso2022
  71. 0:02:59 load avg: 7.63 [ 63/416] test_codecencodings_jp
  72. 0:03:00 load avg: 7.63 [ 64/416] test_codecencodings_kr
  73. 0:03:01 load avg: 7.63 [ 65/416] test_codecencodings_tw
  74. 0:03:01 load avg: 7.63 [ 66/416] test_codecmaps_cn
  75. 0:03:01 load avg: 7.63 [ 67/416] test_codecmaps_hk
  76. 0:03:02 load avg: 7.63 [ 68/416] test_codecmaps_jp
  77. 0:03:02 load avg: 7.63 [ 69/416] test_codecmaps_kr
  78. 0:03:02 load avg: 7.63 [ 70/416] test_codecmaps_tw
  79. 0:03:02 load avg: 7.63 [ 71/416] test_codecs
  80. 0:03:05 load avg: 7.90 [ 72/416] test_codeop
  81. 0:03:05 load avg: 7.90 [ 73/416] test_collections
  82. 0:03:07 load avg: 7.90 [ 74/416] test_colorsys
  83. 0:03:07 load avg: 7.90 [ 75/416] test_compare
  84. 0:03:07 load avg: 7.90 [ 76/416] test_compile
  85. 0:03:10 load avg: 8.30 [ 77/416] test_compileall
  86. 0:03:18 load avg: 8.12 [ 78/416] test_complex
  87. 0:03:18 load avg: 8.12 [ 79/416] test_concurrent_futures
  88. 0:05:37 load avg: 4.61 [ 80/416] test_configparser -- test_concurrent_futures passed in 2 min 18 sec
  89. 0:05:38 load avg: 4.61 [ 81/416] test_contains
  90. 0:05:38 load avg: 4.61 [ 82/416] test_context
  91. 0:05:40 load avg: 4.61 [ 83/416] test_contextlib
  92. 0:05:40 load avg: 4.61 [ 84/416] test_contextlib_async
  93. Task was destroyed but it is pending!
  94. task: <Task pending coro=<<async_generator_athrow without __name__>()>>
  95. Task was destroyed but it is pending!
  96. task: <Task pending coro=<<async_generator_athrow without __name__>()>>
  97. 0:05:40 load avg: 4.72 [ 85/416] test_copy
  98. 0:05:41 load avg: 4.72 [ 86/416] test_copyreg
  99. 0:05:41 load avg: 4.72 [ 87/416] test_coroutines
  100. 0:05:42 load avg: 4.72 [ 88/416] test_cprofile
  101. 0:05:43 load avg: 4.72 [ 89/416] test_crashers
  102. 0:05:43 load avg: 4.72 [ 90/416] test_crypt
  103. 0:05:43 load avg: 4.72 [ 91/416] test_csv
  104. 0:05:44 load avg: 4.72 [ 92/416] test_ctypes
  105. 0:05:45 load avg: 4.72 [ 93/416] test_curses
  106. test_curses skipped -- Use of the 'curses' resource not enabled
  107. 0:05:45 load avg: 4.72 [ 94/416] test_dataclasses -- test_curses skipped (resource denied)
  108. 0:05:46 load avg: 4.74 [ 95/416] test_datetime
  109. 0:05:51 load avg: 4.44 [ 96/416] test_dbm
  110. 0:05:52 load avg: 4.44 [ 97/416] test_dbm_dumb
  111. 0:05:53 load avg: 4.44 [ 98/416] test_dbm_gnu
  112. test_dbm_gnu skipped -- No module named '_gdbm'
  113. 0:05:53 load avg: 4.44 [ 99/416] test_dbm_ndbm -- test_dbm_gnu skipped
  114. 0:05:53 load avg: 4.44 [100/416] test_decimal
  115. 0:05:58 load avg: 4.73 [101/416] test_decorators
  116. 0:05:58 load avg: 4.73 [102/416] test_defaultdict
  117. 0:05:58 load avg: 4.73 [103/416] test_deque
  118. 0:06:02 load avg: 4.83 [104/416] test_descr
  119. 0:06:04 load avg: 4.83 [105/416] test_descrtut
  120. 0:06:04 load avg: 4.83 [106/416] test_devpoll
  121. test_devpoll skipped -- test works only on Solaris OS family
  122. 0:06:05 load avg: 4.83 [107/416] test_dict_version -- test_devpoll skipped
  123. 0:06:05 load avg: 4.83 [108/416] test_dictcomps
  124. 0:06:05 load avg: 4.83 [109/416] test_dictviews
  125. 0:06:05 load avg: 4.76 [110/416] test_difflib
  126. 0:06:06 load avg: 4.76 [111/416] test_dis
  127. 0:06:07 load avg: 4.76 [112/416] test_distutils
  128. 0:06:11 load avg: 4.46 [113/416] test_docxmlrpc
  129. 0:06:14 load avg: 4.46 [114/416] test_dtrace
  130. 0:06:14 load avg: 4.46 [115/416] test_dummy_thread
  131. 0:06:15 load avg: 4.46 [116/416] test_dummy_threading
  132. 0:06:15 load avg: 4.46 [117/416] test_dynamic
  133. 0:06:15 load avg: 4.46 [118/416] test_dynamicclassattribute
  134. 0:06:16 load avg: 4.26 [119/416] test_eintr
  135. 0:06:21 load avg: 4.08 [120/416] test_email
  136. 0:06:28 load avg: 4.08 [121/416] test_embed
  137. 0:06:28 load avg: 4.08 [122/416] test_ensurepip
  138. 0:06:28 load avg: 4.08 [123/416] test_enum
  139. 0:06:29 load avg: 4.08 [124/416] test_enumerate
  140. 0:06:30 load avg: 4.08 [125/416] test_eof
  141. 0:06:30 load avg: 4.08 [126/416] test_epoll
  142. test_epoll skipped -- test works only on Linux 2.6
  143. 0:06:30 load avg: 4.08 [127/416] test_errno -- test_epoll skipped
  144. 0:06:30 load avg: 4.08 [128/416] test_exception_hierarchy
  145. 0:06:31 load avg: 3.91 [129/416] test_exception_variations
  146. 0:06:31 load avg: 3.91 [130/416] test_extcall
  147. 0:06:31 load avg: 3.91 [131/416] test_faulthandler
  148. 0:06:51 load avg: 3.50 [132/416] test_fcntl
  149. 0:06:52 load avg: 3.50 [133/416] test_file
  150. 0:06:52 load avg: 3.50 [134/416] test_file_eintr
  151. 0:06:55 load avg: 3.50 [135/416] test_filecmp
  152. 0:06:55 load avg: 3.50 [136/416] test_fileinput
  153. 0:06:55 load avg: 3.50 [137/416] test_fileio
  154. 0:06:56 load avg: 3.50 [138/416] test_finalization
  155. 0:06:58 load avg: 3.46 [139/416] test_float
  156. 0:06:58 load avg: 3.46 [140/416] test_flufl
  157. 0:06:58 load avg: 3.46 [141/416] test_fnmatch
  158. 0:06:58 load avg: 3.46 [142/416] test_fork1
  159. 0:07:05 load avg: 3.27 [143/416] test_format
  160. 0:07:05 load avg: 3.27 [144/416] test_fractions
  161. 0:07:06 load avg: 3.27 [145/416] test_frame
  162. 0:07:06 load avg: 3.27 [146/416] test_frozen
  163. 0:07:06 load avg: 3.16 [147/416] test_fstring
  164. 0:07:07 load avg: 3.16 [148/416] test_ftplib
  165. 0:07:09 load avg: 3.16 [149/416] test_funcattrs
  166. 0:07:09 load avg: 3.16 [150/416] test_functools
  167. 0:07:10 load avg: 3.16 [151/416] test_future
  168. 0:07:10 load avg: 3.16 [152/416] test_future3
  169. 0:07:10 load avg: 3.16 [153/416] test_future4
  170. 0:07:11 load avg: 3.16 [154/416] test_future5
  171. 0:07:11 load avg: 3.16 [155/416] test_gc
  172. 0:07:16 load avg: 3.15 [156/416] test_gdb
  173. test_gdb skipped -- Couldn't find gdb on the path
  174. 0:07:16 load avg: 3.15 [157/416] test_generator_stop -- test_gdb skipped
  175. 0:07:16 load avg: 3.14 [158/416] test_generators
  176. 0:07:17 load avg: 3.14 [159/416] test_genericclass
  177. 0:07:17 load avg: 3.14 [160/416] test_genericpath
  178. 0:07:17 load avg: 3.14 [161/416] test_genexps
  179. 0:07:18 load avg: 3.14 [162/416] test_getargs2
  180. 0:07:18 load avg: 3.14 [163/416] test_getopt
  181. 0:07:19 load avg: 3.14 [164/416] test_getpass
  182. 0:07:19 load avg: 3.14 [165/416] test_gettext
  183. 0:07:20 load avg: 3.14 [166/416] test_glob
  184. 0:07:21 load avg: 3.14 [167/416] test_global
  185. 0:07:22 load avg: 3.69 [168/416] test_grp
  186. 0:07:22 load avg: 3.69 [169/416] test_gzip
  187. 0:07:23 load avg: 3.69 [170/416] test_hash
  188. 0:07:24 load avg: 3.69 [171/416] test_hashlib
  189. 0:07:26 load avg: 3.69 [172/416] test_heapq
  190. 0:07:27 load avg: 3.47 [173/416] test_hmac
  191. 0:07:27 load avg: 3.47 [174/416] test_html
  192. 0:07:27 load avg: 3.47 [175/416] test_htmlparser
  193. 0:07:28 load avg: 3.47 [176/416] test_http_cookiejar
  194. 0:07:28 load avg: 3.47 [177/416] test_http_cookies
  195. 0:07:28 load avg: 3.47 [178/416] test_httplib
  196. 0:07:29 load avg: 3.47 [179/416] test_httpservers
  197. 0:07:34 load avg: 3.35 [180/416] test_idle
  198. test_idle skipped -- No module named '_tkinter'
  199. 0:07:34 load avg: 3.35 [181/416] test_imaplib -- test_idle skipped
  200. 0:07:37 load avg: 3.25 [182/416] test_imghdr
  201. 0:07:38 load avg: 3.25 [183/416] test_imp
  202. 0:07:39 load avg: 3.25 [184/416] test_import
  203. 0:07:39 load avg: 3.25 [185/416] test_importlib
  204. 0:07:41 load avg: 3.31 [186/416] test_index
  205. 0:07:42 load avg: 3.31 [187/416] test_inspect
  206. 0:07:43 load avg: 3.31 [188/416] test_int
  207. 0:07:44 load avg: 3.31 [189/416] test_int_literal
  208. 0:07:44 load avg: 3.31 [190/416] test_io
  209. python(2042,0x10f6fddc0) malloc: can't allocate region
  210. *** mach_vm_map(size=9223372036854775808) failed (error code=3)
  211. python(2042,0x10f6fddc0) malloc: *** set a breakpoint in malloc_error_break to debug
  212. python(2042,0x10f6fddc0) malloc: can't allocate region
  213. *** mach_vm_map(size=9223372036854775808) failed (error code=3)
  214. python(2042,0x10f6fddc0) malloc: *** set a breakpoint in malloc_error_break to debug
  215. python(2042,0x10f6fddc0) malloc: can't allocate region
  216. *** mach_vm_map(size=9223372036854775808) failed (error code=3)
  217. python(2042,0x10f6fddc0) malloc: *** set a breakpoint in malloc_error_break to debug
  218. 0:08:25 load avg: 3.40 [191/416] test_ioctl -- test_io passed in 40 sec 679 ms
  219. 0:08:26 load avg: 3.40 [192/416] test_ipaddress
  220. 0:08:26 load avg: 3.40 [193/416] test_isinstance
  221. 0:08:27 load avg: 3.37 [194/416] test_iter
  222. 0:08:27 load avg: 3.37 [195/416] test_iterlen
  223. 0:08:28 load avg: 3.37 [196/416] test_itertools
  224. 0:08:32 load avg: 3.34 [197/416] test_json
  225. 0:08:34 load avg: 3.34 [198/416] test_keyword
  226. 0:08:35 load avg: 3.34 [199/416] test_keywordonlyarg
  227. 0:08:35 load avg: 3.34 [200/416] test_kqueue
  228. 0:08:35 load avg: 3.34 [201/416] test_largefile
  229. 0:08:36 load avg: 3.34 [202/416] test_lib2to3
  230. 0:08:47 load avg: 3.28 [203/416] test_linecache
  231. 0:08:47 load avg: 3.34 [204/416] test_list
  232. 0:08:48 load avg: 3.34 [205/416] test_listcomps
  233. 0:08:49 load avg: 3.34 [206/416] test_locale
  234. 0:08:49 load avg: 3.34 [207/416] test_logging
  235. Exception in thread Thread-445:
  236. Traceback (most recent call last):
  237. File "/Users/<username>/.pyenv/versions/3.7.5/lib/python3.7/threading.py", line 926, in _bootstrap_inner
  238. self.run()
  239. File "/Users/<username>/.pyenv/versions/3.7.5/lib/python3.7/threading.py", line 870, in run
  240. self._target(*self._args, **self._kwargs)
  241. File "/Users/<username>/.pyenv/versions/3.7.5/lib/python3.7/test/test_logging.py", line 875, in serve_forever
  242. asyncore.loop(poll_interval, map=self._map)
  243. File "/Users/<username>/.pyenv/versions/3.7.5/lib/python3.7/asyncore.py", line 203, in loop
  244. poll_fun(timeout, map)
  245. File "/Users/<username>/.pyenv/versions/3.7.5/lib/python3.7/asyncore.py", line 144, in poll
  246. r, w, e = select.select(r, w, e, timeout)
  247. OSError: [Errno 9] Bad file descriptor
  248.  
  249. 0:09:11 load avg: 3.31 [208/416] test_long
  250. 0:09:13 load avg: 3.21 [209/416] test_longexp
  251. 0:09:14 load avg: 3.21 [210/416] test_lzma
  252. 0:09:19 load avg: 3.03 [211/416] test_macpath
  253. 0:09:20 load avg: 3.03 [212/416] test_mailbox
  254. 0:09:21 load avg: 3.03 [213/416] test_mailcap
  255. 0:09:22 load avg: 3.03 [214/416] test_marshal
  256. 0:09:23 load avg: 2.95 [215/416] test_math
  257. 0:09:25 load avg: 2.95 [216/416] test_memoryio
  258. 0:09:25 load avg: 2.95 [217/416] test_memoryview
  259. 0:09:27 load avg: 2.79 [218/416] test_metaclass
  260. 0:09:28 load avg: 2.79 [219/416] test_mimetypes
  261. 0:09:29 load avg: 2.79 [220/416] test_minidom
  262. 0:09:29 load avg: 2.79 [221/416] test_mmap
  263. 0:09:30 load avg: 2.79 [222/416] test_module
  264. 0:09:31 load avg: 2.79 [223/416] test_modulefinder
  265. 0:09:32 load avg: 2.79 [224/416] test_msilib
  266. test_msilib skipped -- No module named 'msilib'
  267. 0:09:32 load avg: 2.79 [225/416] test_multibytecodec -- test_msilib skipped
  268. 0:09:33 load avg: 2.89 [226/416] test_multiprocessing_fork
  269. test_multiprocessing_fork skipped -- test may crash on macOS (bpo-33725)
  270. 0:09:33 load avg: 2.89 [227/416] test_multiprocessing_forkserver -- test_multiprocessing_fork skipped
  271. 0:11:02 load avg: 3.48 [228/416] test_multiprocessing_main_handling -- test_multiprocessing_forkserver passed in 1 min 28 sec
  272. 0:11:14 load avg: 3.31 [229/416] test_multiprocessing_spawn
  273. 0:12:57 load avg: 3.83 [230/416] test_netrc -- test_multiprocessing_spawn passed in 1 min 42 sec
  274. 0:12:57 load avg: 3.83 [231/416] test_nis
  275. 0:12:58 load avg: 3.83 [232/416] test_nntplib
  276. 0:12:58 load avg: 3.83 [233/416] test_normalization
  277. 0:12:59 load avg: 3.83 [234/416] test_ntpath
  278. 0:13:00 load avg: 3.76 [235/416] test_numeric_tower
  279. 0:13:00 load avg: 3.76 [236/416] test_openpty
  280. 0:13:01 load avg: 3.76 [237/416] test_operator
  281. 0:13:02 load avg: 3.76 [238/416] test_optparse
  282. 0:13:02 load avg: 3.76 [239/416] test_ordered_dict
  283. 0:13:06 load avg: 3.70 [240/416] test_os
  284. 0:13:09 load avg: 3.70 [241/416] test_ossaudiodev
  285. test_ossaudiodev skipped -- Use of the 'audio' resource not enabled
  286. 0:13:09 load avg: 3.70 [242/416] test_osx_env -- test_ossaudiodev skipped (resource denied)
  287. 0:13:10 load avg: 3.73 [243/416] test_parser
  288. 0:13:11 load avg: 3.73 [244/416] test_pathlib
  289. 0:13:12 load avg: 3.73 [245/416] test_pdb
  290. 0:13:13 load avg: 3.73 [246/416] test_peepholer
  291. 0:13:14 load avg: 3.73 [247/416] test_pickle
  292. 0:13:21 load avg: 3.61 [248/416] test_pickletools
  293. 0:13:23 load avg: 3.61 [249/416] test_pipes
  294. 0:13:23 load avg: 3.61 [250/416] test_pkg
  295. 0:13:24 load avg: 3.61 [251/416] test_pkgimport
  296. 0:13:24 load avg: 3.56 [252/416] test_pkgutil
  297. 0:13:25 load avg: 3.56 [253/416] test_platform
  298. 0:13:26 load avg: 3.56 [254/416] test_plistlib
  299. 0:13:26 load avg: 3.56 [255/416] test_poll
  300. 0:13:38 load avg: 3.23 [256/416] test_popen
  301. 0:13:39 load avg: 3.23 [257/416] test_poplib
  302. 0:13:42 load avg: 3.21 [258/416] test_posix
  303. 0:13:42 load avg: 3.21 [259/416] test_posixpath
  304. 0:13:43 load avg: 3.21 [260/416] test_pow
  305. 0:13:44 load avg: 3.21 [261/416] test_pprint
  306. 0:13:44 load avg: 3.21 [262/416] test_print
  307. 0:13:45 load avg: 3.04 [263/416] test_profile
  308. 0:13:45 load avg: 3.04 [264/416] test_property
  309. 0:13:46 load avg: 3.04 [265/416] test_pstats
  310. 0:13:46 load avg: 3.04 [266/416] test_pty
  311. 0:13:47 load avg: 3.04 [267/416] test_pulldom
  312. 0:13:47 load avg: 3.04 [268/416] test_pwd
  313. 0:13:48 load avg: 3.04 [269/416] test_py_compile
  314. test test_py_compile failed -- multiple errors occurred; run in verbose mode for details
  315. 0:13:48 load avg: 3.04 [270/416/1] test_pyclbr -- test_py_compile failed
  316. 0:13:50 load avg: 2.95 [271/416/1] test_pydoc
  317. 0:13:54 load avg: 2.95 [272/416/1] test_pyexpat
  318. 0:13:54 load avg: 2.95 [273/416/1] test_queue
  319. 0:13:59 load avg: 2.88 [274/416/1] test_quopri
  320. 0:14:00 load avg: 2.97 [275/416/1] test_raise
  321. 0:14:01 load avg: 2.97 [276/416/1] test_random
  322. 0:14:03 load avg: 2.97 [277/416/1] test_range
  323. 0:14:04 load avg: 2.97 [278/416/1] test_re
  324. 0:14:06 load avg: 2.97 [279/416/1] test_readline
  325. 0:14:06 load avg: 2.97 [280/416/1] test_regrtest
  326. 0:14:19 load avg: 2.90 [281/416/1] test_repl
  327. 0:14:19 load avg: 2.90 [282/416/1] test_reprlib
  328. 0:14:20 load avg: 2.91 [283/416/1] test_resource
  329. 0:14:21 load avg: 2.91 [284/416/1] test_richcmp
  330. 0:14:21 load avg: 2.91 [285/416/1] test_rlcompleter
  331. 0:14:22 load avg: 2.91 [286/416/1] test_robotparser
  332. 0:14:22 load avg: 2.91 [287/416/1] test_runpy
  333. 0:14:24 load avg: 2.91 [288/416/1] test_sax
  334. 0:14:25 load avg: 2.83 [289/416/1] test_sched
  335. 0:14:26 load avg: 2.83 [290/416/1] test_scope
  336. 0:14:27 load avg: 2.83 [291/416/1] test_script_helper
  337. 0:14:27 load avg: 2.83 [292/416/1] test_secrets
  338. 0:14:28 load avg: 2.83 [293/416/1] test_select
  339. 0:14:40 load avg: 3.07 [294/416/1] test_selectors
  340. 0:14:55 load avg: 2.60 [295/416/1] test_set
  341. 0:14:57 load avg: 2.47 [296/416/1] test_setcomps
  342. 0:14:58 load avg: 2.47 [297/416/1] test_shelve
  343. 0:14:59 load avg: 2.47 [298/416/1] test_shlex
  344. 0:14:59 load avg: 2.47 [299/416/1] test_shutil
  345. 0:15:00 load avg: 2.47 [300/416/1] test_signal
  346. 0:15:20 load avg: 2.16 [301/416/1] test_site
  347. 0:15:21 load avg: 2.15 [302/416/1] test_slice
  348. 0:15:21 load avg: 2.15 [303/416/1] test_smtpd
  349. 0:15:22 load avg: 2.15 [304/416/1] test_smtplib
  350. 0:15:23 load avg: 2.15 [305/416/1] test_smtpnet
  351. test_smtpnet skipped -- Use of the 'network' resource not enabled
  352. 0:15:24 load avg: 2.15 [306/416/1] test_sndhdr -- test_smtpnet skipped (resource denied)
  353. 0:15:24 load avg: 2.15 [307/416/1] test_socket
  354. /Users/<username>/.pyenv/versions/3.7.5/lib/python3.7/test/test_socket.py:2319: RuntimeWarning: received malformed or improperly-truncated ancillary data
  355. result = sock.recvmsg(bufsize, *args)
  356. /Users/<username>/.pyenv/versions/3.7.5/lib/python3.7/test/test_socket.py:2410: RuntimeWarning: received malformed or improperly-truncated ancillary data
  357. result = sock.recvmsg_into([buf], *args)
  358. 0:15:49 load avg: 1.96 [308/416/1] test_socketserver
  359. test_socketserver skipped -- Use of the 'network' resource not enabled
  360. 0:15:50 load avg: 1.96 [309/416/1] test_sort -- test_socketserver skipped (resource denied)
  361. 0:15:51 load avg: 1.96 [310/416/1] test_source_encoding
  362. 0:15:51 load avg: 2.04 [311/416/1] test_spwd
  363. test_spwd skipped -- No module named 'spwd'
  364. 0:15:52 load avg: 2.04 [312/416/1] test_sqlite -- test_spwd skipped
  365. 0:15:53 load avg: 2.04 [313/416/1] test_ssl
  366. Exception in thread Thread-1937:
  367. Traceback (most recent call last):
  368. File "/Users/<username>/.pyenv/versions/3.7.5/lib/python3.7/test/test_ssl.py", line 2386, in run
  369. msg = self.read()
  370. File "/Users/<username>/.pyenv/versions/3.7.5/lib/python3.7/test/test_ssl.py", line 2363, in read
  371. return self.sslconn.read()
  372. File "/Users/<username>/.pyenv/versions/3.7.5/lib/python3.7/ssl.py", line 931, in read
  373. return self._sslobj.read(len)
  374. ssl.SSLError: [SSL: PEER_DID_NOT_RETURN_A_CERTIFICATE] peer did not return a certificate (_ssl.c:2508)
  375.  
  376. During handling of the above exception, another exception occurred:
  377.  
  378. Traceback (most recent call last):
  379. File "/Users/<username>/.pyenv/versions/3.7.5/lib/python3.7/threading.py", line 926, in _bootstrap_inner
  380. self.run()
  381. File "/Users/<username>/.pyenv/versions/3.7.5/lib/python3.7/test/test_ssl.py", line 2472, in run
  382. raise ssl.SSLError('tlsv13 alert certificate required')
  383. ssl.SSLError: ('tlsv13 alert certificate required',)
  384.  
  385. 0:16:21 load avg: 2.03 [314/416/1] test_startfile
  386. test_startfile skipped -- object <module 'os' from '/Users/<username>/.pyenv/versions/3.7.5/lib/python3.7/os.py'> has no attribute 'startfile'
  387. 0:16:22 load avg: 2.03 [315/416/1] test_stat -- test_startfile skipped
  388. 0:16:22 load avg: 2.03 [316/416/1] test_statistics
  389. 0:16:23 load avg: 2.03 [317/416/1] test_strftime
  390. 0:16:24 load avg: 2.03 [318/416/1] test_string
  391. 0:16:25 load avg: 2.03 [319/416/1] test_string_literals
  392. 0:16:26 load avg: 2.03 [320/416/1] test_stringprep
  393. 0:16:26 load avg: 2.03 [321/416/1] test_strptime
  394. 0:16:27 load avg: 2.02 [322/416/1] test_strtod
  395. 0:16:28 load avg: 2.02 [323/416/1] test_struct
  396. 0:16:29 load avg: 2.02 [324/416/1] test_structmembers
  397. 0:16:30 load avg: 2.02 [325/416/1] test_structseq
  398. 0:16:30 load avg: 2.02 [326/416/1] test_subclassinit
  399. 0:16:31 load avg: 2.02 [327/416/1] test_subprocess
  400. 0:17:05 load avg: 2.27 [328/416/1] test_sunau -- test_subprocess passed in 34 sec 461 ms
  401. 0:17:06 load avg: 2.27 [329/416/1] test_sundry
  402. 0:17:07 load avg: 2.27 [330/416/1] test_super
  403. 0:17:07 load avg: 2.33 [331/416/1] test_symbol
  404. 0:17:08 load avg: 2.33 [332/416/1] test_symtable
  405. 0:17:08 load avg: 2.33 [333/416/1] test_syntax
  406. 0:17:09 load avg: 2.33 [334/416/1] test_sys
  407. 0:17:10 load avg: 2.33 [335/416/1] test_sys_setprofile
  408. 0:17:11 load avg: 2.33 [336/416/1] test_sys_settrace
  409. 0:17:12 load avg: 2.33 [337/416/1] test_sysconfig
  410. 0:17:12 load avg: 2.30 [338/416/1] test_syslog
  411. 0:17:13 load avg: 2.30 [339/416/1] test_tarfile
  412. 0:17:23 load avg: 2.71 [340/416/1] test_tcl
  413. test_tcl skipped -- No module named '_tkinter'
  414. 0:17:23 load avg: 2.71 [341/416/1] test_telnetlib -- test_tcl skipped
  415. 0:17:24 load avg: 2.71 [342/416/1] test_tempfile
  416. 0:17:25 load avg: 2.71 [343/416/1] test_textwrap
  417. 0:17:26 load avg: 2.71 [344/416/1] test_thread
  418. 0:17:28 load avg: 2.81 [345/416/1] test_threaded_import
  419. 0:17:30 load avg: 2.81 [346/416/1] test_threadedtempfile
  420. 0:17:31 load avg: 2.81 [347/416/1] test_threading
  421. 0:17:42 load avg: 2.41 [348/416/1] test_threading_local
  422. 0:17:44 load avg: 2.41 [349/416/1] test_threadsignals
  423. 0:17:47 load avg: 2.41 [350/416/1] test_time
  424. 0:17:50 load avg: 2.45 [351/416/1] test_timeit
  425. 0:17:50 load avg: 2.45 [352/416/1] test_timeout
  426. test_timeout skipped -- Use of the 'network' resource not enabled
  427. 0:17:51 load avg: 2.45 [353/416/1] test_tix -- test_timeout skipped (resource denied)
  428. test_tix skipped -- No module named '_tkinter'
  429. 0:17:51 load avg: 2.45 [354/416/1] test_tk -- test_tix skipped
  430. test_tk skipped -- No module named '_tkinter'
  431. 0:17:51 load avg: 2.45 [355/416/1] test_tokenize -- test_tk skipped
  432. 0:17:53 load avg: 2.34 [356/416/1] test_tools
  433. 0:17:53 load avg: 2.34 [357/416/1] test_trace
  434. 0:17:57 load avg: 2.39 [358/416/1] test_traceback
  435. 0:17:58 load avg: 2.39 [359/416/1] test_tracemalloc
  436. 0:18:00 load avg: 2.39 [360/416/1] test_ttk_guionly
  437. test_ttk_guionly skipped -- No module named '_tkinter'
  438. 0:18:00 load avg: 2.39 [361/416/1] test_ttk_textonly -- test_ttk_guionly skipped
  439. test_ttk_textonly skipped -- No module named '_tkinter'
  440. 0:18:00 load avg: 2.39 [362/416/1] test_tuple -- test_ttk_textonly skipped
  441. 0:18:11 load avg: 2.64 [363/416/1] test_turtle
  442. test_turtle skipped -- No module named '_tkinter'
  443. 0:18:11 load avg: 2.64 [364/416/1] test_typechecks -- test_turtle skipped
  444. 0:18:12 load avg: 2.64 [365/416/1] test_typing
  445. 0:18:12 load avg: 2.64 [366/416/1] test_ucn
  446. 0:18:13 load avg: 3.15 [367/416/1] test_unary
  447. 0:18:14 load avg: 3.15 [368/416/1] test_unicode
  448. 0:18:16 load avg: 3.15 [369/416/1] test_unicode_file
  449. 0:18:16 load avg: 3.15 [370/416/1] test_unicode_file_functions
  450. 0:18:17 load avg: 3.15 [371/416/1] test_unicode_identifiers
  451. 0:18:18 load avg: 3.14 [372/416/1] test_unicodedata
  452. 0:18:20 load avg: 3.14 [373/416/1] test_univnewlines
  453. 0:18:21 load avg: 3.14 [374/416/1] test_unpack
  454. 0:18:22 load avg: 3.14 [375/416/1] test_unpack_ex
  455. 0:18:22 load avg: 3.14 [376/416/1] test_urllib
  456. 0:18:24 load avg: 3.21 [377/416/1] test_urllib2
  457. 0:18:25 load avg: 3.21 [378/416/1] test_urllib2_localnet
  458. 0:18:27 load avg: 3.21 [379/416/1] test_urllib2net
  459. test_urllib2net skipped -- Use of the 'network' resource not enabled
  460. 0:18:27 load avg: 3.21 [380/416/1] test_urllib_response -- test_urllib2net skipped (resource denied)
  461. 0:18:28 load avg: 3.43 [381/416/1] test_urllibnet
  462. test_urllibnet skipped -- Use of the 'network' resource not enabled
  463. 0:18:28 load avg: 3.43 [382/416/1] test_urlparse -- test_urllibnet skipped (resource denied)
  464. 0:18:30 load avg: 3.43 [383/416/1] test_userdict
  465. 0:18:31 load avg: 3.43 [384/416/1] test_userlist
  466. 0:18:32 load avg: 3.43 [385/416/1] test_userstring
  467. 0:18:34 load avg: 3.24 [386/416/1] test_utf8_mode
  468. 0:18:35 load avg: 3.24 [387/416/1] test_utf8source
  469. 0:18:36 load avg: 3.24 [388/416/1] test_uu
  470. 0:18:36 load avg: 3.24 [389/416/1] test_uuid
  471. 0:18:37 load avg: 3.24 [390/416/1] test_venv
  472. 0:18:47 load avg: 3.20 [391/416/1] test_wait3
  473. 0:18:54 load avg: 2.94 [392/416/1] test_wait4
  474. 0:19:00 load avg: 2.95 [393/416/1] test_warnings
  475. 0:19:02 load avg: 2.95 [394/416/1] test_wave
  476. 0:19:02 load avg: 2.95 [395/416/1] test_weakref
  477. 0:19:21 load avg: 2.75 [396/416/1] test_weakset
  478. 0:19:22 load avg: 2.75 [397/416/1] test_webbrowser
  479. 0:19:23 load avg: 2.75 [398/416/1] test_winconsoleio
  480. test_winconsoleio skipped -- test only relevant on win32
  481. 0:19:23 load avg: 2.75 [399/416/1] test_winreg -- test_winconsoleio skipped
  482. test_winreg skipped -- No module named 'winreg'
  483. 0:19:24 load avg: 2.69 [400/416/1] test_winsound -- test_winreg skipped
  484. test_winsound skipped -- Use of the 'audio' resource not enabled
  485. 0:19:24 load avg: 2.69 [401/416/1] test_with -- test_winsound skipped (resource denied)
  486. 0:19:24 load avg: 2.69 [402/416/1] test_wsgiref
  487. 0:19:25 load avg: 2.69 [403/416/1] test_xdrlib
  488. 0:19:26 load avg: 2.69 [404/416/1] test_xml_dom_minicompat
  489. 0:19:26 load avg: 2.69 [405/416/1] test_xml_etree
  490. 0:19:28 load avg: 2.69 [406/416/1] test_xml_etree_c
  491. 0:19:31 load avg: 3.11 [407/416/1] test_xmlrpc
  492. 0:19:35 load avg: 3.03 [408/416/1] test_xmlrpc_net
  493. test_xmlrpc_net skipped -- Use of the 'network' resource not enabled
  494. 0:19:36 load avg: 3.03 [409/416/1] test_xxtestfuzz -- test_xmlrpc_net skipped (resource denied)
  495. 0:19:37 load avg: 3.03 [410/416/1] test_yield_from
  496. 0:19:37 load avg: 3.03 [411/416/1] test_zipapp
  497. 0:19:38 load avg: 3.03 [412/416/1] test_zipfile
  498. 0:19:47 load avg: 3.09 [413/416/1] test_zipfile64
  499. test_zipfile64 skipped -- test requires loads of disk-space bytes and a long time to run
  500. 0:19:47 load avg: 3.09 [414/416/1] test_zipimport -- test_zipfile64 skipped (resource denied)
  501. 0:19:48 load avg: 3.09 [415/416/1] test_zipimport_support
  502. 0:19:49 load avg: 3.01 [416/416/1] test_zlib
  503.  
  504. == Tests result: FAILURE ==
  505.  
  506. 386 tests OK.
  507.  
  508. 1 test failed:
  509. test_py_compile
  510.  
  511. 29 tests skipped:
  512. test_asdl_parser test_clinic test_curses test_dbm_gnu test_devpoll
  513. test_epoll test_gdb test_idle test_msilib
  514. test_multiprocessing_fork test_ossaudiodev test_smtpnet
  515. test_socketserver test_spwd test_startfile test_tcl test_timeout
  516. test_tix test_tk test_ttk_guionly test_ttk_textonly test_turtle
  517. test_urllib2net test_urllibnet test_winconsoleio test_winreg
  518. test_winsound test_xmlrpc_net test_zipfile64
  519.  
  520. Total duration: 19 min 50 sec
  521. Tests result: FAILURE
RAW Paste Data