SHARE
TWEET

glib2 fails on Snow Leopard

a guest May 4th, 2017 22 Never
Not a member of Pastebin yet? Sign Up, it unlocks many cool features!
  1. version:1
  2. :debug:clean Attempting ln -sf /opt/local/var/macports/build/_opt_local_var_macports_sources_rsync.macports.org_macports_release_tarballs_ports_devel_glib2/glib2/work /opt/local/var/macports/sources/rsync.macports.org/macports/release/tarballs/ports/devel/glib2/work
  3. :debug:clean dropping privileges: euid changed to 502, egid changed to 501.
  4. :debug:main Executing org.macports.main (glib2)
  5. :debug:main Privilege de-escalation not attempted as not running as root.
  6. :debug:archivefetch archivefetch phase started at Thu May  4 14:36:54 EDT 2017
  7. :debug:archivefetch Executing org.macports.archivefetch (glib2)
  8. :debug:archivefetch Privilege de-escalation not attempted as not running as root.
  9. :debug:fetch fetch phase started at Thu May  4 14:36:55 EDT 2017
  10. :notice:fetch --->  Fetching distfiles for glib2
  11. :debug:fetch elevating privileges for fetch: euid changed to 0, egid changed to 0.
  12. :debug:fetch dropping privileges: euid changed to 502, egid changed to 501.
  13. :debug:fetch Executing org.macports.fetch (glib2)
  14. :info:fetch --->  glib-2.50.3.tar.xz does not exist in /opt/local/var/macports/distfiles/glib2
  15. :notice:fetch --->  Attempting to fetch glib-2.50.3.tar.xz from http://ykf.ca.distfiles.macports.org/MacPorts/mpdistfiles/glib2
  16. :debug:fetch Fetching distfile failed: The requested URL returned error: 404
  17. :notice:fetch --->  Attempting to fetch glib-2.50.3.tar.xz from http://ftp.cse.buffalo.edu/pub/Gnome/sources/glib/2.50/
  18. :debug:fetch Privilege de-escalation not attempted as not running as root.
  19. :debug:checksum checksum phase started at Thu May  4 14:37:06 EDT 2017
  20. :notice:checksum --->  Verifying checksums for glib2
  21. :debug:checksum Executing org.macports.checksum (glib2)
  22. :info:checksum --->  Checksumming glib-2.50.3.tar.xz
  23. :debug:checksum Calculated (rmd160) is 3bc3bf5ae5d9997520e970c5c5a269538d871889
  24. :debug:checksum Correct (rmd160) checksum for glib-2.50.3.tar.xz
  25. :debug:checksum Calculated (sha256) is 82ee94bf4c01459b6b00cb9db0545c2237921e3060c0b74cff13fbc020cfd999
  26. :debug:checksum Correct (sha256) checksum for glib-2.50.3.tar.xz
  27. :debug:checksum Privilege de-escalation not attempted as not running as root.
  28. :debug:extract extract phase started at Thu May  4 14:37:06 EDT 2017
  29. :notice:extract --->  Extracting glib2
  30. :debug:extract setting option extract.cmd to /opt/local/bin/xz
  31. :debug:extract Executing org.macports.extract (glib2)
  32. :info:extract --->  Extracting glib-2.50.3.tar.xz
  33. :debug:extract setting option extract.args to '/opt/local/var/macports/distfiles/glib2/glib-2.50.3.tar.xz'
  34. :debug:extract Environment:
  35. :debug:extract CC_PRINT_OPTIONS='YES'
  36. :debug:extract CC_PRINT_OPTIONS_FILE='/opt/local/var/macports/build/_opt_local_var_macports_sources_rsync.macports.org_macports_release_tarballs_ports_devel_glib2/glib2/work/.CC_PRINT_OPTIONS'
  37. :debug:extract CPATH='/opt/local/include'
  38. :debug:extract LIBRARY_PATH='/opt/local/lib'
  39. :debug:extract MACOSX_DEPLOYMENT_TARGET='10.6'
  40. :info:extract Executing:  cd "/opt/local/var/macports/build/_opt_local_var_macports_sources_rsync.macports.org_macports_release_tarballs_ports_devel_glib2/glib2/work" && /opt/local/bin/xz -dc '/opt/local/var/macports/distfiles/glib2/glib-2.50.3.tar.xz' | /usr/bin/gnutar --no-same-owner -xf -
  41. :debug:extract system:  cd "/opt/local/var/macports/build/_opt_local_var_macports_sources_rsync.macports.org_macports_release_tarballs_ports_devel_glib2/glib2/work" && /opt/local/bin/xz -dc '/opt/local/var/macports/distfiles/glib2/glib-2.50.3.tar.xz' | /usr/bin/gnutar --no-same-owner -xf -
  42. :debug:extract euid/egid changed to: 0/0
  43. :debug:extract chowned /opt/local/var/macports/build/_opt_local_var_macports_sources_rsync.macports.org_macports_release_tarballs_ports_devel_glib2/glib2/work to macports
  44. :debug:extract euid/egid changed to: 502/501
  45. :debug:extract Privilege de-escalation not attempted as not running as root.
  46. :debug:patch patch phase started at Thu May  4 14:37:08 EDT 2017
  47. :debug:patch Executing org.macports.patch (glib2)
  48. :notice:patch --->  Applying patches to glib2
  49. :info:patch --->  Applying patch-configure.diff
  50. :debug:patch Environment:
  51. :debug:patch CC_PRINT_OPTIONS='YES'
  52. :debug:patch CC_PRINT_OPTIONS_FILE='/opt/local/var/macports/build/_opt_local_var_macports_sources_rsync.macports.org_macports_release_tarballs_ports_devel_glib2/glib2/work/.CC_PRINT_OPTIONS'
  53. :debug:patch CPATH='/opt/local/include'
  54. :debug:patch LIBRARY_PATH='/opt/local/lib'
  55. :debug:patch MACOSX_DEPLOYMENT_TARGET='10.6'
  56. :info:patch Executing:  cd "/opt/local/var/macports/build/_opt_local_var_macports_sources_rsync.macports.org_macports_release_tarballs_ports_devel_glib2/glib2/work/glib-2.50.3" && /usr/bin/patch -p0 < '/opt/local/var/macports/sources/rsync.macports.org/macports/release/tarballs/ports/devel/glib2/files/patch-configure.diff'
  57. :debug:patch system:  cd "/opt/local/var/macports/build/_opt_local_var_macports_sources_rsync.macports.org_macports_release_tarballs_ports_devel_glib2/glib2/work/glib-2.50.3" && /usr/bin/patch -p0 < '/opt/local/var/macports/sources/rsync.macports.org/macports/release/tarballs/ports/devel/glib2/files/patch-configure.diff'
  58. :info:patch patching file configure
  59. :info:patch Hunk #2 succeeded at 30788 (offset 12 lines).
  60. :info:patch Hunk #3 succeeded at 32449 (offset 12 lines).
  61. :info:patch Hunk #4 succeeded at 32486 (offset 12 lines).
  62. :info:patch Hunk #5 succeeded at 32527 (offset 12 lines).
  63. :info:patch Hunk #6 succeeded at 32648 (offset 12 lines).
  64. :info:patch Hunk #7 succeeded at 32660 (offset 12 lines).
  65. :info:patch --->  Applying patch-glib-2.0.pc.in.diff
  66. :debug:patch Environment:
  67. :debug:patch CC_PRINT_OPTIONS='YES'
  68. :debug:patch CC_PRINT_OPTIONS_FILE='/opt/local/var/macports/build/_opt_local_var_macports_sources_rsync.macports.org_macports_release_tarballs_ports_devel_glib2/glib2/work/.CC_PRINT_OPTIONS'
  69. :debug:patch CPATH='/opt/local/include'
  70. :debug:patch LIBRARY_PATH='/opt/local/lib'
  71. :debug:patch MACOSX_DEPLOYMENT_TARGET='10.6'
  72. :info:patch Executing:  cd "/opt/local/var/macports/build/_opt_local_var_macports_sources_rsync.macports.org_macports_release_tarballs_ports_devel_glib2/glib2/work/glib-2.50.3" && /usr/bin/patch -p0 < '/opt/local/var/macports/sources/rsync.macports.org/macports/release/tarballs/ports/devel/glib2/files/patch-glib-2.0.pc.in.diff'
  73. :debug:patch system:  cd "/opt/local/var/macports/build/_opt_local_var_macports_sources_rsync.macports.org_macports_release_tarballs_ports_devel_glib2/glib2/work/glib-2.50.3" && /usr/bin/patch -p0 < '/opt/local/var/macports/sources/rsync.macports.org/macports/release/tarballs/ports/devel/glib2/files/patch-glib-2.0.pc.in.diff'
  74. :info:patch patching file glib-2.0.pc.in
  75. :info:patch --->  Applying patch-glib-gmain.c.diff
  76. :debug:patch Environment:
  77. :debug:patch CC_PRINT_OPTIONS='YES'
  78. :debug:patch CC_PRINT_OPTIONS_FILE='/opt/local/var/macports/build/_opt_local_var_macports_sources_rsync.macports.org_macports_release_tarballs_ports_devel_glib2/glib2/work/.CC_PRINT_OPTIONS'
  79. :debug:patch CPATH='/opt/local/include'
  80. :debug:patch LIBRARY_PATH='/opt/local/lib'
  81. :debug:patch MACOSX_DEPLOYMENT_TARGET='10.6'
  82. :info:patch Executing:  cd "/opt/local/var/macports/build/_opt_local_var_macports_sources_rsync.macports.org_macports_release_tarballs_ports_devel_glib2/glib2/work/glib-2.50.3" && /usr/bin/patch -p0 < '/opt/local/var/macports/sources/rsync.macports.org/macports/release/tarballs/ports/devel/glib2/files/patch-glib-gmain.c.diff'
  83. :debug:patch system:  cd "/opt/local/var/macports/build/_opt_local_var_macports_sources_rsync.macports.org_macports_release_tarballs_ports_devel_glib2/glib2/work/glib-2.50.3" && /usr/bin/patch -p0 < '/opt/local/var/macports/sources/rsync.macports.org/macports/release/tarballs/ports/devel/glib2/files/patch-glib-gmain.c.diff'
  84. :info:patch patching file glib/gmain.c
  85. :info:patch Hunk #1 succeeded at 2786 (offset 2 lines).
  86. :info:patch --->  Applying patch-glib_gunicollate.c.diff
  87. :debug:patch Environment:
  88. :debug:patch CC_PRINT_OPTIONS='YES'
  89. :debug:patch CC_PRINT_OPTIONS_FILE='/opt/local/var/macports/build/_opt_local_var_macports_sources_rsync.macports.org_macports_release_tarballs_ports_devel_glib2/glib2/work/.CC_PRINT_OPTIONS'
  90. :debug:patch CPATH='/opt/local/include'
  91. :debug:patch LIBRARY_PATH='/opt/local/lib'
  92. :debug:patch MACOSX_DEPLOYMENT_TARGET='10.6'
  93. :info:patch Executing:  cd "/opt/local/var/macports/build/_opt_local_var_macports_sources_rsync.macports.org_macports_release_tarballs_ports_devel_glib2/glib2/work/glib-2.50.3" && /usr/bin/patch -p0 < '/opt/local/var/macports/sources/rsync.macports.org/macports/release/tarballs/ports/devel/glib2/files/patch-glib_gunicollate.c.diff'
  94. :debug:patch system:  cd "/opt/local/var/macports/build/_opt_local_var_macports_sources_rsync.macports.org_macports_release_tarballs_ports_devel_glib2/glib2/work/glib-2.50.3" && /usr/bin/patch -p0 < '/opt/local/var/macports/sources/rsync.macports.org/macports/release/tarballs/ports/devel/glib2/files/patch-glib_gunicollate.c.diff'
  95. :info:patch patching file glib/gunicollate.c
  96. :info:patch --->  Applying patch-gi18n.h.diff
  97. :debug:patch Environment:
  98. :debug:patch CC_PRINT_OPTIONS='YES'
  99. :debug:patch CC_PRINT_OPTIONS_FILE='/opt/local/var/macports/build/_opt_local_var_macports_sources_rsync.macports.org_macports_release_tarballs_ports_devel_glib2/glib2/work/.CC_PRINT_OPTIONS'
  100. :debug:patch CPATH='/opt/local/include'
  101. :debug:patch LIBRARY_PATH='/opt/local/lib'
  102. :debug:patch MACOSX_DEPLOYMENT_TARGET='10.6'
  103. :info:patch Executing:  cd "/opt/local/var/macports/build/_opt_local_var_macports_sources_rsync.macports.org_macports_release_tarballs_ports_devel_glib2/glib2/work/glib-2.50.3" && /usr/bin/patch -p0 < '/opt/local/var/macports/sources/rsync.macports.org/macports/release/tarballs/ports/devel/glib2/files/patch-gi18n.h.diff'
  104. :debug:patch system:  cd "/opt/local/var/macports/build/_opt_local_var_macports_sources_rsync.macports.org_macports_release_tarballs_ports_devel_glib2/glib2/work/glib-2.50.3" && /usr/bin/patch -p0 < '/opt/local/var/macports/sources/rsync.macports.org/macports/release/tarballs/ports/devel/glib2/files/patch-gi18n.h.diff'
  105. :info:patch patching file glib/gi18n.h
  106. :info:patch --->  Applying patch-gio_xdgmime_xdgmime.c.diff
  107. :debug:patch Environment:
  108. :debug:patch CC_PRINT_OPTIONS='YES'
  109. :debug:patch CC_PRINT_OPTIONS_FILE='/opt/local/var/macports/build/_opt_local_var_macports_sources_rsync.macports.org_macports_release_tarballs_ports_devel_glib2/glib2/work/.CC_PRINT_OPTIONS'
  110. :debug:patch CPATH='/opt/local/include'
  111. :debug:patch LIBRARY_PATH='/opt/local/lib'
  112. :debug:patch MACOSX_DEPLOYMENT_TARGET='10.6'
  113. :info:patch Executing:  cd "/opt/local/var/macports/build/_opt_local_var_macports_sources_rsync.macports.org_macports_release_tarballs_ports_devel_glib2/glib2/work/glib-2.50.3" && /usr/bin/patch -p0 < '/opt/local/var/macports/sources/rsync.macports.org/macports/release/tarballs/ports/devel/glib2/files/patch-gio_xdgmime_xdgmime.c.diff'
  114. :debug:patch system:  cd "/opt/local/var/macports/build/_opt_local_var_macports_sources_rsync.macports.org_macports_release_tarballs_ports_devel_glib2/glib2/work/glib-2.50.3" && /usr/bin/patch -p0 < '/opt/local/var/macports/sources/rsync.macports.org/macports/release/tarballs/ports/devel/glib2/files/patch-gio_xdgmime_xdgmime.c.diff'
  115. :info:patch patching file gio/xdgmime/xdgmime.c
  116. :info:patch --->  Applying patch-gio_gdbusprivate.c.diff
  117. :debug:patch Environment:
  118. :debug:patch CC_PRINT_OPTIONS='YES'
  119. :debug:patch CC_PRINT_OPTIONS_FILE='/opt/local/var/macports/build/_opt_local_var_macports_sources_rsync.macports.org_macports_release_tarballs_ports_devel_glib2/glib2/work/.CC_PRINT_OPTIONS'
  120. :debug:patch CPATH='/opt/local/include'
  121. :debug:patch LIBRARY_PATH='/opt/local/lib'
  122. :debug:patch MACOSX_DEPLOYMENT_TARGET='10.6'
  123. :info:patch Executing:  cd "/opt/local/var/macports/build/_opt_local_var_macports_sources_rsync.macports.org_macports_release_tarballs_ports_devel_glib2/glib2/work/glib-2.50.3" && /usr/bin/patch -p0 < '/opt/local/var/macports/sources/rsync.macports.org/macports/release/tarballs/ports/devel/glib2/files/patch-gio_gdbusprivate.c.diff'
  124. :debug:patch system:  cd "/opt/local/var/macports/build/_opt_local_var_macports_sources_rsync.macports.org_macports_release_tarballs_ports_devel_glib2/glib2/work/glib-2.50.3" && /usr/bin/patch -p0 < '/opt/local/var/macports/sources/rsync.macports.org/macports/release/tarballs/ports/devel/glib2/files/patch-gio_gdbusprivate.c.diff'
  125. :info:patch patching file gio/gdbusprivate.c
  126. :info:patch --->  Applying patch-get-launchd-dbus-session-address.diff
  127. :debug:patch Environment:
  128. :debug:patch CC_PRINT_OPTIONS='YES'
  129. :debug:patch CC_PRINT_OPTIONS_FILE='/opt/local/var/macports/build/_opt_local_var_macports_sources_rsync.macports.org_macports_release_tarballs_ports_devel_glib2/glib2/work/.CC_PRINT_OPTIONS'
  130. :debug:patch CPATH='/opt/local/include'
  131. :debug:patch LIBRARY_PATH='/opt/local/lib'
  132. :debug:patch MACOSX_DEPLOYMENT_TARGET='10.6'
  133. :info:patch Executing:  cd "/opt/local/var/macports/build/_opt_local_var_macports_sources_rsync.macports.org_macports_release_tarballs_ports_devel_glib2/glib2/work/glib-2.50.3" && /usr/bin/patch -p0 < '/opt/local/var/macports/sources/rsync.macports.org/macports/release/tarballs/ports/devel/glib2/files/patch-get-launchd-dbus-session-address.diff'
  134. :debug:patch system:  cd "/opt/local/var/macports/build/_opt_local_var_macports_sources_rsync.macports.org_macports_release_tarballs_ports_devel_glib2/glib2/work/glib-2.50.3" && /usr/bin/patch -p0 < '/opt/local/var/macports/sources/rsync.macports.org/macports/release/tarballs/ports/devel/glib2/files/patch-get-launchd-dbus-session-address.diff'
  135. :info:patch patching file gio/gdbusaddress.c
  136. :info:patch --->  Applying patch-gmodule-gmodule-dl.c.diff
  137. :debug:patch Environment:
  138. :debug:patch CC_PRINT_OPTIONS='YES'
  139. :debug:patch CC_PRINT_OPTIONS_FILE='/opt/local/var/macports/build/_opt_local_var_macports_sources_rsync.macports.org_macports_release_tarballs_ports_devel_glib2/glib2/work/.CC_PRINT_OPTIONS'
  140. :debug:patch CPATH='/opt/local/include'
  141. :debug:patch LIBRARY_PATH='/opt/local/lib'
  142. :debug:patch MACOSX_DEPLOYMENT_TARGET='10.6'
  143. :info:patch Executing:  cd "/opt/local/var/macports/build/_opt_local_var_macports_sources_rsync.macports.org_macports_release_tarballs_ports_devel_glib2/glib2/work/glib-2.50.3" && /usr/bin/patch -p0 < '/opt/local/var/macports/sources/rsync.macports.org/macports/release/tarballs/ports/devel/glib2/files/patch-gmodule-gmodule-dl.c.diff'
  144. :debug:patch system:  cd "/opt/local/var/macports/build/_opt_local_var_macports_sources_rsync.macports.org_macports_release_tarballs_ports_devel_glib2/glib2/work/glib-2.50.3" && /usr/bin/patch -p0 < '/opt/local/var/macports/sources/rsync.macports.org/macports/release/tarballs/ports/devel/glib2/files/patch-gmodule-gmodule-dl.c.diff'
  145. :info:patch patching file gmodule/gmodule-dl.c
  146. :info:patch --->  Applying remove-gcocoanotificationbackend.patch
  147. :debug:patch Environment:
  148. :debug:patch CC_PRINT_OPTIONS='YES'
  149. :debug:patch CC_PRINT_OPTIONS_FILE='/opt/local/var/macports/build/_opt_local_var_macports_sources_rsync.macports.org_macports_release_tarballs_ports_devel_glib2/glib2/work/.CC_PRINT_OPTIONS'
  150. :debug:patch CPATH='/opt/local/include'
  151. :debug:patch LIBRARY_PATH='/opt/local/lib'
  152. :debug:patch MACOSX_DEPLOYMENT_TARGET='10.6'
  153. :info:patch Executing:  cd "/opt/local/var/macports/build/_opt_local_var_macports_sources_rsync.macports.org_macports_release_tarballs_ports_devel_glib2/glib2/work/glib-2.50.3" && /usr/bin/patch -p0 < '/opt/local/var/macports/sources/rsync.macports.org/macports/release/tarballs/ports/devel/glib2/files/remove-gcocoanotificationbackend.patch'
  154. :debug:patch system:  cd "/opt/local/var/macports/build/_opt_local_var_macports_sources_rsync.macports.org_macports_release_tarballs_ports_devel_glib2/glib2/work/glib-2.50.3" && /usr/bin/patch -p0 < '/opt/local/var/macports/sources/rsync.macports.org/macports/release/tarballs/ports/devel/glib2/files/remove-gcocoanotificationbackend.patch'
  155. :info:patch patching file configure
  156. :info:patch patching file gio/Makefile.in
  157. :info:patch patching file gio/giomodule.c
  158. :debug:patch Executing proc-post-org.macports.patch-patch-0
  159. :info:patch --->  Patching gutils.c: s|data_dirs = "/usr|data_dirs = "/opt/local/share:/usr|g
  160. :debug:patch Executing reinplace: /usr/bin/sed {s|data_dirs = "/usr|data_dirs = "/opt/local/share:/usr|g} </opt/local/var/macports/build/_opt_local_var_macports_sources_rsync.macports.org_macports_release_tarballs_ports_devel_glib2/glib2/work/glib-2.50.3/glib/gutils.c >@file13
  161. :debug:patch euid/egid changed to: 0/0
  162. :debug:patch chowned /opt/local/var/macports/build/_opt_local_var_macports_sources_rsync.macports.org_macports_release_tarballs_ports_devel_glib2/glib2/work/glib-2.50.3/glib/gutils.c to macports
  163. :debug:patch euid/egid changed to: 502/501
  164. :debug:patch euid/egid changed to: 0/0
  165. :debug:patch setting attributes on /opt/local/var/macports/build/_opt_local_var_macports_sources_rsync.macports.org_macports_release_tarballs_ports_devel_glib2/glib2/work/glib-2.50.3/glib/gutils.c
  166. :debug:patch euid/egid changed to: 502/501
  167. :info:patch --->  Patching gutils.c: s|path = "/bin|path = "/opt/local/bin:/bin|g
  168. :debug:patch Executing reinplace: /usr/bin/sed {s|path = "/bin|path = "/opt/local/bin:/bin|g} </opt/local/var/macports/build/_opt_local_var_macports_sources_rsync.macports.org_macports_release_tarballs_ports_devel_glib2/glib2/work/glib-2.50.3/glib/gutils.c >@file13
  169. :debug:patch euid/egid changed to: 0/0
  170. :debug:patch chowned /opt/local/var/macports/build/_opt_local_var_macports_sources_rsync.macports.org_macports_release_tarballs_ports_devel_glib2/glib2/work/glib-2.50.3/glib/gutils.c to macports
  171. :debug:patch euid/egid changed to: 502/501
  172. :debug:patch euid/egid changed to: 0/0
  173. :debug:patch setting attributes on /opt/local/var/macports/build/_opt_local_var_macports_sources_rsync.macports.org_macports_release_tarballs_ports_devel_glib2/glib2/work/glib-2.50.3/glib/gutils.c
  174. :debug:patch euid/egid changed to: 502/501
  175. :info:patch --->  Patching gspawn.c: s|path = "/bin|path = "/opt/local/bin:/bin|g
  176. :debug:patch Executing reinplace: /usr/bin/sed {s|path = "/bin|path = "/opt/local/bin:/bin|g} </opt/local/var/macports/build/_opt_local_var_macports_sources_rsync.macports.org_macports_release_tarballs_ports_devel_glib2/glib2/work/glib-2.50.3/glib/gspawn.c >@file13
  177. :debug:patch euid/egid changed to: 0/0
  178. :debug:patch chowned /opt/local/var/macports/build/_opt_local_var_macports_sources_rsync.macports.org_macports_release_tarballs_ports_devel_glib2/glib2/work/glib-2.50.3/glib/gspawn.c to macports
  179. :debug:patch euid/egid changed to: 502/501
  180. :debug:patch euid/egid changed to: 0/0
  181. :debug:patch setting attributes on /opt/local/var/macports/build/_opt_local_var_macports_sources_rsync.macports.org_macports_release_tarballs_ports_devel_glib2/glib2/work/glib-2.50.3/glib/gspawn.c
  182. :debug:patch euid/egid changed to: 502/501
  183. :info:patch --->  Patching xdgmime.c: s|@@PREFIX@@|/opt/local|g
  184. :debug:patch Executing reinplace: /usr/bin/sed s|@@PREFIX@@|/opt/local|g </opt/local/var/macports/build/_opt_local_var_macports_sources_rsync.macports.org_macports_release_tarballs_ports_devel_glib2/glib2/work/glib-2.50.3/gio/xdgmime/xdgmime.c >@file13
  185. :debug:patch euid/egid changed to: 0/0
  186. :debug:patch chowned /opt/local/var/macports/build/_opt_local_var_macports_sources_rsync.macports.org_macports_release_tarballs_ports_devel_glib2/glib2/work/glib-2.50.3/gio/xdgmime/xdgmime.c to macports
  187. :debug:patch euid/egid changed to: 502/501
  188. :debug:patch euid/egid changed to: 0/0
  189. :debug:patch setting attributes on /opt/local/var/macports/build/_opt_local_var_macports_sources_rsync.macports.org_macports_release_tarballs_ports_devel_glib2/glib2/work/glib-2.50.3/gio/xdgmime/xdgmime.c
  190. :debug:patch euid/egid changed to: 502/501
  191. :info:patch --->  Patching gdbusprivate.c: s|@@PREFIX@@|/opt/local|g
  192. :debug:patch Executing reinplace: /usr/bin/sed s|@@PREFIX@@|/opt/local|g </opt/local/var/macports/build/_opt_local_var_macports_sources_rsync.macports.org_macports_release_tarballs_ports_devel_glib2/glib2/work/glib-2.50.3/gio/gdbusprivate.c >@file13
  193. :debug:patch euid/egid changed to: 0/0
  194. :debug:patch chowned /opt/local/var/macports/build/_opt_local_var_macports_sources_rsync.macports.org_macports_release_tarballs_ports_devel_glib2/glib2/work/glib-2.50.3/gio/gdbusprivate.c to macports
  195. :debug:patch euid/egid changed to: 502/501
  196. :debug:patch euid/egid changed to: 0/0
  197. :debug:patch setting attributes on /opt/local/var/macports/build/_opt_local_var_macports_sources_rsync.macports.org_macports_release_tarballs_ports_devel_glib2/glib2/work/glib-2.50.3/gio/gdbusprivate.c
  198. :debug:patch euid/egid changed to: 502/501
  199. :info:patch --->  Patching gtester-report: s|#! */usr/bin/env python|#!/usr/bin/python|g
  200. :debug:patch Executing reinplace: /usr/bin/sed {s|#! */usr/bin/env python|#!/usr/bin/python|g} </opt/local/var/macports/build/_opt_local_var_macports_sources_rsync.macports.org_macports_release_tarballs_ports_devel_glib2/glib2/work/glib-2.50.3/glib/gtester-report >@file13
  201. :debug:patch euid/egid changed to: 0/0
  202. :debug:patch chowned /opt/local/var/macports/build/_opt_local_var_macports_sources_rsync.macports.org_macports_release_tarballs_ports_devel_glib2/glib2/work/glib-2.50.3/glib/gtester-report to macports
  203. :debug:patch euid/egid changed to: 502/501
  204. :debug:patch euid/egid changed to: 0/0
  205. :debug:patch setting attributes on /opt/local/var/macports/build/_opt_local_var_macports_sources_rsync.macports.org_macports_release_tarballs_ports_devel_glib2/glib2/work/glib-2.50.3/glib/gtester-report
  206. :debug:patch euid/egid changed to: 502/501
  207. :info:patch --->  Patching configure: s|-Werror=missing-prototypes||
  208. :debug:patch Executing reinplace: /usr/bin/sed s|-Werror=missing-prototypes|| </opt/local/var/macports/build/_opt_local_var_macports_sources_rsync.macports.org_macports_release_tarballs_ports_devel_glib2/glib2/work/glib-2.50.3/configure >@file13
  209. :debug:patch euid/egid changed to: 0/0
  210. :debug:patch chowned /opt/local/var/macports/build/_opt_local_var_macports_sources_rsync.macports.org_macports_release_tarballs_ports_devel_glib2/glib2/work/glib-2.50.3/configure to macports
  211. :debug:patch euid/egid changed to: 502/501
  212. :debug:patch euid/egid changed to: 0/0
  213. :debug:patch setting attributes on /opt/local/var/macports/build/_opt_local_var_macports_sources_rsync.macports.org_macports_release_tarballs_ports_devel_glib2/glib2/work/glib-2.50.3/configure
  214. :debug:patch euid/egid changed to: 502/501
  215. :debug:patch Privilege de-escalation not attempted as not running as root.
  216. :debug:configure configure phase started at Thu May  4 14:37:09 EDT 2017
  217. :notice:configure --->  Configuring glib2
  218. :debug:configure Preferred compilers: macports-clang-4.0 macports-clang-3.9 macports-clang-3.8 macports-clang-3.7 macports-clang-3.4 gcc-4.2 apple-gcc-4.2 gcc-4.0
  219. :debug:configure Using compiler 'MacPorts Clang 4.0'
  220. :debug:configure Executing proc-pre-org.macports.configure-configure-0
  221. :debug:configure Executing org.macports.configure (glib2)
  222. :debug:configure Environment:
  223. :debug:configure CC='/opt/local/bin/clang-mp-4.0'
  224. :debug:configure CC_PRINT_OPTIONS='YES'
  225. :debug:configure CC_PRINT_OPTIONS_FILE='/opt/local/var/macports/build/_opt_local_var_macports_sources_rsync.macports.org_macports_release_tarballs_ports_devel_glib2/glib2/work/.CC_PRINT_OPTIONS'
  226. :debug:configure CFLAGS='-pipe -Os -fstrict-aliasing -arch x86_64'
  227. :debug:configure CPATH='/opt/local/include'
  228. :debug:configure CPPFLAGS='-I/opt/local/include'
  229. :debug:configure CXX='/opt/local/bin/clang++-mp-4.0'
  230. :debug:configure CXXFLAGS='-pipe -Os -stdlib=libc++ -arch x86_64'
  231. :debug:configure F77FLAGS='-m64'
  232. :debug:configure F90FLAGS='-pipe -Os -m64'
  233. :debug:configure FCFLAGS='-pipe -Os -m64'
  234. :debug:configure FFLAGS='-pipe -Os'
  235. :debug:configure INSTALL='/usr/bin/install -c'
  236. :debug:configure LDFLAGS='-L/opt/local/lib -Wl,-headerpad_max_install_names -lresolv -bind_at_load -arch x86_64'
  237. :debug:configure LIBFFI_CFLAGS='-I/opt/local/lib/libffi-3.2.1/include'
  238. :debug:configure LIBFFI_LIBS='-L/opt/local/lib -lffi'
  239. :debug:configure LIBRARY_PATH='/opt/local/lib'
  240. :debug:configure MACOSX_DEPLOYMENT_TARGET='10.6'
  241. :debug:configure OBJC='/opt/local/bin/clang-mp-4.0'
  242. :debug:configure OBJCFLAGS='-pipe -Os -arch x86_64'
  243. :debug:configure OBJCXX='/opt/local/bin/clang++-mp-4.0'
  244. :debug:configure OBJCXXFLAGS='-pipe -Os -stdlib=libc++ -arch x86_64'
  245. :debug:configure PCRE_CFLAGS='-I/opt/local/include'
  246. :debug:configure PCRE_LIBS='-L/opt/local/lib -lpcre'
  247. :debug:configure PERL='/usr/bin/perl'
  248. :debug:configure PERL_PATH='/usr/bin/perl'
  249. :debug:configure PKG_CONFIG='false'
  250. :debug:configure PYTHON='/usr/bin/python'
  251. :debug:configure ZLIB_CFLAGS='-I/opt/local/include'
  252. :debug:configure ZLIB_LIBS='-L/opt/local/lib -lz'
  253. :info:configure Executing:  cd "/opt/local/var/macports/build/_opt_local_var_macports_sources_rsync.macports.org_macports_release_tarballs_ports_devel_glib2/glib2/work/glib-2.50.3" && ./configure --prefix=/opt/local --enable-static --disable-libelf --disable-compile-warnings --with-pcre=system ac_cv_prog_AWK=/usr/bin/awk --disable-dtrace
  254. :debug:configure system:  cd "/opt/local/var/macports/build/_opt_local_var_macports_sources_rsync.macports.org_macports_release_tarballs_ports_devel_glib2/glib2/work/glib-2.50.3" && ./configure --prefix=/opt/local --enable-static --disable-libelf --disable-compile-warnings --with-pcre=system ac_cv_prog_AWK=/usr/bin/awk --disable-dtrace
  255. :info:configure checking for a BSD-compatible install... /usr/bin/install -c
  256. :info:configure checking whether build environment is sane... yes
  257. :info:configure checking for a thread-safe mkdir -p... ./install-sh -c -d
  258. :info:configure checking for gawk... (cached) /usr/bin/awk
  259. :info:configure checking whether make sets $(MAKE)... yes
  260. :info:configure checking whether make supports nested variables... yes
  261. :info:configure checking whether UID '502' is supported by ustar format... yes
  262. :info:configure checking whether GID '501' is supported by ustar format... yes
  263. :info:configure checking how to create a ustar tar archive... gnutar
  264. :info:configure checking whether to enable maintainer-specific portions of Makefiles... yes
  265. :info:configure checking whether make supports nested variables... (cached) yes
  266. :info:configure checking for gcc... /opt/local/bin/clang-mp-4.0
  267. :info:configure checking whether the C compiler works... yes
  268. :info:configure checking for C compiler default output file name... a.out
  269. :info:configure checking for suffix of executables...
  270. :info:configure checking whether we are cross compiling... no
  271. :info:configure checking for suffix of object files... o
  272. :info:configure checking whether we are using the GNU C compiler... yes
  273. :info:configure checking whether /opt/local/bin/clang-mp-4.0 accepts -g... yes
  274. :info:configure checking for /opt/local/bin/clang-mp-4.0 option to accept ISO C89... none needed
  275. :info:configure checking whether /opt/local/bin/clang-mp-4.0 understands -c and -o together... yes
  276. :info:configure checking for style of include used by make... GNU
  277. :info:configure checking dependency style of /opt/local/bin/clang-mp-4.0... gcc3
  278. :info:configure checking how to run the C preprocessor... /opt/local/bin/clang-mp-4.0 -E
  279. :info:configure checking for grep that handles long lines and -e... /usr/bin/grep
  280. :info:configure checking for egrep... /usr/bin/grep -E
  281. :info:configure checking for ANSI C header files... no
  282. :info:configure checking for sys/types.h... yes
  283. :info:configure checking for sys/stat.h... yes
  284. :info:configure checking for stdlib.h... yes
  285. :info:configure checking for string.h... yes
  286. :info:configure checking for memory.h... yes
  287. :info:configure checking for strings.h... yes
  288. :info:configure checking for inttypes.h... yes
  289. :info:configure checking for stdint.h... yes
  290. :info:configure checking for unistd.h... yes
  291. :info:configure checking minix/config.h usability... no
  292. :info:configure checking minix/config.h presence... no
  293. :info:configure checking for minix/config.h... no
  294. :info:configure checking whether it is safe to define __EXTENSIONS__... yes
  295. :info:configure checking build system type... x86_64-apple-darwin10.8.0
  296. :info:configure checking host system type... x86_64-apple-darwin10.8.0
  297. :info:configure checking for Win32... no
  298. :info:configure checking for the Android... no
  299. :info:configure checking for Mac OS X Carbon support... no
  300. :info:configure checking for Mac OS X Cocoa support... no
  301. :info:configure checking whether to enable garbage collector friendliness... no
  302. :info:configure checking whether to disable memory pools... no
  303. :info:configure checking whether we are using the GNU C++ compiler... yes
  304. :info:configure checking whether /opt/local/bin/clang++-mp-4.0 accepts -g... yes
  305. :info:configure checking dependency style of /opt/local/bin/clang++-mp-4.0... gcc3
  306. :info:configure checking for special C compiler options needed for large files... no
  307. :info:configure checking for _FILE_OFFSET_BITS value needed for large files... no
  308. :info:configure checking pkg-config is at least version 0.16... no
  309. :info:configure checking for gawk... (cached) /usr/bin/awk
  310. :info:configure checking for perl5... /usr/bin/perl
  311. :info:configure checking for indent... indent
  312. :info:configure checking for /usr/bin/perl... /usr/bin/perl
  313. :info:configure checking whether /usr/bin/python version is >= 2.5... yes
  314. :info:configure checking for /usr/bin/python version... 2.6
  315. :info:configure checking for /usr/bin/python platform... darwin
  316. :info:configure checking for /usr/bin/python script directory... ${prefix}/lib/python2.6/site-packages
  317. :info:configure checking for /usr/bin/python extension module directory... ${exec_prefix}/lib/python2.6/site-packages
  318. :info:configure checking for iconv_open... no
  319. :info:configure checking for libiconv_open in -liconv... yes
  320. :info:configure checking for ZLIB... yes
  321. :info:configure checking for LIBFFI... yes
  322. :info:configure checking locale.h usability... yes
  323. :info:configure checking locale.h presence... yes
  324. :info:configure checking for locale.h... yes
  325. :info:configure checking for LC_MESSAGES... yes
  326. :info:configure checking libintl.h usability... yes
  327. :info:configure checking libintl.h presence... yes
  328. :info:configure checking for libintl.h... yes
  329. :info:configure checking for ngettext in libc... no
  330. :info:configure checking for bindtextdomain in -lintl... yes
  331. :info:configure checking for ngettext in -lintl... yes
  332. :info:configure checking for dgettext in -lintl... yes
  333. :info:configure checking for bind_textdomain_codeset... yes
  334. :info:configure checking for msgfmt... /opt/local/bin/msgfmt
  335. :info:configure checking for dcgettext... yes
  336. :info:configure checking if msgfmt accepts -c... yes
  337. :info:configure checking for gmsgfmt... /opt/local/bin/msgfmt
  338. :info:configure checking for xgettext... /opt/local/bin/xgettext
  339. :info:configure checking for catalogs to be installed...  af am an ar as ast az be be@latin bg bn bn_IN bs ca ca@valencia cs cy da de dz el en_CA en_GB en@shaw eo es et eu fa fi fr ga gd gl gu he hi hr hu hy id is it ja ka kk kn ko ku lt lv mai mg mk ml mn mr ms nb nds ne nl nn oc or pa pl ps pt pt_BR ro ru rw si sk sl sq sr sr@latin sr@ije sv ta te tg th tl tr ug tt uk vi wa xh yi zh_CN zh_HK zh_TW
  340. :info:configure checking how to print strings... printf
  341. :info:configure checking for a sed that does not truncate output... /usr/bin/sed
  342. :info:configure checking for fgrep... /usr/bin/grep -F
  343. :info:configure checking for ld used by /opt/local/bin/clang-mp-4.0... /opt/local/libexec/llvm-4.0/bin/ld
  344. :info:configure checking if the linker (/opt/local/libexec/llvm-4.0/bin/ld) is GNU ld... no
  345. :info:configure checking for BSD- or MS-compatible name lister (nm)... /opt/local/bin/nm -B
  346. :info:configure checking the name lister (/opt/local/bin/nm -B) interface... BSD nm
  347. :info:configure checking whether ln -s works... yes
  348. :info:configure checking the maximum length of command line arguments... 196608
  349. :info:configure checking how to convert x86_64-apple-darwin10.8.0 file names to x86_64-apple-darwin10.8.0 format... func_convert_file_noop
  350. :info:configure checking how to convert x86_64-apple-darwin10.8.0 file names to toolchain format... func_convert_file_noop
  351. :info:configure checking for /opt/local/libexec/llvm-4.0/bin/ld option to reload object files... -r
  352. :info:configure checking for objdump... no
  353. :info:configure checking how to recognize dependent libraries... pass_all
  354. :info:configure checking for dlltool... no
  355. :info:configure checking how to associate runtime and link libraries... printf %s\n
  356. :info:configure checking for ar... ar
  357. :info:configure checking for archiver @FILE support... no
  358. :info:configure checking for strip... strip
  359. :info:configure checking for ranlib... ranlib
  360. :info:configure checking command to parse /opt/local/bin/nm -B output from /opt/local/bin/clang-mp-4.0 object... ok
  361. :info:configure checking for sysroot... no
  362. :info:configure checking for a working dd... /bin/dd
  363. :info:configure checking how to truncate binary pipes... /bin/dd bs=4096 count=1
  364. :info:configure checking for mt... no
  365. :info:configure checking if : is a manifest tool... no
  366. :info:configure checking for dsymutil... dsymutil
  367. :info:configure checking for nmedit... nmedit
  368. :info:configure checking for lipo... lipo
  369. :info:configure checking for otool... otool
  370. :info:configure checking for otool64... no
  371. :info:configure checking for -single_module linker flag... yes
  372. :info:configure checking for -exported_symbols_list linker flag... yes
  373. :info:configure checking for -force_load linker flag... yes
  374. :info:configure checking for dlfcn.h... yes
  375. :info:configure checking for objdir... .libs
  376. :info:configure checking if /opt/local/bin/clang-mp-4.0 supports -fno-rtti -fno-exceptions... yes
  377. :info:configure checking for /opt/local/bin/clang-mp-4.0 option to produce PIC... -fno-common -DPIC
  378. :info:configure checking if /opt/local/bin/clang-mp-4.0 PIC flag -fno-common -DPIC works... yes
  379. :info:configure checking if /opt/local/bin/clang-mp-4.0 static flag -static works... no
  380. :info:configure checking if /opt/local/bin/clang-mp-4.0 supports -c -o file.o... yes
  381. :info:configure checking if /opt/local/bin/clang-mp-4.0 supports -c -o file.o... (cached) yes
  382. :info:configure checking whether the /opt/local/bin/clang-mp-4.0 linker (/opt/local/libexec/llvm-4.0/bin/ld) supports shared libraries... yes
  383. :info:configure checking dynamic linker characteristics... darwin10.8.0 dyld
  384. :info:configure checking how to hardcode library paths into programs... immediate
  385. :info:configure checking whether stripping libraries is possible... yes
  386. :info:configure checking if libtool supports shared libraries... yes
  387. :info:configure checking whether to build shared libraries... yes
  388. :info:configure checking whether to build static libraries... yes
  389. :info:configure checking how to run the C++ preprocessor... /opt/local/bin/clang++-mp-4.0 -E
  390. :info:configure checking for ld used by /opt/local/bin/clang++-mp-4.0... /opt/local/libexec/llvm-4.0/bin/ld
  391. :info:configure checking if the linker (/opt/local/libexec/llvm-4.0/bin/ld) is GNU ld... no
  392. :info:configure checking whether the /opt/local/bin/clang++-mp-4.0 linker (/opt/local/libexec/llvm-4.0/bin/ld) supports shared libraries... yes
  393. :info:configure checking for /opt/local/bin/clang++-mp-4.0 option to produce PIC... -fno-common -DPIC
  394. :info:configure checking if /opt/local/bin/clang++-mp-4.0 PIC flag -fno-common -DPIC works... yes
  395. :info:configure checking if /opt/local/bin/clang++-mp-4.0 static flag -static works... no
  396. :info:configure checking if /opt/local/bin/clang++-mp-4.0 supports -c -o file.o... yes
  397. :info:configure checking if /opt/local/bin/clang++-mp-4.0 supports -c -o file.o... (cached) yes
  398. :info:configure checking whether the /opt/local/bin/clang++-mp-4.0 linker (/opt/local/libexec/llvm-4.0/bin/ld) supports shared libraries... yes
  399. :info:configure checking dynamic linker characteristics... darwin10.8.0 dyld
  400. :info:configure checking how to hardcode library paths into programs... immediate
  401. :info:configure configure: creating ./config.lt
  402. :info:configure config.lt: creating libtool
  403. :info:configure checking for size_t... yes
  404. :info:configure checking for working alloca.h... yes
  405. :info:configure checking for alloca... yes
  406. :info:configure checking for mmap... yes
  407. :info:configure checking for posix_memalign... yes
  408. :info:configure checking for memalign... no
  409. :info:configure checking for valloc... yes
  410. :info:configure checking for fsync... yes
  411. :info:configure checking for pipe2... no
  412. :info:configure checking for issetugid... yes
  413. :info:configure checking for timegm... yes
  414. :info:configure checking for gmtime_r... yes
  415. :info:configure checking for strerror_r... yes
  416. :info:configure checking for __libc_enable_secure... no
  417. :info:configure checking size of char... 1
  418. :info:configure checking size of short... 2
  419. :info:configure checking size of long... 8
  420. :info:configure checking size of int... 4
  421. :info:configure checking size of void *... 8
  422. :info:configure checking size of long long... 8
  423. :info:configure checking size of __int64... 0
  424. :info:configure checking for sig_atomic_t... yes
  425. :info:configure checking for format to printf and scanf a guint64... %llu
  426. :info:configure checking for an ANSI C-conforming const... yes
  427. :info:configure checking for growing stack pointer... no
  428. :info:configure checking for ISO C99 varargs macros in C... yes
  429. :info:configure checking for ISO C99 varargs macros in C++... yes
  430. :info:configure checking for GNUC varargs macros... yes
  431. :info:configure checking for GNUC visibility attribute... no
  432. :info:configure checking whether using Sun Studio C compiler... no
  433. :info:configure checking whether byte ordering is bigendian... no
  434. :info:configure checking sys/param.h usability... yes
  435. :info:configure checking sys/param.h presence... yes
  436. :info:configure checking for sys/param.h... yes
  437. :info:configure checking sys/resource.h usability... yes
  438. :info:configure checking sys/resource.h presence... yes
  439. :info:configure checking for sys/resource.h... yes
  440. :info:configure checking mach/mach_time.h usability... yes
  441. :info:configure checking mach/mach_time.h presence... yes
  442. :info:configure checking for mach/mach_time.h... yes
  443. :info:configure checking sys/select.h usability... yes
  444. :info:configure checking sys/select.h presence... yes
  445. :info:configure checking for sys/select.h... yes
  446. :info:configure checking for stdint.h... (cached) yes
  447. :info:configure checking for inttypes.h... (cached) yes
  448. :info:configure checking sched.h usability... yes
  449. :info:configure checking sched.h presence... yes
  450. :info:configure checking for sched.h... yes
  451. :info:configure checking malloc.h usability... no
  452. :info:configure checking malloc.h presence... no
  453. :info:configure checking for malloc.h... no
  454. :info:configure checking sys/vfs.h usability... no
  455. :info:configure checking sys/vfs.h presence... no
  456. :info:configure checking for sys/vfs.h... no
  457. :info:configure checking sys/vmount.h usability... no
  458. :info:configure checking sys/vmount.h presence... no
  459. :info:configure checking for sys/vmount.h... no
  460. :info:configure checking sys/statfs.h usability... no
  461. :info:configure checking sys/statfs.h presence... no
  462. :info:configure checking for sys/statfs.h... no
  463. :info:configure checking sys/statvfs.h usability... yes
  464. :info:configure checking sys/statvfs.h presence... yes
  465. :info:configure checking for sys/statvfs.h... yes
  466. :info:configure checking sys/filio.h usability... yes
  467. :info:configure checking sys/filio.h presence... yes
  468. :info:configure checking for sys/filio.h... yes
  469. :info:configure checking mntent.h usability... no
  470. :info:configure checking mntent.h presence... no
  471. :info:configure checking for mntent.h... no
  472. :info:configure checking sys/mnttab.h usability... no
  473. :info:configure checking sys/mnttab.h presence... no
  474. :info:configure checking for sys/mnttab.h... no
  475. :info:configure checking sys/vfstab.h usability... no
  476. :info:configure checking sys/vfstab.h presence... no
  477. :info:configure checking for sys/vfstab.h... no
  478. :info:configure checking sys/mntctl.h usability... no
  479. :info:configure checking sys/mntctl.h presence... no
  480. :info:configure checking for sys/mntctl.h... no
  481. :info:configure checking fstab.h usability... yes
  482. :info:configure checking fstab.h presence... yes
  483. :info:configure checking for fstab.h... yes
  484. :info:configure checking linux/magic.h usability... no
  485. :info:configure checking linux/magic.h presence... no
  486. :info:configure checking for linux/magic.h... no
  487. :info:configure checking termios.h usability... yes
  488. :info:configure checking termios.h presence... yes
  489. :info:configure checking for termios.h... yes
  490. :info:configure checking dirent.h usability... yes
  491. :info:configure checking dirent.h presence... yes
  492. :info:configure checking for dirent.h... yes
  493. :info:configure checking sys/time.h usability... yes
  494. :info:configure checking sys/time.h presence... yes
  495. :info:configure checking for sys/time.h... yes
  496. :info:configure checking values.h usability... no
  497. :info:configure checking values.h presence... no
  498. :info:configure checking for values.h... no
  499. :info:configure checking for sys/mount.h... yes
  500. :info:configure checking for sys/sysctl.h... yes
  501. :info:configure checking for sysctlbyname... yes
  502. :info:configure checking whether sys/types.h defines makedev... yes
  503. :info:configure checking xlocale.h usability... yes
  504. :info:configure checking xlocale.h presence... yes
  505. :info:configure checking for xlocale.h... yes
  506. :info:configure checking for struct stat.st_mtimensec... no
  507. :info:configure checking for struct stat.st_mtim.tv_nsec... no
  508. :info:configure checking for struct stat.st_atimensec... no
  509. :info:configure checking for struct stat.st_atim.tv_nsec... no
  510. :info:configure checking for struct stat.st_ctimensec... no
  511. :info:configure checking for struct stat.st_ctim.tv_nsec... no
  512. :info:configure checking for struct stat.st_birthtime... yes
  513. :info:configure checking for struct stat.st_birthtimensec... no
  514. :info:configure checking for struct stat.st_birthtim... no
  515. :info:configure checking for struct stat.st_birthtim.tv_nsec... no
  516. :info:configure checking for struct stat.st_blksize... yes
  517. :info:configure checking for struct stat.st_blocks... yes
  518. :info:configure checking for struct statfs.f_fstypename... yes
  519. :info:configure checking for struct statfs.f_bavail... yes
  520. :info:configure checking for struct statvfs.f_basetype... no
  521. :info:configure checking for struct statvfs.f_fstypename... no
  522. :info:configure checking for struct tm.tm_gmtoff... yes
  523. :info:configure checking for struct tm.__tm_gmtoff... no
  524. :info:configure checking for dirent.h that defines DIR... yes
  525. :info:configure checking for library containing opendir... none required
  526. :info:configure checking for struct dirent.d_type... yes
  527. :info:configure checking for nl_langinfo and CODESET... yes
  528. :info:configure checking whether we are using the GNU C Library 2.1 or newer... no
  529. :info:configure checking size of size_t... 8
  530. :info:configure checking for the appropriate definition for size_t... unsigned long
  531. :info:configure checking size of ssize_t... 8
  532. :info:configure checking for the appropriate definition for ssize_t... long
  533. :info:configure checking for lstat... yes
  534. :info:configure checking for strsignal... yes
  535. :info:configure checking for vsnprintf... yes
  536. :info:configure checking for stpcpy... yes
  537. :info:configure checking for strcasecmp... yes
  538. :info:configure checking for strncasecmp... yes
  539. :info:configure checking for poll... yes
  540. :info:configure checking for vasprintf... yes
  541. :info:configure checking for setenv... yes
  542. :info:configure checking for unsetenv... yes
  543. :info:configure checking for getc_unlocked... yes
  544. :info:configure checking for readlink... yes
  545. :info:configure checking for symlink... yes
  546. :info:configure checking for fdwalk... no
  547. :info:configure checking for memmem... no
  548. :info:configure checking for lchmod... yes
  549. :info:configure checking for lchown... yes
  550. :info:configure checking for fchmod... yes
  551. :info:configure checking for fchown... yes
  552. :info:configure checking for utimes... yes
  553. :info:configure checking for getresuid... no
  554. :info:configure checking for getmntent_r... no
  555. :info:configure checking for setmntent... no
  556. :info:configure checking for endmntent... no
  557. :info:configure checking for hasmntopt... no
  558. :info:configure checking for getfsstat... yes
  559. :info:configure checking for getvfsstat... no
  560. :info:configure checking for fallocate... no
  561. :info:configure checking for splice... no
  562. :info:configure checking for prlimit... no
  563. :info:configure checking for statvfs... yes
  564. :info:configure checking for statfs... yes
  565. :info:configure checking whether to use statfs or statvfs... statfs
  566. :info:configure checking crt_externs.h usability... yes
  567. :info:configure checking crt_externs.h presence... yes
  568. :info:configure checking for crt_externs.h... yes
  569. :info:configure checking for _NSGetEnviron... yes
  570. :info:configure checking for newlocale... yes
  571. :info:configure checking for uselocale... yes
  572. :info:configure checking for strtod_l... yes
  573. :info:configure checking for strtoll_l... yes
  574. :info:configure checking for strtoull_l... yes
  575. :info:configure checking value of AF_INET... 2
  576. :info:configure checking value of AF_INET6... 30
  577. :info:configure checking value of AF_UNIX... 1
  578. :info:configure checking value of MSG_PEEK... 2
  579. :info:configure checking value of MSG_OOB... 1
  580. :info:configure checking value of MSG_DONTROUTE... 4
  581. :info:configure checking for getprotobyname_r... no
  582. :info:configure checking for endservent... yes
  583. :info:configure checking for if_nametoindex... yes
  584. :info:configure checking for if_indextoname... yes
  585. :info:configure checking for sendmmsg... no
  586. :info:configure checking for recvmmsg... no
  587. :info:configure checking if arpa/nameser_compat.h is needed... yes
  588. :info:configure checking for res_query... yes
  589. :info:configure checking for socket... yes
  590. :info:configure checking for res_init... yes
  591. :info:configure checking for linux/netlink.h... no
  592. :info:configure checking for struct ip_mreqn... no
  593. :info:configure checking number of arguments to statfs()... 2
  594. :info:configure checking open() option O_DIRECTORY... yes
  595. :info:configure checking for C99 vsnprintf... yes
  596. :info:configure checking whether printf supports positional parameters... yes
  597. :info:configure checking for signed... yes
  598. :info:configure checking for long long... yes
  599. :info:configure checking for long double... yes
  600. :info:configure checking for wchar_t... yes
  601. :info:configure checking for wint_t... yes
  602. :info:configure checking for size_t... (cached) yes
  603. :info:configure checking for ptrdiff_t... no
  604. :info:configure checking for inttypes.h... yes
  605. :info:configure checking for stdint.h... yes
  606. :info:configure checking for snprintf... yes
  607. :info:configure checking for strnlen... no
  608. :info:configure checking for wcslen... yes
  609. :info:configure checking for wcsnlen... no
  610. :info:configure checking for mbrtowc... yes
  611. :info:configure checking for wcrtomb... yes
  612. :info:configure checking for C99 snprintf... yes
  613. :info:configure checking for fd_set... yes, found in sys/types.h
  614. :info:configure checking for nl_langinfo (CODESET)... yes
  615. :info:configure checking for nl_langinfo (PM_STR)... yes
  616. :info:configure checking for nl_langinfo (_NL_CTYPE_OUTDIGITn_MB)... no
  617. :info:configure checking for a compliant posix_memalign() implementation... yes
  618. :info:configure checking for OpenBSD strlcpy/strlcat... yes
  619. :info:configure checking for an implementation of va_copy()... yes
  620. :info:configure checking for an implementation of __va_copy()... yes
  621. :info:configure checking whether va_lists can be copied by value... no
  622. :info:configure checking for dlopen... yes
  623. :info:configure checking for dlsym... yes
  624. :info:configure checking for RTLD_GLOBAL brokenness... no
  625. :info:configure checking for preceeding underscore in symbols... no
  626. :info:configure checking for dlerror... yes
  627. :info:configure checking for the suffix of module shared libraries... .so
  628. :info:configure checking for gspawn implementation... gspawn.lo
  629. :info:configure checking for GIOChannel implementation... giounix.lo
  630. :info:configure checking for is_selinux_enabled in -lselinux... no
  631. :info:configure checking sys/inotify.h usability... no
  632. :info:configure checking sys/inotify.h presence... no
  633. :info:configure checking for sys/inotify.h... no
  634. :info:configure checking sys/event.h usability... yes
  635. :info:configure checking sys/event.h presence... yes
  636. :info:configure checking for sys/event.h... yes
  637. :info:configure checking for kqueue... yes
  638. :info:configure checking for kevent... yes
  639. :info:configure checking for FAMOpen in -lfam... no
  640. :info:configure configure: WARNING: *** FAM support will not be built (FAM library not found) ***
  641. :info:configure checking for getxattr in -lc... yes
  642. :info:configure checking sys/xattr.h usability... yes
  643. :info:configure checking sys/xattr.h presence... yes
  644. :info:configure checking for sys/xattr.h... yes
  645. :info:configure checking for XATTR_NOFOLLOW... yes
  646. :info:configure checking for platform-dependent source...
  647. :info:configure checking whether to compile timeloop... yes
  648. :info:configure checking if building for some Win32 platform... no
  649. :info:configure checking for thread implementation... posix
  650. :info:configure checking thread related cflags... -D_REENTRANT
  651. :info:configure checking for pthread_create/pthread_join... yes
  652. :info:configure checking thread related libraries...
  653. :info:configure checking for localtime_r... yes
  654. :info:configure checking for gmtime_r... (cached) yes
  655. :info:configure checking for getpwuid_r... yes
  656. :info:configure checking for getgrgid_r... yes
  657. :info:configure checking for pthread_attr_setstacksize... yes
  658. :info:configure checking for pthread_condattr_setclock... no
  659. :info:configure checking for pthread_cond_timedwait_relative_np... yes
  660. :info:configure checking for pthread_setname_np(const char*)... yes
  661. :info:configure checking for pthread_setname_np(pthread_t, const char*)... no
  662. :info:configure checking for clock_gettime... no
  663. :info:configure checking for clock_gettime in -lrt... no
  664. :info:configure checking for lock-free atomic intrinsics... yes
  665. :info:configure checking for futex(2) system call... no
  666. :info:configure checking for eventfd(2) system call... no
  667. :info:configure checking value of POLLIN... 1
  668. :info:configure checking value of POLLOUT... 4
  669. :info:configure checking value of POLLPRI... 2
  670. :info:configure checking value of POLLERR... 8
  671. :info:configure checking value of POLLHUP... 16
  672. :info:configure checking value of POLLNVAL... 32
  673. :info:configure checking for broken poll... yes
  674. :info:configure checking for PCRE... yes
  675. :info:configure checking for Unicode support in PCRE... yes
  676. :info:configure checking for EILSEQ... yes
  677. :info:configure checking for gtk-doc... no
  678. :info:configure configure: WARNING:
  679. :info:configure   You will not be able to create source packages with 'make dist'
  680. :info:configure   because gtk-doc >= 1.20 is not found.
  681. :info:configure checking for gtkdoc-check... no
  682. :info:configure checking for gtkdoc-check... no
  683. :info:configure checking for gtkdoc-rebase... no
  684. :info:configure checking for gtkdoc-mkpdf... no
  685. :info:configure checking whether to build gtk-doc documentation... no
  686. :info:configure checking for xsltproc... /usr/bin/xsltproc
  687. :info:configure checking for XML catalog (/etc/xml/catalog)... not found
  688. :info:configure checking for xmlcatalog... /opt/local/bin/xmlcatalog
  689. :info:configure checking for DocBook XML DTD V4.1.2 in XML catalog... not found
  690. :info:configure checking whether to generate man pages... no
  691. :info:configure checking whether to include dtrace tracing support... no
  692. :info:configure checking whether to include systemtap tracing support... no
  693. :info:configure checking for guint32... yes
  694. :info:configure checking alignment of guint32... 4
  695. :info:configure checking for guint64... yes
  696. :info:configure checking alignment of guint64... 8
  697. :info:configure checking for unsigned long... yes
  698. :info:configure checking alignment of unsigned long... 8
  699. :info:configure checking for DBUS1... no
  700. :info:configure checking for dbus-daemon... no
  701. :info:configure checking for -Bsymbolic-functions linker flag... no
  702. :info:configure checking for --fatal-warnings linker flag... no
  703. :info:configure checking for -z,nodelete linker flag... no
  704. :info:configure checking for -fvisibility=hidden compiler flag... yes
  705. :info:configure checking that generated files are newer than configure... done
  706. :info:configure configure: creating ./config.status
  707. :info:configure config.status: creating glib-2.0.pc
  708. :info:configure config.status: creating gmodule-2.0.pc
  709. :info:configure config.status: creating gmodule-export-2.0.pc
  710. :info:configure config.status: creating gmodule-no-export-2.0.pc
  711. :info:configure config.status: creating gthread-2.0.pc
  712. :info:configure config.status: creating gobject-2.0.pc
  713. :info:configure config.status: creating gio-2.0.pc
  714. :info:configure config.status: creating gio-unix-2.0.pc
  715. :info:configure config.status: creating gio-windows-2.0.pc
  716. :info:configure config.status: creating glib-zip
  717. :info:configure config.status: creating glib-gettextize
  718. :info:configure config.status: creating Makefile
  719. :info:configure config.status: creating build/Makefile
  720. :info:configure config.status: creating build/win32/Makefile
  721. :info:configure config.status: creating build/win32/dirent/Makefile
  722. :info:configure config.status: creating build/win32/vs9/Makefile
  723. :info:configure config.status: creating build/win32/vs9/glib-version-paths.vsprops
  724. :info:configure config.status: creating build/win32/vs10/Makefile
  725. :info:configure config.status: creating build/win32/vs10/glib-version-paths.props
  726. :info:configure config.status: creating build/win32/vs11/Makefile
  727. :info:configure config.status: creating build/win32/vs12/Makefile
  728. :info:configure config.status: creating build/win32/vs14/Makefile
  729. :info:configure config.status: creating glib/Makefile
  730. :info:configure config.status: creating glib/libcharset/Makefile
  731. :info:configure config.status: creating glib/gnulib/Makefile
  732. :info:configure config.status: creating glib/pcre/Makefile
  733. :info:configure config.status: creating glib/update-pcre/Makefile
  734. :info:configure config.status: creating glib/tests/Makefile
  735. :info:configure config.status: creating gmodule/Makefile
  736. :info:configure config.status: creating gmodule/gmoduleconf.h
  737. :info:configure config.status: creating gobject/Makefile
  738. :info:configure config.status: creating gobject/glib-mkenums
  739. :info:configure config.status: creating gobject/tests/Makefile
  740. :info:configure config.status: creating gthread/Makefile
  741. :info:configure config.status: creating gio/Makefile
  742. :info:configure config.status: creating gio/gdbus-2.0/codegen/Makefile
  743. :info:configure config.status: creating gio/gdbus-2.0/codegen/config.py
  744. :info:configure config.status: creating gio/gnetworking.h
  745. :info:configure config.status: creating gio/xdgmime/Makefile
  746. :info:configure config.status: creating gio/inotify/Makefile
  747. :info:configure config.status: creating gio/kqueue/Makefile
  748. :info:configure config.status: creating gio/fam/Makefile
  749. :info:configure config.status: creating gio/win32/Makefile
  750. :info:configure config.status: creating gio/tests/Makefile
  751. :info:configure config.status: creating gio/tests/gdbus-object-manager-example/Makefile
  752. :info:configure config.status: creating gio/tests/services/Makefile
  753. :info:configure config.status: creating gio/tests/services/org.gtk.GDBus.Examples.ObjectManager.service
  754. :info:configure config.status: creating gio/tests/modules/Makefile
  755. :info:configure config.status: creating po/Makefile.in
  756. :info:configure config.status: creating docs/Makefile
  757. :info:configure config.status: creating docs/reference/Makefile
  758. :info:configure config.status: creating docs/reference/glib/Makefile
  759. :info:configure config.status: creating docs/reference/glib/version.xml
  760. :info:configure config.status: creating docs/reference/gobject/Makefile
  761. :info:configure config.status: creating docs/reference/gobject/version.xml
  762. :info:configure config.status: creating docs/reference/gio/Makefile
  763. :info:configure config.status: creating docs/reference/gio/version.xml
  764. :info:configure config.status: creating tests/Makefile
  765. :info:configure config.status: creating tests/gobject/Makefile
  766. :info:configure config.status: creating tests/refcount/Makefile
  767. :info:configure config.status: creating m4macros/Makefile
  768. :info:configure config.status: creating config.h
  769. :info:configure config.status: executing depfiles commands
  770. :info:configure config.status: executing default-1 commands
  771. :info:configure config.status: executing libtool commands
  772. :info:configure config.status: executing glib/glibconfig.h commands
  773. :info:configure config.status: executing chmod-scripts commands
  774. :debug:configure Executing proc-post-org.macports.configure-configure-0
  775. :debug:configure system: ed - /opt/local/var/macports/build/_opt_local_var_macports_sources_rsync.macports.org_macports_release_tarballs_ports_devel_glib2/glib2/work/glib-2.50.3/config.h < /opt/local/var/macports/sources/rsync.macports.org/macports/release/tarballs/ports/devel/glib2/files/config.h.ed
  776. :debug:configure Privilege de-escalation not attempted as not running as root.
  777. :debug:build build phase started at Thu May  4 14:37:47 EDT 2017
  778. :notice:build --->  Building glib2
  779. :debug:build Executing org.macports.build (glib2)
  780. :debug:build Environment:
  781. :debug:build CC_PRINT_OPTIONS='YES'
  782. :debug:build CC_PRINT_OPTIONS_FILE='/opt/local/var/macports/build/_opt_local_var_macports_sources_rsync.macports.org_macports_release_tarballs_ports_devel_glib2/glib2/work/.CC_PRINT_OPTIONS'
  783. :debug:build CPATH='/opt/local/include'
  784. :debug:build LIBRARY_PATH='/opt/local/lib'
  785. :debug:build MACOSX_DEPLOYMENT_TARGET='10.6'
  786. :info:build Executing:  cd "/opt/local/var/macports/build/_opt_local_var_macports_sources_rsync.macports.org_macports_release_tarballs_ports_devel_glib2/glib2/work/glib-2.50.3" && /usr/bin/make -j4 -w all V=1
  787. :debug:build system:  cd "/opt/local/var/macports/build/_opt_local_var_macports_sources_rsync.macports.org_macports_release_tarballs_ports_devel_glib2/glib2/work/glib-2.50.3" && /usr/bin/make -j4 -w all V=1
  788. :info:build make: Entering directory `/opt/local/var/macports/build/_opt_local_var_macports_sources_rsync.macports.org_macports_release_tarballs_ports_devel_glib2/glib2/work/glib-2.50.3'
  789. :info:build /usr/bin/make  all-recursive
  790. :info:build make[1]: Entering directory `/opt/local/var/macports/build/_opt_local_var_macports_sources_rsync.macports.org_macports_release_tarballs_ports_devel_glib2/glib2/work/glib-2.50.3'
  791. :info:build Making all in .
  792. :info:build make[2]: Entering directory `/opt/local/var/macports/build/_opt_local_var_macports_sources_rsync.macports.org_macports_release_tarballs_ports_devel_glib2/glib2/work/glib-2.50.3'
  793. :info:build make[2]: Nothing to be done for `all-am'.
  794. :info:build make[2]: Leaving directory `/opt/local/var/macports/build/_opt_local_var_macports_sources_rsync.macports.org_macports_release_tarballs_ports_devel_glib2/glib2/work/glib-2.50.3'
  795. :info:build Making all in m4macros
  796. :info:build make[2]: Entering directory `/opt/local/var/macports/build/_opt_local_var_macports_sources_rsync.macports.org_macports_release_tarballs_ports_devel_glib2/glib2/work/glib-2.50.3/m4macros'
  797. :info:build /usr/bin/make  all-am
  798. :info:build make[3]: Entering directory `/opt/local/var/macports/build/_opt_local_var_macports_sources_rsync.macports.org_macports_release_tarballs_ports_devel_glib2/glib2/work/glib-2.50.3/m4macros'
  799. :info:build make[3]: Nothing to be done for `all-am'.
  800. :info:build make[3]: Leaving directory `/opt/local/var/macports/build/_opt_local_var_macports_sources_rsync.macports.org_macports_release_tarballs_ports_devel_glib2/glib2/work/glib-2.50.3/m4macros'
  801. :info:build make[2]: Leaving directory `/opt/local/var/macports/build/_opt_local_var_macports_sources_rsync.macports.org_macports_release_tarballs_ports_devel_glib2/glib2/work/glib-2.50.3/m4macros'
  802. :info:build Making all in glib
  803. :info:build make[2]: Entering directory `/opt/local/var/macports/build/_opt_local_var_macports_sources_rsync.macports.org_macports_release_tarballs_ports_devel_glib2/glib2/work/glib-2.50.3/glib'
  804. :info:build cd .. && \
  805. :info:build       /bin/sh ./config.status glib/glibconfig.h
  806. :info:build config.status: executing glib/glibconfig.h commands
  807. :info:build config.status: glib/glibconfig.h is unchanged
  808. :info:build cd .. && \
  809. :info:build       /bin/sh ./config.status glib/glibconfig.h.win32
  810. :info:build config.status: creating glib/glibconfig.h.win32
  811. :info:build /usr/bin/make  all-recursive
  812. :info:build make[3]: Entering directory `/opt/local/var/macports/build/_opt_local_var_macports_sources_rsync.macports.org_macports_release_tarballs_ports_devel_glib2/glib2/work/glib-2.50.3/glib'
  813. :info:build Making all in libcharset
  814. :info:build make[4]: Entering directory `/opt/local/var/macports/build/_opt_local_var_macports_sources_rsync.macports.org_macports_release_tarballs_ports_devel_glib2/glib2/work/glib-2.50.3/glib/libcharset'
  815. :info:build /usr/bin/make  all-am
  816. :info:build make[5]: Entering directory `/opt/local/var/macports/build/_opt_local_var_macports_sources_rsync.macports.org_macports_release_tarballs_ports_devel_glib2/glib2/work/glib-2.50.3/glib/libcharset'
  817. :info:build /bin/sh ../../libtool  --tag=CC   --mode=compile /opt/local/bin/clang-mp-4.0 -DHAVE_CONFIG_H -I. -I../..  -DLIBDIR=\"/opt/local/lib\" -I../.. -I/opt/local/include -D_REENTRANT -fvisibility=hidden -pipe -Os -fstrict-aliasing -arch x86_64 -MT libcharset_la-localcharset.lo -MD -MP -MF .deps/libcharset_la-localcharset.Tpo -c -o libcharset_la-localcharset.lo `test -f 'localcharset.c' || echo './'`localcharset.c
  818. :info:build /usr/bin/sed -e '/^#/d' -e 's/@''PACKAGE''@/glib/g' ref-add.sin > t-ref-add.sed
  819. :info:build /usr/bin/sed -e '/^#/d' -e 's/@''PACKAGE''@/glib/g' ref-del.sin > t-ref-del.sed
  820. :info:build /bin/sh ./config.charset 'x86_64-apple-darwin10.8.0' > t-charset.alias
  821. :info:build libtool: compile:  /opt/local/bin/clang-mp-4.0 -DHAVE_CONFIG_H -I. -I../.. -DLIBDIR=\"/opt/local/lib\" -I../.. -I/opt/local/include -D_REENTRANT -fvisibility=hidden -pipe -Os -fstrict-aliasing -arch x86_64 -MT libcharset_la-localcharset.lo -MD -MP -MF .deps/libcharset_la-localcharset.Tpo -c localcharset.c  -fno-common -DPIC -o .libs/libcharset_la-localcharset.o
  822. :info:build libtool: compile:  /opt/local/bin/clang-mp-4.0 -DHAVE_CONFIG_H -I. -I../.. -DLIBDIR=\"/opt/local/lib\" -I../.. -I/opt/local/include -D_REENTRANT -fvisibility=hidden -pipe -Os -fstrict-aliasing -arch x86_64 -MT libcharset_la-localcharset.lo -MD -MP -MF .deps/libcharset_la-localcharset.Tpo -c localcharset.c -o libcharset_la-localcharset.o >/dev/null 2>&1
  823. :info:build mv -f .deps/libcharset_la-localcharset.Tpo .deps/libcharset_la-localcharset.Plo
  824. :info:build /bin/sh ../../libtool  --tag=CC   --mode=link /opt/local/bin/clang-mp-4.0 -fvisibility=hidden -pipe -Os -fstrict-aliasing -arch x86_64  -L/opt/local/lib -Wl,-headerpad_max_install_names -lresolv -bind_at_load -arch x86_64 -o libcharset.la  libcharset_la-localcharset.lo  -lintl  
  825. :info:build libtool: link: ar cru .libs/libcharset.a .libs/libcharset_la-localcharset.o
  826. :info:build libtool: link: ranlib .libs/libcharset.a
  827. :info:build libtool: link: ( cd ".libs" && rm -f "libcharset.la" && ln -s "../libcharset.la" "libcharset.la" )
  828. :info:build make[5]: Leaving directory `/opt/local/var/macports/build/_opt_local_var_macports_sources_rsync.macports.org_macports_release_tarballs_ports_devel_glib2/glib2/work/glib-2.50.3/glib/libcharset'
  829. :info:build make[4]: Leaving directory `/opt/local/var/macports/build/_opt_local_var_macports_sources_rsync.macports.org_macports_release_tarballs_ports_devel_glib2/glib2/work/glib-2.50.3/glib/libcharset'
  830. :info:build Making all in update-pcre
  831. :info:build make[4]: Entering directory `/opt/local/var/macports/build/_opt_local_var_macports_sources_rsync.macports.org_macports_release_tarballs_ports_devel_glib2/glib2/work/glib-2.50.3/glib/update-pcre'
  832. :info:build /usr/bin/make  all-am
  833. :info:build make[5]: Entering directory `/opt/local/var/macports/build/_opt_local_var_macports_sources_rsync.macports.org_macports_release_tarballs_ports_devel_glib2/glib2/work/glib-2.50.3/glib/update-pcre'
  834. :info:build make[5]: Nothing to be done for `all-am'.
  835. :info:build make[5]: Leaving directory `/opt/local/var/macports/build/_opt_local_var_macports_sources_rsync.macports.org_macports_release_tarballs_ports_devel_glib2/glib2/work/glib-2.50.3/glib/update-pcre'
  836. :info:build make[4]: Leaving directory `/opt/local/var/macports/build/_opt_local_var_macports_sources_rsync.macports.org_macports_release_tarballs_ports_devel_glib2/glib2/work/glib-2.50.3/glib/update-pcre'
  837. :info:build Making all in .
  838. :info:build make[4]: Entering directory `/opt/local/var/macports/build/_opt_local_var_macports_sources_rsync.macports.org_macports_release_tarballs_ports_devel_glib2/glib2/work/glib-2.50.3/glib'
  839. :info:build /bin/sh ../libtool  --tag=CC   --mode=compile /opt/local/bin/clang-mp-4.0 -DHAVE_CONFIG_H -I. -I..  -I.. -I../glib -I../glib -I.. -I/opt/local/include -DG_LOG_DOMAIN=\"GLib\" -DG_DISABLE_CAST_CHECKS -DGLIB_COMPILATION -DPCRE_STATIC -I/opt/local/include -D_REENTRANT  -fvisibility=hidden  -pipe -Os -fstrict-aliasing -arch x86_64 -MT libglib_2_0_la-gallocator.lo -MD -MP -MF .deps/libglib_2_0_la-gallocator.Tpo -c -o libglib_2_0_la-gallocator.lo `test -f 'deprecated/gallocator.c' || echo './'`deprecated/gallocator.c
  840. :info:build /bin/sh ../libtool  --tag=CC   --mode=compile /opt/local/bin/clang-mp-4.0 -DHAVE_CONFIG_H -I. -I..  -I.. -I../glib -I../glib -I.. -I/opt/local/include -DG_LOG_DOMAIN=\"GLib\" -DG_DISABLE_CAST_CHECKS -DGLIB_COMPILATION -DPCRE_STATIC -I/opt/local/include -D_REENTRANT  -fvisibility=hidden  -pipe -Os -fstrict-aliasing -arch x86_64 -MT libglib_2_0_la-gcache.lo -MD -MP -MF .deps/libglib_2_0_la-gcache.Tpo -c -o libglib_2_0_la-gcache.lo `test -f 'deprecated/gcache.c' || echo './'`deprecated/gcache.c
  841. :info:build /bin/sh ../libtool  --tag=CC   --mode=compile /opt/local/bin/clang-mp-4.0 -DHAVE_CONFIG_H -I. -I..  -I.. -I../glib -I../glib -I.. -I/opt/local/include -DG_LOG_DOMAIN=\"GLib\" -DG_DISABLE_CAST_CHECKS -DGLIB_COMPILATION -DPCRE_STATIC -I/opt/local/include -D_REENTRANT  -fvisibility=hidden  -pipe -Os -fstrict-aliasing -arch x86_64 -MT libglib_2_0_la-gcompletion.lo -MD -MP -MF .deps/libglib_2_0_la-gcompletion.Tpo -c -o libglib_2_0_la-gcompletion.lo `test -f 'deprecated/gcompletion.c' || echo './'`deprecated/gcompletion.c
  842. :info:build /bin/sh ../libtool  --tag=CC   --mode=compile /opt/local/bin/clang-mp-4.0 -DHAVE_CONFIG_H -I. -I..  -I.. -I../glib -I../glib -I.. -I/opt/local/include -DG_LOG_DOMAIN=\"GLib\" -DG_DISABLE_CAST_CHECKS -DGLIB_COMPILATION -DPCRE_STATIC -I/opt/local/include -D_REENTRANT  -fvisibility=hidden  -pipe -Os -fstrict-aliasing -arch x86_64 -MT libglib_2_0_la-grel.lo -MD -MP -MF .deps/libglib_2_0_la-grel.Tpo -c -o libglib_2_0_la-grel.lo `test -f 'deprecated/grel.c' || echo './'`deprecated/grel.c
  843. :info:build libtool: compile:  /opt/local/bin/clang-mp-4.0 -DHAVE_CONFIG_H -I. -I.. -I.. -I../glib -I../glib -I.. -I/opt/local/include -DG_LOG_DOMAIN=\"GLib\" -DG_DISABLE_CAST_CHECKS -DGLIB_COMPILATION -DPCRE_STATIC -I/opt/local/include -D_REENTRANT -fvisibility=hidden -pipe -Os -fstrict-aliasing -arch x86_64 -MT libglib_2_0_la-grel.lo -MD -MP -MF .deps/libglib_2_0_la-grel.Tpo -c deprecated/grel.c  -fno-common -DPIC -o .libs/libglib_2_0_la-grel.o
  844. :info:build libtool: compile:  /opt/local/bin/clang-mp-4.0 -DHAVE_CONFIG_H -I. -I.. -I.. -I../glib -I../glib -I.. -I/opt/local/include -DG_LOG_DOMAIN=\"GLib\" -DG_DISABLE_CAST_CHECKS -DGLIB_COMPILATION -DPCRE_STATIC -I/opt/local/include -D_REENTRANT -fvisibility=hidden -pipe -Os -fstrict-aliasing -arch x86_64 -MT libglib_2_0_la-gallocator.lo -MD -MP -MF .deps/libglib_2_0_la-gallocator.Tpo -c deprecated/gallocator.c  -fno-common -DPIC -o .libs/libglib_2_0_la-gallocator.o
  845. :info:build libtool: compile:  /opt/local/bin/clang-mp-4.0 -DHAVE_CONFIG_H -I. -I.. -I.. -I../glib -I../glib -I.. -I/opt/local/include -DG_LOG_DOMAIN=\"GLib\" -DG_DISABLE_CAST_CHECKS -DGLIB_COMPILATION -DPCRE_STATIC -I/opt/local/include -D_REENTRANT -fvisibility=hidden -pipe -Os -fstrict-aliasing -arch x86_64 -MT libglib_2_0_la-gcompletion.lo -MD -MP -MF .deps/libglib_2_0_la-gcompletion.Tpo -c deprecated/gcompletion.c  -fno-common -DPIC -o .libs/libglib_2_0_la-gcompletion.o
  846. :info:build libtool: compile:  /opt/local/bin/clang-mp-4.0 -DHAVE_CONFIG_H -I. -I.. -I.. -I../glib -I../glib -I.. -I/opt/local/include -DG_LOG_DOMAIN=\"GLib\" -DG_DISABLE_CAST_CHECKS -DGLIB_COMPILATION -DPCRE_STATIC -I/opt/local/include -D_REENTRANT -fvisibility=hidden -pipe -Os -fstrict-aliasing -arch x86_64 -MT libglib_2_0_la-gcache.lo -MD -MP -MF .deps/libglib_2_0_la-gcache.Tpo -c deprecated/gcache.c  -fno-common -DPIC -o .libs/libglib_2_0_la-gcache.o
  847. :info:build In file included from deprecated/gallocator.c:21:
  848. :info:build In file included from deprecated/gallocator.h:23:
  849. :info:build In file included from ../glib/gtypes.h:32:
  850. :info:build In file included from ./glibconfig.h:12:
  851. :info:build In file included from /opt/local/libexec/llvm-4.0/bin/../lib/clang/4.0.0/include/float.h:36:
  852. :info:build /usr/include/float.h:8:15: fatal error: 'float.h' file not found
  853. :info:build #include_next <float.h>
  854. :info:build               ^~~~~~~~~
  855. :info:build In file included from deprecated/grel.c:35:
  856. :info:build In file included from deprecated/grel.h:32:
  857. :info:build In file included from ../glib/gtypes.h:32:
  858. :info:build In file included from ./glibconfig.h:12:
  859. :info:build In file included from /opt/local/libexec/llvm-4.0/bin/../lib/clang/4.0.0/include/float.h:36:
  860. :info:build /usr/include/float.h:8:15: fatal error: 'float.h' file not found
  861. :info:build #include_next <float.h>
  862. :info:build               ^~~~~~~~~
  863. :info:build In file included from deprecated/gcache.c:31:
  864. :info:build In file included from deprecated/gcache.h:32:
  865. :info:build In file included from ../glib/glist.h:32:
  866. :info:build In file included from ../glib/gmem.h:32:
  867. :info:build In file included from ../glib/gutils.h:32:
  868. :info:build In file included from ../glib/gtypes.h:32:
  869. :info:build In file included from ./glibconfig.h:12:
  870. :info:build In file included from /opt/local/libexec/llvm-4.0/bin/../lib/clang/4.0.0/include/float.h:36:
  871. :info:build /usr/include/float.h:8:15: fatal error: 'float.h' file not found
  872. :info:build #include_next <float.h>
  873. :info:build               ^~~~~~~~~
  874. :info:build In file included from deprecated/gcompletion.c:34:
  875. :info:build In file included from deprecated/gcompletion.h:32:
  876. :info:build In file included from ../glib/glist.h:32:
  877. :info:build In file included from ../glib/gmem.h:32:
  878. :info:build In file included from ../glib/gutils.h:32:
  879. :info:build In file included from ../glib/gtypes.h:32:
  880. :info:build In file included from ./glibconfig.h:12:
  881. :info:build In file included from /opt/local/libexec/llvm-4.0/bin/../lib/clang/4.0.0/include/float.h:36:
  882. :info:build /usr/include/float.h:8:15: fatal error: 'float.h' file not found
  883. :info:build #include_next <float.h>
  884. :info:build               ^~~~~~~~~
  885. :info:build 1 error generated.
  886. :info:build make[4]: *** [libglib_2_0_la-gallocator.lo] Error 1
  887. :info:build make[4]: *** Waiting for unfinished jobs....
  888. :info:build 1 error generated.
  889. :info:build 1 error generated.
  890. :info:build 1 error generated.
  891. :info:build make[4]: *** [libglib_2_0_la-gcache.lo] Error 1
  892. :info:build make[4]: *** [libglib_2_0_la-gcompletion.lo] Error 1
  893. :info:build make[4]: *** [libglib_2_0_la-grel.lo] Error 1
  894. :info:build make[4]: Leaving directory `/opt/local/var/macports/build/_opt_local_var_macports_sources_rsync.macports.org_macports_release_tarballs_ports_devel_glib2/glib2/work/glib-2.50.3/glib'
  895. :info:build make[3]: *** [all-recursive] Error 1
  896. :info:build make[3]: Leaving directory `/opt/local/var/macports/build/_opt_local_var_macports_sources_rsync.macports.org_macports_release_tarballs_ports_devel_glib2/glib2/work/glib-2.50.3/glib'
  897. :info:build make[2]: *** [all] Error 2
  898. :info:build make[2]: Leaving directory `/opt/local/var/macports/build/_opt_local_var_macports_sources_rsync.macports.org_macports_release_tarballs_ports_devel_glib2/glib2/work/glib-2.50.3/glib'
  899. :info:build make[1]: *** [all-recursive] Error 1
  900. :info:build make[1]: Leaving directory `/opt/local/var/macports/build/_opt_local_var_macports_sources_rsync.macports.org_macports_release_tarballs_ports_devel_glib2/glib2/work/glib-2.50.3'
  901. :info:build make: *** [all] Error 2
  902. :info:build make: Leaving directory `/opt/local/var/macports/build/_opt_local_var_macports_sources_rsync.macports.org_macports_release_tarballs_ports_devel_glib2/glib2/work/glib-2.50.3'
  903. :info:build Command failed:  cd "/opt/local/var/macports/build/_opt_local_var_macports_sources_rsync.macports.org_macports_release_tarballs_ports_devel_glib2/glib2/work/glib-2.50.3" && /usr/bin/make -j4 -w all V=1
  904. :info:build Exit code: 2
  905. :error:build Failed to build glib2: command execution failed
  906. :debug:build Error code: CHILDSTATUS 8806 2
  907. :debug:build Backtrace: command execution failed
  908. :debug:build     while executing
  909. :debug:build "system {*}$notty {*}$nice $fullcmdstring"
  910. :debug:build     invoked from within
  911. :debug:build "command_exec build"
  912. :debug:build     (procedure "portbuild::build_main" line 8)
  913. :debug:build     invoked from within
  914. :debug:build "$procedure $targetname"
  915. :debug:build could not read "/opt/local/share/man/man3/pcreunicode.3.gz": no such file or directory
  916. :debug:build     while executing
  917. :debug:build "::file type $file"
  918. :error:build See /opt/local/var/macports/logs/_opt_local_var_macports_sources_rsync.macports.org_macports_release_tarballs_ports_devel_glib2/glib2/main.log for details.
RAW Paste Data
We use cookies for various purposes including analytics. By continuing to use Pastebin, you agree to our use of cookies as described in the Cookies Policy. OK, I Understand
 
Top