View difference between Paste ID: aKgtqkE0 and k0zY7AVV
SHOW: | | - or go back to the newest paste.
1
Target AfterBuild:
2
					Task "CreateItem"
3
						Using task CreateItem from Microsoft.Build.Tasks.CreateItem, Microsoft.Build.Tasks.v4.0, Version=4.0.0.0, Culture=neutral, PublicKeyToken=b03f5f7f11d50a3a
4
/Users/thill/Projects/libgit2sharp/LibGit2Sharp/CopyNativeDependencies.targets: error : Error executing task CreateItem: Invalid path
5
						Error executing task CreateItem: System.ArgumentException: Invalid path
6
						  at System.IO.Path.GetDirectoryName (System.String path) [0x00117] in /Volumes/build-root-ramdisk/mono-3.4.0/mcs/class/corlib/System.IO/Path.cs:237 
7
						  at Microsoft.Build.BuildEngine.DirectoryScanner.ProcessInclude (ITaskItem include_item, System.Collections.Generic.Dictionary`2 excludedItems, System.Collections.Generic.List`1 includedItems) [0x001ba] in /Volumes/build-root-ramdisk/mono-3.4.0/mcs/class/Microsoft.Build.Engine/Microsoft.Build.BuildEngine/DirectoryScanner.cs:123 
8
						  at Microsoft.Build.BuildEngine.DirectoryScanner.Scan () [0x0008b] in /Volumes/build-root-ramdisk/mono-3.4.0/mcs/class/Microsoft.Build.Engine/Microsoft.Build.BuildEngine/DirectoryScanner.cs:72 
9
						  at Microsoft.Build.Tasks.CreateItem.Execute () [0x00048] in /Volumes/build-root-ramdisk/mono-3.4.0/mcs/class/Microsoft.Build.Tasks/Microsoft.Build.Tasks/CreateItem.cs:58 
10
						  at Microsoft.Build.BuildEngine.TaskEngine.Execute () [0x00000] in /Volumes/build-root-ramdisk/mono-3.4.0/mcs/class/Microsoft.Build.Engine/Microsoft.Build.BuildEngine/TaskEngine.cs:137 
11
						  at Microsoft.Build.BuildEngine.BuildTask.Execute () [0x0009a] in /Volumes/build-root-ramdisk/mono-3.4.0/mcs/class/Microsoft.Build.Engine/Microsoft.Build.BuildEngine/BuildTask.cs:104 
12
					Task "CreateItem" execution -- FAILED
13
					Done building target "AfterBuild" in project "/Users/thill/Projects/libgit2sharp/LibGit2Sharp.Tests/LibGit2Sharp.Tests.csproj".-- FAILED
14
				Done building target "AfterBuild" in project "/Users/thill/Projects/libgit2sharp/LibGit2Sharp.Tests/LibGit2Sharp.Tests.csproj" ("/Users/thill/Projects/libgit2sharp/LibGit2Sharp/CopyNativeDependencies.targets"); "Build" depends on it.
15
				Done building target "Build" in project "/Users/thill/Projects/libgit2sharp/LibGit2Sharp.Tests/LibGit2Sharp.Tests.csproj" ("/Library/Frameworks/Mono.framework/Versions/3.4.0/lib/mono/4.5/Microsoft.Common.targets").
16
				Done building project "/Users/thill/Projects/libgit2sharp/LibGit2Sharp.Tests/LibGit2Sharp.Tests.csproj".-- FAILED
17
			Task "MSBuild" execution -- FAILED
18
			Done building target "Build" in project "/Users/thill/Projects/libgit2sharp/LibGit2Sharp.sln".-- FAILED
19
		Done building target "Build" in project "/Users/thill/Projects/libgit2sharp/LibGit2Sharp.sln" ("/Users/thill/Projects/libgit2sharp/LibGit2Sharp.sln").
20
		Done building project "/Users/thill/Projects/libgit2sharp/LibGit2Sharp.sln".-- FAILED
21
	Task "MSBuild" execution -- FAILED
22
	Done building target "Build" in project "/Users/thill/Projects/libgit2sharp/CI/build.msbuild".-- FAILED
23
Done building target "Build" in project "/Users/thill/Projects/libgit2sharp/CI/build.msbuild" ("/Users/thill/Projects/libgit2sharp/CI/build.msbuild"); "Test" depends on it.
24
Done building target "Test" in project "/Users/thill/Projects/libgit2sharp/CI/build.msbuild" ("/Users/thill/Projects/libgit2sharp/CI/build.msbuild"); "Deploy" depends on it.
25
Done building target "Deploy" in project "/Users/thill/Projects/libgit2sharp/CI/build.msbuild" ("/Users/thill/Projects/libgit2sharp/CI/build.msbuild").
26
Done building project "/Users/thill/Projects/libgit2sharp/CI/build.msbuild".-- FAILED
27
28
Build FAILED.
29
Errors:
30
31
/Users/thill/Projects/libgit2sharp/CI/build.msbuild (Deploy) -> (Build target) ->
32
/Users/thill/Projects/libgit2sharp/LibGit2Sharp.sln (Build) ->  (Build target) ->
33
/Users/thill/Projects/libgit2sharp/LibGit2Sharp.Tests/LibGit2Sharp.Tests.csproj (default targets) ->
34
/Users/thill/Projects/libgit2sharp/LibGit2Sharp/CopyNativeDependencies.targets (AfterBuild target) ->
35
36
/Users/thill/Projects/libgit2sharp/LibGit2Sharp/CopyNativeDependencies.targets: error : Error executing task CreateItem: Invalid path
37
38
	 0 Warning(s)
39
	 1 Error(s)
40
41
Time Elapsed 00:00:02.4272580