View difference between Paste ID: AjVYdi8n and JrmE2Ng4
SHOW: | | - or go back to the newest paste.
1
Target AfterBuild:
2-
/Users/thill/Downloads/libgit2sharp-0.18.1/LibGit2Sharp/CopyNativeDependencies.targets: error : Error executing task CreateItem: Invalid path
2+
/Users/thill/Projects/libgit2sharp/LibGit2Sharp/CopyNativeDependencies.targets: error : Error executing task CreateItem: Invalid path
3-
					Task "CreateItem" execution -- FAILED
3+
                                        Task "CreateItem" execution -- FAILED
4-
					Done building target "AfterBuild" in project "/Users/thill/Downloads/libgit2sharp-0.18.1/LibGit2Sharp.Tests/LibGit2Sharp.Tests.csproj".-- FAILED
4+
                                        Done building target "AfterBuild" in project "/Users/thill/Projects/libgit2sharp/LibGit2Sharp.Tests/LibGit2Sharp.Tests.csproj".-- FAILED
5-
				Done building project "/Users/thill/Downloads/libgit2sharp-0.18.1/LibGit2Sharp.Tests/LibGit2Sharp.Tests.csproj".-- FAILED
5+
                                Done building project "/Users/thill/Projects/libgit2sharp/LibGit2Sharp.Tests/LibGit2Sharp.Tests.csproj".-- FAILED
6-
			Task "MSBuild" execution -- FAILED
6+
                        Task "MSBuild" execution -- FAILED
7-
			Done building target "Build" in project "/Users/thill/Downloads/libgit2sharp-0.18.1/LibGit2Sharp.sln".-- FAILED
7+
                        Done building target "Build" in project "/Users/thill/Projects/libgit2sharp/LibGit2Sharp.sln".-- FAILED
8-
		Done building project "/Users/thill/Downloads/libgit2sharp-0.18.1/LibGit2Sharp.sln".-- FAILED
8+
                Done building project "/Users/thill/Projects/libgit2sharp/LibGit2Sharp.sln".-- FAILED
9-
	Task "MSBuild" execution -- FAILED
9+
        Task "MSBuild" execution -- FAILED
10-
	Done building target "Build" in project "/Users/thill/Downloads/libgit2sharp-0.18.1/CI/build.msbuild".-- FAILED
10+
        Done building target "Build" in project "/Users/thill/Projects/libgit2sharp/CI/build.msbuild".-- FAILED
11-
Done building project "/Users/thill/Downloads/libgit2sharp-0.18.1/CI/build.msbuild".-- FAILED
11+
Done building project "/Users/thill/Projects/libgit2sharp/CI/build.msbuild".-- FAILED
12
13
Build FAILED.
14
Errors:
15
16-
/Users/thill/Downloads/libgit2sharp-0.18.1/CI/build.msbuild (Deploy) ->
16+
/Users/thill/Projects/libgit2sharp/CI/build.msbuild (Deploy) ->
17
(Build target) ->
18-
/Users/thill/Downloads/libgit2sharp-0.18.1/LibGit2Sharp.sln (Build) ->
18+
/Users/thill/Projects/libgit2sharp/LibGit2Sharp.sln (Build) ->
19
(Build target) ->
20-
/Users/thill/Downloads/libgit2sharp-0.18.1/LibGit2Sharp.Tests/LibGit2Sharp.Tests.csproj (default targets) ->
20+
/Users/thill/Projects/libgit2sharp/LibGit2Sharp.Tests/LibGit2Sharp.Tests.csproj (default targets) ->
21-
/Users/thill/Downloads/libgit2sharp-0.18.1/LibGit2Sharp/CopyNativeDependencies.targets (AfterBuild target) ->
21+
/Users/thill/Projects/libgit2sharp/LibGit2Sharp/CopyNativeDependencies.targets (AfterBuild target) ->
22
23-
	/Users/thill/Downloads/libgit2sharp-0.18.1/LibGit2Sharp/CopyNativeDependencies.targets: error : Error executing task CreateItem: Invalid path
23+
        /Users/thill/Projects/libgit2sharp/LibGit2Sharp/CopyNativeDependencies.targets: error : Error executing task CreateItem: Invalid path
24
25-
	 0 Warning(s)
25+
         0 Warning(s)
26-
	 1 Error(s)
26+
         1 Error(s)
27
28-
Time Elapsed 00:00:02.7468520
28+
Time Elapsed 00:00:00.7801040