View difference between Paste ID: 1rhM0JKG and aKgtqkE0
SHOW: | | - or go back to the newest paste.
1
Target AfterBuild:
2-
					Task "CreateItem"
2+
Task "CreateItem"
3-
						Using task CreateItem from Microsoft.Build.Tasks.CreateItem, Microsoft.Build.Tasks.v4.0, Version=4.0.0.0, Culture=neutral, PublicKeyToken=b03f5f7f11d50a3a
3+
	Using task CreateItem from Microsoft.Build.Tasks.CreateItem, Microsoft.Build.Tasks.v4.0, Version=4.0.0.0, Culture=neutral, PublicKeyToken=b03f5f7f11d50a3a
4-
/Users/thill/Projects/libgit2sharp/LibGit2Sharp/CopyNativeDependencies.targets: error : Error executing task CreateItem: Invalid path
4+
/libgit2sharp/LibGit2Sharp/CopyNativeDependencies.targets: error : Error executing task CreateItem: Invalid path
5-
						Error executing task CreateItem: System.ArgumentException: Invalid path
5+
6-
						  at System.IO.Path.GetDirectoryName (System.String path) [0x00117] in /Volumes/build-root-ramdisk/mono-3.4.0/mcs/class/corlib/System.IO/Path.cs:237 
6+
Error executing task CreateItem: System.ArgumentException: Invalid path
7-
						  at Microsoft.Build.BuildEngine.DirectoryScanner.ProcessInclude (ITaskItem include_item, System.Collections.Generic.Dictionary`2 excludedItems, System.Collections.Generic.List`1 includedItems) [0x001ba] in /Volumes/build-root-ramdisk/mono-3.4.0/mcs/class/Microsoft.Build.Engine/Microsoft.Build.BuildEngine/DirectoryScanner.cs:123 
7+
	at System.IO.Path.GetDirectoryName (System.String path) [0x00117] in corlib/System.IO/Path.cs:237 
8-
						  at Microsoft.Build.BuildEngine.DirectoryScanner.Scan () [0x0008b] in /Volumes/build-root-ramdisk/mono-3.4.0/mcs/class/Microsoft.Build.Engine/Microsoft.Build.BuildEngine/DirectoryScanner.cs:72 
8+
	at Microsoft.Build.BuildEngine.DirectoryScanner.ProcessInclude (ITaskItem include_item, System.Collections.Generic.	Dictionary`2 excludedItems, System.Collections.Generic.List`1 includedItems) [0x001ba] in Microsoft.Build.Engine/Microsoft.Build.BuildEngine/DirectoryScanner.cs:123 
9-
						  at Microsoft.Build.Tasks.CreateItem.Execute () [0x00048] in /Volumes/build-root-ramdisk/mono-3.4.0/mcs/class/Microsoft.Build.Tasks/Microsoft.Build.Tasks/CreateItem.cs:58 
9+
	at Microsoft.Build.BuildEngine.DirectoryScanner.Scan () [0x0008b] in Microsoft.Build.Engine/Microsoft.Build.BuildEngine/DirectoryScanner.cs:72 
10-
						  at Microsoft.Build.BuildEngine.TaskEngine.Execute () [0x00000] in /Volumes/build-root-ramdisk/mono-3.4.0/mcs/class/Microsoft.Build.Engine/Microsoft.Build.BuildEngine/TaskEngine.cs:137 
10+
	at Microsoft.Build.Tasks.CreateItem.Execute () [0x00048] in Microsoft.Build.Tasks/Microsoft.Build.Tasks/CreateItem.cs:58 
11-
						  at Microsoft.Build.BuildEngine.BuildTask.Execute () [0x0009a] in /Volumes/build-root-ramdisk/mono-3.4.0/mcs/class/Microsoft.Build.Engine/Microsoft.Build.BuildEngine/BuildTask.cs:104 
11+
	at Microsoft.Build.BuildEngine.TaskEngine.Execute () [0x00000] in Microsoft.Build.Engine/Microsoft.Build.BuildEngine/TaskEngine.cs:137 
12-
					Task "CreateItem" execution -- FAILED
12+
	at Microsoft.Build.BuildEngine.BuildTask.Execute () [0x0009a] in Microsoft.Build.Engine/Microsoft.Build.BuildEngine/BuildTask.cs:104
13-
					Done building target "AfterBuild" in project "/Users/thill/Projects/libgit2sharp/LibGit2Sharp.Tests/LibGit2Sharp.Tests.csproj".-- FAILED
13+
Task "CreateItem" execution -- FAILED
14-
				Done building target "AfterBuild" in project "/Users/thill/Projects/libgit2sharp/LibGit2Sharp.Tests/LibGit2Sharp.Tests.csproj" ("/Users/thill/Projects/libgit2sharp/LibGit2Sharp/CopyNativeDependencies.targets"); "Build" depends on it.
14+
15-
				Done building target "Build" in project "/Users/thill/Projects/libgit2sharp/LibGit2Sharp.Tests/LibGit2Sharp.Tests.csproj" ("/Library/Frameworks/Mono.framework/Versions/3.4.0/lib/mono/4.5/Microsoft.Common.targets").
15+
Done building target "AfterBuild" in project "/libgit2sharp/LibGit2Sharp.Tests/LibGit2Sharp.Tests.csproj".-- FAILED
16-
				Done building project "/Users/thill/Projects/libgit2sharp/LibGit2Sharp.Tests/LibGit2Sharp.Tests.csproj".-- FAILED
16+
Done building target "AfterBuild" in project "/libgit2sharp/LibGit2Sharp.Tests/LibGit2Sharp.Tests.csproj" ("/libgit2sharp/LibGit2Sharp/CopyNativeDependencies.targets"); "Build" depends on it.
17-
			Task "MSBuild" execution -- FAILED
17+
Done building target "Build" in project "/libgit2sharp/LibGit2Sharp.Tests/LibGit2Sharp.Tests.csproj" ("/Library/Frameworks/Mono.framework/Versions/3.4.0/lib/mono/4.5/Microsoft.Common.targets").
18-
			Done building target "Build" in project "/Users/thill/Projects/libgit2sharp/LibGit2Sharp.sln".-- FAILED
18+
Done building project "/libgit2sharp/LibGit2Sharp.Tests/LibGit2Sharp.Tests.csproj".-- FAILED
19-
		Done building target "Build" in project "/Users/thill/Projects/libgit2sharp/LibGit2Sharp.sln" ("/Users/thill/Projects/libgit2sharp/LibGit2Sharp.sln").
19+
20-
		Done building project "/Users/thill/Projects/libgit2sharp/LibGit2Sharp.sln".-- FAILED
20+
Task "MSBuild" execution -- FAILED
21-
	Task "MSBuild" execution -- FAILED
21+
		Done building target "Build" in project "/libgit2sharp/LibGit2Sharp.sln".-- FAILED
22-
	Done building target "Build" in project "/Users/thill/Projects/libgit2sharp/CI/build.msbuild".-- FAILED
22+
		Done building target "Build" in project "/libgit2sharp/LibGit2Sharp.sln" ("/libgit2sharp/LibGit2Sharp.sln").
23-
Done building target "Build" in project "/Users/thill/Projects/libgit2sharp/CI/build.msbuild" ("/Users/thill/Projects/libgit2sharp/CI/build.msbuild"); "Test" depends on it.
23+
		Done building project "/libgit2sharp/LibGit2Sharp.sln".-- FAILED
24-
Done building target "Test" in project "/Users/thill/Projects/libgit2sharp/CI/build.msbuild" ("/Users/thill/Projects/libgit2sharp/CI/build.msbuild"); "Deploy" depends on it.
24+
Task "MSBuild" execution -- FAILED
25-
Done building target "Deploy" in project "/Users/thill/Projects/libgit2sharp/CI/build.msbuild" ("/Users/thill/Projects/libgit2sharp/CI/build.msbuild").
25+
26-
Done building project "/Users/thill/Projects/libgit2sharp/CI/build.msbuild".-- FAILED
26+
Done building target "Build" in project "/libgit2sharp/CI/build.msbuild".-- FAILED
27
28
Done building target "Build" in project "/libgit2sharp/CI/build.msbuild" ("/libgit2sharp/CI/build.msbuild");
29
	"Test" depends on it.
30
31-
/Users/thill/Projects/libgit2sharp/CI/build.msbuild (Deploy) -> (Build target) ->
31+
Done building target "Test" in project "/libgit2sharp/CI/build.msbuild" ("/libgit2sharp/CI/build.msbuild");
32-
/Users/thill/Projects/libgit2sharp/LibGit2Sharp.sln (Build) ->  (Build target) ->
32+
	"Deploy" depends on it.
33-
/Users/thill/Projects/libgit2sharp/LibGit2Sharp.Tests/LibGit2Sharp.Tests.csproj (default targets) ->
33+
34-
/Users/thill/Projects/libgit2sharp/LibGit2Sharp/CopyNativeDependencies.targets (AfterBuild target) ->
34+
Done building target "Deploy" in project "/libgit2sharp/CI/build.msbuild" ("/libgit2sharp/CI/build.msbuild").
35
Done building project "/libgit2sharp/CI/build.msbuild".-- FAILED
36-
/Users/thill/Projects/libgit2sharp/LibGit2Sharp/CopyNativeDependencies.targets: error : Error executing task CreateItem: Invalid path
36+
37
Build FAILED.
38
Errors:
39
40
/libgit2sharp/CI/build.msbuild (Deploy) -> (Build target) ->
41
/libgit2sharp/LibGit2Sharp.sln (Build)  -> (Build target) ->
42
/libgit2sharp/LibGit2Sharp.Tests/LibGit2Sharp.Tests.csproj (default targets)  ->
43
/libgit2sharp/LibGit2Sharp/CopyNativeDependencies.targets (AfterBuild target) ->
44
45
/libgit2sharp/LibGit2Sharp/CopyNativeDependencies.targets: error : Error executing task CreateItem: Invalid path
46
47
	 0 Warning(s)
48
	 1 Error(s)
49
50
Time Elapsed 00:00:02.4272580