Advertisement
Guest User

Untitled

a guest
Apr 24th, 2022
29
Never
Not a member of Pastebin yet? Sign Up, it unlocks many cool features!
  1. 0 verbose cli C:\Program Files\nodejs\node.exe C:\Users\thund\AppData\Roaming\npm\node_modules\npm\bin\npm-cli.js
  2. 1 info using npm@8.7.0
  3. 2 info using node@v16.14.2
  4. 3 timing npm:load:whichnode Completed in 0ms
  5. 4 timing config:load:defaults Completed in 1ms
  6. 5 timing config:load:file:C:\Users\thund\AppData\Roaming\npm\node_modules\npm\npmrc Completed in 1ms
  7. 6 timing config:load:builtin Completed in 2ms
  8. 7 timing config:load:cli Completed in 1ms
  9. 8 timing config:load:env Completed in 1ms
  10. 9 timing config:load:file:D:\csFiles\psuFiles\springTerm2022\mediasoup3-record-demo\mediasoup3-record-demo\server\.npmrc Completed in 1ms
  11. 10 timing config:load:project Completed in 3ms
  12. 11 timing config:load:file:C:\Users\thund\.npmrc Completed in 0ms
  13. 12 timing config:load:user Completed in 0ms
  14. 13 timing config:load:file:C:\Users\thund\AppData\Roaming\npm\etc\npmrc Completed in 0ms
  15. 14 timing config:load:global Completed in 0ms
  16. 15 timing config:load:validate Completed in 0ms
  17. 16 timing config:load:credentials Completed in 0ms
  18. 17 timing config:load:setEnvs Completed in 1ms
  19. 18 timing config:load Completed in 10ms
  20. 19 timing npm:load:configload Completed in 10ms
  21. 20 timing npm:load:mkdirpcache Completed in 1ms
  22. 21 timing npm:load:mkdirplogs Completed in 0ms
  23. 22 verbose title npm i mediasoup
  24. 23 verbose argv "i" "mediasoup"
  25. 24 timing npm:load:setTitle Completed in 1ms
  26. 25 timing config:load:flatten Completed in 3ms
  27. 26 timing npm:load:display Completed in 4ms
  28. 27 verbose logfile logs-max:10 dir:C:\Users\thund\AppData\Local\npm-cache\_logs
  29. 28 verbose logfile C:\Users\thund\AppData\Local\npm-cache\_logs\2022-04-24T16_10_50_580Z-debug-0.log
  30. 29 timing npm:load:logFile Completed in 4ms
  31. 30 timing npm:load:timers Completed in 0ms
  32. 31 timing npm:load:configScope Completed in 0ms
  33. 32 timing npm:load Completed in 21ms
  34. 33 timing arborist:ctor Completed in 0ms
  35. 34 silly logfile start cleaning logs, removing 2 files
  36. 35 silly logfile done cleaning log files
  37. 36 timing idealTree:init Completed in 34ms
  38. 37 timing idealTree:userRequests Completed in 2ms
  39. 38 silly idealTree buildDeps
  40. 39 silly fetch manifest mediasoup@^3.9.5
  41. 40 http fetch GET 200 https://registry.npmjs.org/mediasoup 161ms (cache revalidated)
  42. 41 silly placeDep ROOT mediasoup@3.9.10 REPLACE for: server@1.0.0 want: ^3.9.5
  43. 42 silly fetch manifest debug@^4.3.4
  44. 43 silly fetch manifest supports-color@^9.2.2
  45. 44 http fetch GET 200 https://registry.npmjs.org/supports-color 7ms (cache hit)
  46. 45 http fetch GET 200 https://registry.npmjs.org/debug 9ms (cache hit)
  47. 46 timing idealTree:#root Completed in 180ms
  48. 47 silly placeDep ROOT debug@4.3.4 REPLACE for: mediasoup@3.9.10 want: ^4.3.4
  49. 48 silly placeDep ROOT supports-color@9.2.2 OK for: mediasoup@3.9.10 want: ^9.2.2
  50. 49 timing idealTree:node_modules/mediasoup Completed in 3ms
  51. 50 timing idealTree:node_modules/debug Completed in 0ms
  52. 51 timing idealTree:node_modules/supports-color Completed in 0ms
  53. 52 timing idealTree:buildDeps Completed in 184ms
  54. 53 timing idealTree:fixDepFlags Completed in 0ms
  55. 54 timing idealTree Completed in 221ms
  56. 55 timing reify:loadTrees Completed in 222ms
  57. 56 timing reify:diffTrees Completed in 2ms
  58. 57 silly reify moves {}
  59. 58 timing reify:retireShallow Completed in 1ms
  60. 59 timing reify:createSparse Completed in 61ms
  61. 60 timing reify:loadBundles Completed in 0ms
  62. 61 silly audit bulk request {
  63. 61 silly audit '@types/node': [ '16.11.20' ],
  64. 61 silly audit 'balanced-match': [ '1.0.2' ],
  65. 61 silly audit 'brace-expansion': [ '1.1.11' ],
  66. 61 silly audit 'concat-map': [ '0.0.1' ],
  67. 61 silly audit 'fs.realpath': [ '1.0.0' ],
  68. 61 silly audit 'function-bind': [ '1.1.1' ],
  69. 61 silly audit glob: [ '7.2.0' ],
  70. 61 silly audit 'h264-profile-level-id': [ '1.0.1' ],
  71. 61 silly audit has: [ '1.0.3' ],
  72. 61 silly audit inflight: [ '1.0.6' ],
  73. 61 silly audit inherits: [ '2.0.4' ],
  74. 61 silly audit interpret: [ '1.4.0' ],
  75. 61 silly audit 'is-core-module': [ '2.8.1' ],
  76. 61 silly audit minimatch: [ '3.0.4' ],
  77. 61 silly audit ms: [ '2.1.2' ],
  78. 61 silly audit once: [ '1.4.0' ],
  79. 61 silly audit 'path-is-absolute': [ '1.0.1' ],
  80. 61 silly audit 'path-parse': [ '1.0.7' ],
  81. 61 silly audit rechoir: [ '0.6.2' ],
  82. 61 silly audit resolve: [ '1.21.0' ],
  83. 61 silly audit shelljs: [ '0.8.5' ],
  84. 61 silly audit 'supports-preserve-symlinks-flag': [ '1.0.0' ],
  85. 61 silly audit uuid: [ '8.3.2' ],
  86. 61 silly audit wrappy: [ '1.0.2' ],
  87. 61 silly audit ws: [ '8.4.2' ],
  88. 61 silly audit mediasoup: [ '3.9.10' ],
  89. 61 silly audit debug: [ '4.3.4' ],
  90. 61 silly audit 'supports-color': [ '9.2.2' ]
  91. 61 silly audit }
  92. 62 http fetch POST 200 https://registry.npmjs.org/-/npm/v1/security/advisories/bulk 103ms
  93. 63 timing auditReport:getReport Completed in 105ms
  94. 64 silly audit report {}
  95. 65 timing auditReport:init Completed in 0ms
  96. 66 timing reify:audit Completed in 105ms
  97. 67 timing reifyNode:node_modules/wrappy Completed in 1679ms
  98. 68 timing reifyNode:node_modules/once Completed in 1678ms
  99. 69 timing reifyNode:node_modules/ms Completed in 1678ms
  100. 70 timing reifyNode:node_modules/path-parse Completed in 1678ms
  101. 71 timing reifyNode:node_modules/inflight Completed in 1679ms
  102. 72 timing reifyNode:node_modules/path-is-absolute Completed in 1679ms
  103. 73 timing reifyNode:node_modules/brace-expansion Completed in 2079ms
  104. 74 timing reifyNode:node_modules/inherits Completed in 2246ms
  105. 75 timing reifyNode:node_modules/minimatch Completed in 2341ms
  106. 76 timing reifyNode:node_modules/has Completed in 2345ms
  107. 77 timing reifyNode:node_modules/balanced-match Completed in 2570ms
  108. 78 timing reifyNode:node_modules/fs.realpath Completed in 2571ms
  109. 79 timing reifyNode:node_modules/interpret Completed in 2864ms
  110. 80 timing reifyNode:node_modules/supports-color Completed in 3125ms
  111. 81 timing reifyNode:node_modules/h264-profile-level-id Completed in 3326ms
  112. 82 timing reifyNode:node_modules/concat-map Completed in 3562ms
  113. 83 timing reifyNode:node_modules/glob Completed in 3850ms
  114. 84 timing reifyNode:node_modules/debug Completed in 3851ms
  115. 85 timing reifyNode:node_modules/rechoir Completed in 4162ms
  116. 86 timing reifyNode:node_modules/supports-preserve-symlinks-flag Completed in 4366ms
  117. 87 timing reifyNode:node_modules/is-core-module Completed in 4365ms
  118. 88 timing reifyNode:node_modules/function-bind Completed in 4735ms
  119. 89 timing reifyNode:node_modules/ws Completed in 7882ms
  120. 90 timing reifyNode:node_modules/shelljs Completed in 11758ms
  121. 91 timing reifyNode:node_modules/uuid Completed in 12744ms
  122. 92 timing reifyNode:node_modules/resolve Completed in 15139ms
  123. 93 timing reifyNode:node_modules/@types/node Completed in 21144ms
  124. 94 timing reifyNode:node_modules/mediasoup Completed in 34073ms
  125. 95 timing reify:unpack Completed in 34073ms
  126. 96 timing reify:unretire Completed in 0ms
  127. 97 timing build:queue Completed in 2ms
  128. 98 timing build:link:node_modules/resolve Completed in 8ms
  129. 99 timing build:link:node_modules/shelljs Completed in 7ms
  130. 100 timing build:link:node_modules/uuid Completed in 8ms
  131. 101 timing build:link Completed in 9ms
  132. 102 info run mediasoup@3.9.10 postinstall node_modules/mediasoup node npm-scripts.js postinstall
  133. 103 info run mediasoup@3.9.10 postinstall { code: 1, signal: null }
  134. 104 timing reify:rollback:createSparse Completed in 12942ms
  135. 105 timing reify:rollback:retireShallow Completed in 0ms
  136. 106 timing command:i Completed in 269386ms
  137. 107 verbose stack Error: command failed
  138. 107 verbose stack at ChildProcess.<anonymous> (C:\Users\thund\AppData\Roaming\npm\node_modules\npm\node_modules\@npmcli\promise-spawn\lib\index.js:63:27)
  139. 107 verbose stack at ChildProcess.emit (node:events:526:28)
  140. 107 verbose stack at maybeClose (node:internal/child_process:1092:16)
  141. 107 verbose stack at Process.ChildProcess._handle.onexit (node:internal/child_process:302:5)
  142. 108 verbose pkgid mediasoup@3.9.10
  143. 109 verbose cwd D:\csFiles\psuFiles\springTerm2022\mediasoup3-record-demo\mediasoup3-record-demo\server
  144. 110 verbose Windows_NT 10.0.19043
  145. 111 verbose node v16.14.2
  146. 112 verbose npm v8.7.0
  147. 113 error code 1
  148. 114 error path D:\csFiles\psuFiles\springTerm2022\mediasoup3-record-demo\mediasoup3-record-demo\server\node_modules\mediasoup
  149. 115 error command failed
  150. 116 error command C:\WINDOWS\system32\cmd.exe /d /s /c node npm-scripts.js postinstall
  151. 117 error npm-scripts.js [INFO] running task "postinstall"
  152. 117 error npm-scripts.js [INFO] executing command: node npm-scripts.js worker:build
  153. 117 error npm-scripts.js [INFO] running task "worker:build"
  154. 117 error npm-scripts.js [INFO] executing command: make -C worker
  155. 117 error make: Entering directory `/d/csFiles/psuFiles/springTerm2022/mediasoup3-record-demo/mediasoup3-record-demo/server/node_modules/mediasoup/worker'
  156. 117 error # Updated pip and setuptools are needed for meson
  157. 117 error # `--system` is not present everywhere and is only needed as workaround for
  158. 117 error # Debian-specific issue (copied from
  159. 117 error # https://github.com/gluster/gstatus/pull/33), fallback to command without
  160. 117 error # `--system` if the first one fails.
  161. 117 error python -m pip install --system --target=/d/csFiles/psuFiles/springTerm2022/mediasoup3-record-demo/mediasoup3-record-demo/server/node_modules/mediasoup/worker/out/pip pip setuptools || \
  162. 117 error python -m pip install --target=/d/csFiles/psuFiles/springTerm2022/mediasoup3-record-demo/mediasoup3-record-demo/server/node_modules/mediasoup/worker/out/pip pip setuptools || \
  163. 117 error echo "Installation failed, likely because PIP is unavailable, if you are on Debian/Ubuntu or derivative please install the python3-pip package"
  164. 117 error Collecting pip
  165. 117 error Using cached pip-22.0.4-py3-none-any.whl (2.1 MB)
  166. 117 error Collecting setuptools
  167. 117 error Using cached setuptools-62.1.0-py3-none-any.whl (1.1 MB)
  168. 117 error Installing collected packages: setuptools, pip
  169. 117 error Successfully installed pip-22.0.4 setuptools-62.1.0
  170. 117 error # Install `meson` and `ninja` using `pip` into custom location, so we don't
  171. 117 error # depend on system-wide installation.
  172. 117 error python -m pip install --upgrade --target=/d/csFiles/psuFiles/springTerm2022/mediasoup3-record-demo/mediasoup3-record-demo/server/node_modules/mediasoup/worker/out/pip meson ninja
  173. 117 error Collecting meson
  174. 117 error Using cached meson-0.62.1-py3-none-any.whl (863 kB)
  175. 117 error Collecting ninja
  176. 117 error Using cached ninja-1.10.2.3-py2.py3-none-win_amd64.whl (292 kB)
  177. 117 error Installing collected packages: ninja, meson
  178. 117 error Successfully installed meson-0.62.1 ninja-1.10.2.3
  179. 117 error /d/csFiles/psuFiles/springTerm2022/mediasoup3-record-demo/mediasoup3-record-demo/server/node_modules/mediasoup/worker/out/pip/bin/meson setup \
  180. 117 error --prefix /d/csFiles/psuFiles/springTerm2022/mediasoup3-record-demo/mediasoup3-record-demo/server/node_modules/mediasoup/worker/out/Release \
  181. 117 error --bindir '' \
  182. 117 error --libdir '' \
  183. 117 error --buildtype release \
  184. 117 error -Db_ndebug=true \
  185. 117 error -Db_pie=true \
  186. 117 error -Db_staticpic=true \
  187. 117 error --reconfigure \
  188. 117 error --vsenv \
  189. 117 error /d/csFiles/psuFiles/springTerm2022/mediasoup3-record-demo/mediasoup3-record-demo/server/node_modules/mediasoup/worker/out/Release/build || \
  190. 117 error /d/csFiles/psuFiles/springTerm2022/mediasoup3-record-demo/mediasoup3-record-demo/server/node_modules/mediasoup/worker/out/pip/bin/meson setup \
  191. 117 error --prefix /d/csFiles/psuFiles/springTerm2022/mediasoup3-record-demo/mediasoup3-record-demo/server/node_modules/mediasoup/worker/out/Release \
  192. 117 error --bindir '' \
  193. 117 error --libdir '' \
  194. 117 error --buildtype release \
  195. 117 error -Db_ndebug=true \
  196. 117 error -Db_pie=true \
  197. 117 error -Db_staticpic=true \
  198. 117 error --vsenv \
  199. 117 error /d/csFiles/psuFiles/springTerm2022/mediasoup3-record-demo/mediasoup3-record-demo/server/node_modules/mediasoup/worker/out/Release/build
  200. 117 error The Meson build system
  201. 117 error Version: 0.62.1
  202. 117 error Source dir: D:\csFiles\psuFiles\springTerm2022\mediasoup3-record-demo\mediasoup3-record-demo\server\node_modules\mediasoup\worker
  203. 117 error Build dir: D:\csFiles\psuFiles\springTerm2022\mediasoup3-record-demo\mediasoup3-record-demo\server\node_modules\mediasoup\worker\out\Release\build
  204. 117 error Build type: native build
  205. 117 error Project name: mediasoup-worker
  206. 117 error Project version: undefined
  207. 117 error Activating VS 16.11.10
  208. 117 error C compiler for the host machine: cl (msvc 19.29.30140 "Microsoft (R) C/C++ Optimizing Compiler Version 19.29.30140 for x64")
  209. 117 error C linker for the host machine: link link 14.29.30140.0
  210. 117 error C++ compiler for the host machine: cl (msvc 19.29.30140 "Microsoft (R) C/C++ Optimizing Compiler Version 19.29.30140 for x64")
  211. 117 error C++ linker for the host machine: link link 14.29.30140.0
  212. 117 error Host machine cpu family: x86_64
  213. 117 error Host machine cpu: x86_64
  214. 117 error Downloading openssl source from https://www.openssl.org/source/openssl-3.0.2.tar.gz
  215. 117 error Download size: 15038141
  216. 117 error Downloading: ..........
  217. 117 error Downloading openssl patch from https://wrapdb.mesonbuild.com/v2/openssl_3.0.2-1/get_patch
  218. 117 error Download size: 11837869
  219. 117 error Downloading: ..........
  220. 117 error
  221. 117 error Executing subproject openssl
  222. 117 error
  223. 117 error openssl| Project name: openssl
  224. 117 error openssl| Project version: 3.0.2
  225. 117 error openssl| C compiler for the host machine: cl (msvc 19.29.30140 "Microsoft (R) C/C++ Optimizing Compiler Version 19.29.30140 for x64")
  226. 117 error openssl| C linker for the host machine: link link 14.29.30140.0
  227. 117 error openssl| Run-time dependency threads found: YES
  228. 117 error openssl| Program as found: NO
  229. 117 error openssl| Program nasm found: NO
  230. 117 error openssl| Message: OpenSSL is configured without ASM support
  231. 117 error openssl| Library ws2_32 found: YES
  232. 117 error openssl| Library gdi32 found: YES
  233. 117 error openssl| Library advapi32 found: YES
  234. 117 error openssl| Library crypt32 found: YES
  235. 117 error openssl| Library user32 found: YES
  236. 117 error openssl| Build targets in project: 3
  237. 117 error openssl| Subproject openssl finished.
  238. 117 error
  239. 117 error Downloading nlohmann_json source from https://github.com/nlohmann/json/releases/download/v3.10.5/include.zip
  240. 117 error Download size: 260679
  241. 117 error Downloading: ..........
  242. 117 error
  243. 117 error Executing subproject nlohmann_json
  244. 117 error
  245. 117 error nlohmann_json| Project name: nlohmann_json
  246. 117 error nlohmann_json| Project version: 3.10.5
  247. 117 error nlohmann_json| C++ compiler for the host machine: cl (msvc 19.29.30140 "Microsoft (R) C/C++ Optimizing Compiler Version 19.29.30140 for x64")
  248. 117 error nlohmann_json| C++ linker for the host machine: link link 14.29.30140.0
  249. 117 error nlohmann_json| Build targets in project: 3
  250. 117 error nlohmann_json| Subproject nlohmann_json finished.
  251. 117 error
  252. 117 error Downloading libuv source from https://dist.libuv.org/dist/v1.43.0/libuv-v1.43.0.tar.gz
  253. 117 error Download size: 1288663
  254. 117 error Downloading: ..........
  255. 117 error Downloading libuv patch from https://wrapdb.mesonbuild.com/v2/libuv_1.43.0-1/get_patch
  256. 117 error Download size: 5153
  257. 117 error Downloading: ..........
  258. 117 error
  259. 117 error Executing subproject libuv
  260. 117 error
  261. 117 error libuv| Project name: libuv
  262. 117 error libuv| Project version: 1.43.0
  263. 117 error libuv| C compiler for the host machine: cl (msvc 19.29.30140 "Microsoft (R) C/C++ Optimizing Compiler Version 19.29.30140 for x64")
  264. 117 error libuv| C linker for the host machine: link link 14.29.30140.0
  265. 117 error libuv| Fetching value of define "__QNX__" :
  266. 117 error libuv| Fetching value of define "_AIX" :
  267. 117 error libuv| Message: System: windows
  268. 117 error libuv| Compiler for C supports arguments /wd4100: YES
  269. 117 error libuv| Compiler for C supports arguments /wd4127: YES
  270. 117 error libuv| Compiler for C supports arguments /wd4201: YES
  271. 117 error libuv| Compiler for C supports arguments /wd4206: YES
  272. 117 error libuv| Compiler for C supports arguments /wd4210: YES
  273. 117 error libuv| Compiler for C supports arguments /wd4232: YES
  274. 117 error libuv| Compiler for C supports arguments /wd4456: YES
  275. 117 error libuv| Compiler for C supports arguments /wd4457: YES
  276. 117 error libuv| Compiler for C supports arguments /wd4459: YES
  277. 117 error libuv| Compiler for C supports arguments /wd4706: YES
  278. 117 error libuv| Compiler for C supports arguments /wd4496: YES
  279. 117 error libuv| Compiler for C supports arguments /utf-8: YES
  280. 117 error libuv| Compiler for C supports arguments -fno-strict-aliasing: NO
  281. 117 error libuv| Dependency threads found: YES unknown (cached)
  282. 117 error libuv| Library psapi found: YES
  283. 117 error libuv| Library user32 found: YES
  284. 117 error libuv| Library advapi32 found: YES
  285. 117 error libuv| Library iphlpapi found: YES
  286. 117 error libuv| Library userenv found: YES
  287. 117 error libuv| Library ws2_32 found: YES
  288. 117 error libuv| Build targets in project: 4
  289. 117 error libuv| Subproject libuv finished.
  290. 117 error
  291. 117 error Downloading libsrtp2 source from https://github.com/cisco/libsrtp/archive/refs/tags/v2.4.2.zip
  292. 117 error Downloading file of unknown size.
  293. 117 error
  294. 117 error Executing subproject libsrtp2
  295. 117 error
  296. 117 error libsrtp2| Project name: libsrtp2
  297. 117 error libsrtp2| Project version: 2.4.2
  298. 117 error libsrtp2| C compiler for the host machine: cl (msvc 19.29.30140 "Microsoft (R) C/C++ Optimizing Compiler Version 19.29.30140 for x64")
  299. 117 error libsrtp2| C linker for the host machine: link link 14.29.30140.0
  300. 117 error libsrtp2| Library ws2_32 found: YES
  301. 117 error libsrtp2| Has header "arpa/inet.h" : NO
  302. 117 error libsrtp2| Has header "byteswap.h" : NO
  303. 117 error libsrtp2| Has header "inttypes.h" : YES
  304. 117 error libsrtp2| Has header "machine/types.h" : NO
  305. 117 error libsrtp2| Has header "netinet/in.h" : NO
  306. 117 error libsrtp2| Has header "stdint.h" : YES
  307. 117 error libsrtp2| Has header "stdlib.h" : YES
  308. 117 error libsrtp2| Has header "sys/int_types.h" : NO
  309. 117 error libsrtp2| Has header "sys/socket.h" : NO
  310. 117 error libsrtp2| Has header "sys/types.h" : YES
  311. 117 error libsrtp2| Has header "sys/uio.h" : NO
  312. 117 error libsrtp2| Has header "unistd.h" : NO
  313. 117 error libsrtp2| Has header "windows.h" : YES
  314. 117 error libsrtp2| Has header "winsock2.h" : YES
  315. 117 error libsrtp2| Checking for function "sigaction" with dependency -lws2_32: NO
  316. 117 error libsrtp2| Checking for function "inet_aton" with dependency -lws2_32: NO
  317. 117 error libsrtp2| Checking for function "usleep" with dependency -lws2_32: NO
  318. 117 error libsrtp2| Checking for function "socket" with dependency -lws2_32: YES
  319. 117 error libsrtp2| Has header "stdint.h" : YES (cached)
  320. 117 error libsrtp2| Checking for type "size_t" : YES
  321. 117 error libsrtp2| Checking for type "unsigned long" : YES
  322. 117 error libsrtp2| Checking for size of "unsigned long" : 4
  323. 117 error libsrtp2| Checking for type "unsigned long long" : YES
  324. 117 error libsrtp2| Checking for size of "unsigned long long" : 8
  325. 117 error libsrtp2| Checking if "inline keyword check" compiles: YES
  326. 117 error libsrtp2| Dependency openssl from subproject subprojects/openssl-3.0.2 found: YES 3.0.2
  327. 117 error libsrtp2| Configuring config.h using configuration
  328. 117 error libsrtp2| Compiler for C supports arguments -Wstrict-prototypes: NO
  329. 117 error libsrtp2| Compiler for C supports arguments -funroll-loops: NO
  330. 117 error libsrtp2| Program doxygen found: NO
  331. 117 error libsrtp2| Build targets in project: 5
  332. 117 error libsrtp2| Subproject libsrtp2 finished.
  333. 117 error
  334. 117 error Downloading usrsctp source from https://github.com/sctplab/usrsctp/archive/4e06feb01cadcd127d119486b98a4bd3d64aa1e7.zip
  335. 117 error Downloading file of unknown size.
  336. 117 error
  337. 117 error Executing subproject usrsctp
  338. 117 error
  339. 117 error usrsctp| Project name: usrsctplib
  340. 117 error usrsctp| Project version: 0.9.5.0
  341. 117 error usrsctp| C compiler for the host machine: cl (msvc 19.29.30140 "Microsoft (R) C/C++ Optimizing Compiler Version 19.29.30140 for x64")
  342. 117 error usrsctp| C linker for the host machine: link link 14.29.30140.0
  343. 117 error usrsctp| Compiler for C supports arguments /wd4100: YES (cached)
  344. 117 error usrsctp| Compiler for C supports arguments /wd4127: YES (cached)
  345. 117 error usrsctp| Compiler for C supports arguments /wd4200: YES
  346. 117 error usrsctp| Compiler for C supports arguments /wd4214: YES
  347. 117 error usrsctp| Compiler for C supports arguments /wd4706: YES (cached)
  348. 117 error usrsctp| Compiler for C supports arguments /wd4245: YES
  349. 117 error usrsctp| Compiler for C supports arguments /wd4389: YES
  350. 117 error usrsctp| Compiler for C supports arguments /wd4702: YES
  351. 117 error usrsctp| Compiler for C supports arguments /wd4701: YES
  352. 117 error usrsctp| Compiler for C supports arguments /wd4244: YES
  353. 117 error usrsctp| Dependency threads found: YES unknown (cached)
  354. 117 error usrsctp| Library ws2_32 found: YES
  355. 117 error usrsctp| Library iphlpapi found: YES
  356. 117 error usrsctp| Has header "sys/queue.h" : NO
  357. 117 error usrsctp| Has header "sys/socket.h" : NO (cached)
  358. 117 error usrsctp| Has header "sys/types.h" : YES (cached)
  359. 117 error usrsctp| Has header "netinet/in.h" : NO (cached)
  360. 117 error usrsctp| Has header "netinet/ip.h" : NO
  361. 117 error usrsctp| Has header "netinet/ip_icmp.h" : NO
  362. 117 error usrsctp| Has header "net/route.h" : NO
  363. 117 error usrsctp| Has header "stdatomic.h" : NO
  364. 117 error usrsctp| Checking whether type "struct sockaddr" has member "sa_len" : NO
  365. 117 error usrsctp| Checking whether type "struct sockaddr_in" has member "sin_len" : NO
  366. 117 error usrsctp| Checking whether type "struct sockaddr_in6" has member "sin6_len" : NO
  367. 117 error usrsctp| Checking whether type "struct sockaddr_conn" has member "sconn_len" : NO
  368. 117 error usrsctp| Build targets in project: 6
  369. 117 error usrsctp| Subproject usrsctp finished.
  370. 117 error
  371. 117 error Downloading abseil-cpp source from https://github.com/abseil/abseil-cpp/archive/20211102.0.tar.gz
  372. 117 error Download size: 1884080
  373. 117 error Downloading: ..........
  374. 117 error Downloading abseil-cpp patch from https://wrapdb.mesonbuild.com/v2/abseil-cpp_20211102.0-2/get_patch
  375. 117 error Download size: 3404
  376. 117 error Downloading: ..........
  377. 117 error
  378. 117 error Executing subproject abseil-cpp
  379. 117 error
  380. 117 error abseil-cpp| Project name: abseil-cpp
  381. 117 error abseil-cpp| Project version: 20211102.0
  382. 117 error abseil-cpp| C++ compiler for the host machine: cl (msvc 19.29.30140 "Microsoft (R) C/C++ Optimizing Compiler Version 19.29.30140 for x64")
  383. 117 error abseil-cpp| C++ linker for the host machine: link link 14.29.30140.0
  384. 117 error abseil-cpp| Compiler for C++ supports arguments -Wno-sign-compare: NO
  385. 117 error abseil-cpp| Compiler for C++ supports arguments -maes: NO
  386. 117 error abseil-cpp| Compiler for C++ supports arguments -msse4.1: NO
  387. 117 error abseil-cpp| Dependency threads found: YES unknown (cached)
  388. 117 error abseil-cpp| Did not find pkg-config by name 'pkg-config'
  389. 117 error abseil-cpp| Found Pkg-config: NO
  390. 117 error abseil-cpp| Found CMake: C:\Program Files (x86)\Microsoft Visual Studio\2019\BuildTools\Common7\IDE\CommonExtensions\Microsoft\CMake\CMake\bin\cmake.EXE (3.20.21032501)
  391. 117 error abseil-cpp| Run-time dependency corefoundation found: NO (tried pkgconfig and cmake)
  392. 117 error abseil-cpp| Build targets in project: 19
  393. 117 error abseil-cpp| Subproject abseil-cpp finished.
  394. 117 error
  395. 117 error Downloading catch2 source from https://github.com/catchorg/Catch2/archive/v2.13.7.zip
  396. 117 error Downloading file of unknown size.
  397. 117 error Downloading catch2 patch from https://wrapdb.mesonbuild.com/v2/catch2_2.13.7-1/get_patch
  398. 117 error Download size: 1133
  399. 117 error Downloading: ..........
  400. 117 error
  401. 117 error Executing subproject catch2
  402. 117 error
  403. 117 error catch2| Project name: catch2
  404. 117 error catch2| Project version: 2.13.7
  405. 117 error catch2| C++ compiler for the host machine: cl (msvc 19.29.30140 "Microsoft (R) C/C++ Optimizing Compiler Version 19.29.30140 for x64")
  406. 117 error catch2| C++ linker for the host machine: link link 14.29.30140.0
  407. 117 error catch2| Build targets in project: 19
  408. 117 error catch2| Subproject catch2 finished.
  409. 117 error
  410. 117 error Downloading wingetopt source from https://github.com/alex85k/wingetopt/archive/v1.00.zip
  411. 117 error Downloading file of unknown size.
  412. 117 error
  413. 117 error Executing subproject wingetopt
  414. 117 error
  415. 117 error wingetopt| Project name: wingetopt
  416. 117 error wingetopt| Project version: 0.95
  417. 117 error wingetopt| C compiler for the host machine: cl (msvc 19.29.30140 "Microsoft (R) C/C++ Optimizing Compiler Version 19.29.30140 for x64")
  418. 117 error wingetopt| C linker for the host machine: link link 14.29.30140.0
  419. 117 error wingetopt| Build targets in project: 21
  420. 117 error wingetopt| Subproject wingetopt finished.
  421. 117 error
  422. 117 error Build targets in project: 24
  423. 117 error
  424. 117 error mediasoup-worker undefined
  425. 117 error
  426. 117 error Subprojects
  427. 117 error abseil-cpp : YES
  428. 117 error catch2 : YES
  429. 117 error libsrtp2 : YES
  430. 117 error libuv : YES
  431. 117 error nlohmann_json: YES
  432. 117 error openssl : YES
  433. 117 error usrsctp : YES
  434. 117 error wingetopt : YES
  435. 117 error
  436. 117 error User defined options
  437. 117 error bindir :
  438. 117 error buildtype : release
  439. 117 error libdir :
  440. 117 error prefix : d:/csFiles/psuFiles/springTerm2022/mediasoup3-record-demo/mediasoup3-record-demo/server/node_modules/mediasoup/worker/out/Release
  441. 117 error b_ndebug : true
  442. 117 error b_pie : true
  443. 117 error b_staticpic : true
  444. 117 error
  445. 117 error Found ninja.exe-1.10.2.git.kitware.jobserver-1 at d:/csFiles/psuFiles/springTerm2022/mediasoup3-record-demo/mediasoup3-record-demo/server/node_modules/mediasoup/worker/out/pip/bin/ninja.exe
  446. 117 error
  447. 117 error Visual Studio environment is needed to run Ninja. It is recommended to use Meson wrapper:
  448. 117 error D:\csFiles\psuFiles\springTerm2022\mediasoup3-record-demo\mediasoup3-record-demo\server\node_modules\mediasoup\worker\out\pip\bin\meson compile -C out\Release\build
  449. 117 error WARNING: msvc does not support C++11; attempting best effort; setting the standard to C++14
  450. 117 error /d/csFiles/psuFiles/springTerm2022/mediasoup3-record-demo/mediasoup3-record-demo/server/node_modules/mediasoup/worker/out/pip/bin/meson compile -C /d/csFiles/psuFiles/springTerm2022/mediasoup3-record-demo/mediasoup3-record-demo/server/node_modules/mediasoup/worker/out/Release/build -j 4 mediasoup-worker
  451. 117 error ninja: Entering directory `D:/csFiles/psuFiles/springTerm2022/mediasoup3-record-demo/mediasoup3-record-demo/server/node_modules/mediasoup/worker/out/Release/build'
  452. 117 error [1/1296] Compiling C object subprojects/openssl-3.0.2/libcrypto.a.p/crypto_aes_aes_cfb.c.obj
  453. 117 error [2/1296] Compiling C object subprojects/openssl-3.0.2/libcrypto.a.p/crypto_aes_aes_misc.c.obj
  454. 117 error [3/1296] Compiling C object subprojects/openssl-3.0.2/libcrypto.a.p/crypto_aes_aes_cbc.c.obj
  455. 117 error [4/1296] Compiling C object subprojects/openssl-3.0.2/libcrypto.a.p/crypto_aes_aes_ecb.c.obj
  456. 117 error [5/1296] Compiling C object subprojects/openssl-3.0.2/libcrypto.a.p/crypto_aes_aes_ofb.c.obj
  457. 117 error [6/1296] Compiling C object subprojects/openssl-3.0.2/libcrypto.a.p/crypto_aes_aes_wrap.c.obj
  458. 117 error [7/1296] Compiling C object subprojects/openssl-3.0.2/libcrypto.a.p/crypto_aes_aes_core.c.obj
  459. 117 error [8/1296] Compiling C object subprojects/openssl-3.0.2/libcrypto.a.p/crypto_bn_bn_word.c.obj
  460. 117 error [9/1296] Compiling C object subprojects/openssl-3.0.2/libcrypto.a.p/crypto_aes_aes_ige.c.obj
  461. 117 error [10/1296] Compiling C object subprojects/openssl-3.0.2/libcrypto.a.p/crypto_buffer_buf_err.c.obj
  462. 117 error [11/1296] Compiling C object subprojects/openssl-3.0.2/libcrypto.a.p/crypto_bn_bn_srp.c.obj
  463. 117 error [12/1296] Compiling C object subprojects/openssl-3.0.2/libcrypto.a.p/crypto_bn_bn_x931p.c.obj
  464. 117 error [13/1296] Compiling C object subprojects/openssl-3.0.2/libcrypto.a.p/crypto_bn_bn_rsa_fips186_4.c.obj
  465. 117 error [14/1296] Compiling C object subprojects/openssl-3.0.2/libcrypto.a.p/crypto_bn_bn_sqrt.c.obj
  466. 117 error [15/1296] Compiling C object subprojects/openssl-3.0.2/libcrypto.a.p/crypto_bn_bn_shift.c.obj
  467. 117 error [16/1296] Compiling C object subprojects/openssl-3.0.2/libcrypto.a.p/crypto_buffer_buffer.c.obj
  468. 117 error [17/1296] Compiling C object subprojects/openssl-3.0.2/libcrypto.a.p/crypto_bn_bn_sqr.c.obj
  469. 117 error [18/1296] Compiling C object subprojects/openssl-3.0.2/libcrypto.a.p/crypto_bn_bn_mul.c.obj
  470. 117 error [19/1296] Compiling C object subprojects/openssl-3.0.2/libcrypto.a.p/crypto_bn_bn_nist.c.obj
  471. 117 error [20/1296] Compiling C object subprojects/openssl-3.0.2/libcrypto.a.p/crypto_bn_bn_lib.c.obj
  472. 117 error [21/1296] Compiling C object subprojects/openssl-3.0.2/libcrypto.a.p/crypto_bn_bn_intern.c.obj
  473. 117 error [22/1296] Compiling C object subprojects/openssl-3.0.2/libcrypto.a.p/crypto_bn_bn_kron.c.obj
  474. 117 error [23/1296] Compiling C object subprojects/openssl-3.0.2/libcrypto.a.p/crypto_bn_bn_mont.c.obj
  475. 117 error [24/1296] Compiling C object subprojects/openssl-3.0.2/libcrypto.a.p/crypto_bn_bn_mpi.c.obj
  476. 117 error [25/1296] Compiling C object subprojects/openssl-3.0.2/libcrypto.a.p/crypto_bn_bn_prime.c.obj
  477. 117 error [26/1296] Compiling C object subprojects/openssl-3.0.2/libcrypto.a.p/crypto_bn_bn_mod.c.obj
  478. 117 error [27/1296] Compiling C object subprojects/openssl-3.0.2/libcrypto.a.p/crypto_bn_bn_recp.c.obj
  479. 117 error [28/1296] Compiling C object subprojects/openssl-3.0.2/libcrypto.a.p/crypto_bn_bn_rand.c.obj
  480. 117 error [29/1296] Compiling C object subprojects/openssl-3.0.2/libcrypto.a.p/crypto_bn_bn_print.c.obj
  481. 117 error [30/1296] Compiling C object subprojects/openssl-3.0.2/libcrypto.a.p/crypto_cmp_cmp_msg.c.obj
  482. 117 error [31/1296] Compiling C object subprojects/openssl-3.0.2/libcrypto.a.p/crypto_cmp_cmp_http.c.obj
  483. 117 error [32/1296] Compiling C object subprojects/openssl-3.0.2/libcrypto.a.p/crypto_chacha_chacha_enc.c.obj
  484. 117 error [33/1296] Compiling C object subprojects/openssl-3.0.2/libcrypto.a.p/crypto_cast_c_skey.c.obj
  485. 117 error [34/1296] Compiling C object subprojects/openssl-3.0.2/libcrypto.a.p/crypto_cmp_cmp_err.c.obj
  486. 117 error [35/1296] Compiling C object subprojects/openssl-3.0.2/libcrypto.a.p/crypto_cmp_cmp_asn.c.obj
  487. 117 error [36/1296] Compiling C object subprojects/openssl-3.0.2/libcrypto.a.p/crypto_cmac_cmac.c.obj
  488. 117 error [37/1296] Compiling C object subprojects/openssl-3.0.2/libcrypto.a.p/crypto_cast_c_ecb.c.obj
  489. 117 error [38/1296] Compiling C object subprojects/openssl-3.0.2/libcrypto.a.p/crypto_cmp_cmp_ctx.c.obj
  490. 117 error [39/1296] Compiling C object subprojects/openssl-3.0.2/libcrypto.a.p/crypto_cmp_cmp_hdr.c.obj
  491. 117 error [40/1296] Compiling C object subprojects/openssl-3.0.2/libcrypto.a.p/crypto_cmp_cmp_client.c.obj
  492. 117 error [41/1296] Compiling C object subprojects/openssl-3.0.2/libcrypto.a.p/crypto_camellia_cmll_ctr.c.obj
  493. 117 error [42/1296] Compiling C object subprojects/openssl-3.0.2/libcrypto.a.p/crypto_camellia_cmll_cbc.c.obj
  494. 117 error [43/1296] Compiling C object subprojects/openssl-3.0.2/libcrypto.a.p/crypto_camellia_cmll_cfb.c.obj
  495. 117 error [44/1296] Compiling C object subprojects/openssl-3.0.2/libcrypto.a.p/crypto_camellia_cmll_ecb.c.obj
  496. 117 error [45/1296] Compiling C object subprojects/openssl-3.0.2/libcrypto.a.p/crypto_camellia_cmll_ofb.c.obj
  497. 117 error [46/1296] Compiling C object subprojects/openssl-3.0.2/libcrypto.a.p/crypto_camellia_cmll_misc.c.obj
  498. 117 error [47/1296] Compiling C object subprojects/openssl-3.0.2/libcrypto.a.p/crypto_cast_c_cfb64.c.obj
  499. 117 error [48/1296] Compiling C object subprojects/openssl-3.0.2/libcrypto.a.p/crypto_cast_c_ofb64.c.obj
  500. 117 error [49/1296] Compiling C object subprojects/openssl-3.0.2/libcrypto.a.p/crypto_camellia_camellia.c.obj
  501. 117 error [50/1296] Compiling C object subprojects/openssl-3.0.2/libcrypto.a.p/crypto_cast_c_enc.c.obj
  502. 117 error [51/1296] Compiling C object subprojects/openssl-3.0.2/libcrypto.a.p/crypto_cms_cms_err.c.obj
  503. 117 error [52/1296] Compiling C object subprojects/openssl-3.0.2/libcrypto.a.p/crypto_cms_cms_io.c.obj
  504. 117 error [53/1296] Compiling C object subprojects/openssl-3.0.2/libcrypto.a.p/crypto_cms_cms_enc.c.obj
  505. 117 error [54/1296] Compiling C object subprojects/openssl-3.0.2/libcrypto.a.p/crypto_cms_cms_kari.c.obj
  506. 117 error [55/1296] Compiling C object subprojects/openssl-3.0.2/libcrypto.a.p/crypto_cms_cms_lib.c.obj
  507. 117 error [56/1296] Compiling C object subprojects/openssl-3.0.2/libcrypto.a.p/crypto_cms_cms_pwri.c.obj
  508. 117 error [57/1296] Compiling C object subprojects/openssl-3.0.2/libcrypto.a.p/crypto_cms_cms_rsa.c.obj
  509. 117 error [58/1296] Compiling C object subprojects/openssl-3.0.2/libcrypto.a.p/crypto_cms_cms_ess.c.obj
  510. 117 error [59/1296] Compiling C object subprojects/openssl-3.0.2/libcrypto.a.p/crypto_cms_cms_env.c.obj
  511. 117 error [60/1296] Compiling C object subprojects/openssl-3.0.2/libcrypto.a.p/crypto_cms_cms_att.c.obj
  512. 117 error [61/1296] Compiling C object subprojects/openssl-3.0.2/libcrypto.a.p/crypto_cms_cms_asn1.c.obj
  513. 117 error [62/1296] Compiling C object subprojects/openssl-3.0.2/libcrypto.a.p/crypto_cms_cms_cd.c.obj
  514. 117 error [63/1296] Compiling C object subprojects/openssl-3.0.2/libcrypto.a.p/crypto_cmp_cmp_vfy.c.obj
  515. 117 error [64/1296] Compiling C object subprojects/openssl-3.0.2/libcrypto.a.p/crypto_cmp_cmp_util.c.obj
  516. 117 error [65/1296] Compiling C object subprojects/openssl-3.0.2/libcrypto.a.p/crypto_cmp_cmp_server.c.obj
  517. 117 error [66/1296] Compiling C object subprojects/openssl-3.0.2/libcrypto.a.p/crypto_cmp_cmp_status.c.obj
  518. 117 error [67/1296] Compiling C object subprojects/openssl-3.0.2/libcrypto.a.p/crypto_cms_cms_dd.c.obj
  519. 117 error [68/1296] Compiling C object subprojects/openssl-3.0.2/libcrypto.a.p/crypto_cmp_cmp_protect.c.obj
  520. 117 error [69/1296] Compiling C object subprojects/openssl-3.0.2/libcrypto.a.p/crypto_cms_cms_dh.c.obj
  521. 117 error [70/1296] Compiling C object subprojects/openssl-3.0.2/libcrypto.a.p/crypto_cms_cms_ec.c.obj
  522. 117 error [71/1296] Compiling C object subprojects/openssl-3.0.2/libcrypto.a.p/crypto_conf_conf_api.c.obj
  523. 117 error [72/1296] Compiling C object subprojects/openssl-3.0.2/libcrypto.a.p/crypto_conf_conf_mall.c.obj
  524. 117 error [73/1296] Compiling C object subprojects/openssl-3.0.2/libcrypto.a.p/crypto_conf_conf_lib.c.obj
  525. 117 error [74/1296] Compiling C object subprojects/openssl-3.0.2/libcrypto.a.p/crypto_cms_cms_sd.c.obj
  526. 117 error [75/1296] Compiling C object subprojects/openssl-3.0.2/libcrypto.a.p/crypto_conf_conf_mod.c.obj
  527. 117 error [76/1296] Compiling C object subprojects/openssl-3.0.2/libcrypto.a.p/crypto_conf_conf_sap.c.obj
  528. 117 error [77/1296] Compiling C object subprojects/openssl-3.0.2/libcrypto.a.p/crypto_conf_conf_err.c.obj
  529. 117 error [78/1296] Compiling C object subprojects/openssl-3.0.2/libcrypto.a.p/crypto_cms_cms_smime.c.obj
  530. 117 error [79/1296] Compiling C object subprojects/openssl-3.0.2/libcrypto.a.p/crypto_conf_conf_ssl.c.obj
  531. 117 error [80/1296] Compiling C object subprojects/openssl-3.0.2/libcrypto.a.p/crypto_crmf_crmf_asn.c.obj
  532. 117 error [81/1296] Compiling C object subprojects/openssl-3.0.2/libcrypto.a.p/crypto_conf_conf_def.c.obj
  533. 117 error [82/1296] Compiling C object subprojects/openssl-3.0.2/libcrypto.a.p/crypto_ct_ct_err.c.obj
  534. 117 error [83/1296] Compiling C object subprojects/openssl-3.0.2/libcrypto.a.p/crypto_crmf_crmf_lib.c.obj
  535. 117 error [84/1296] Compiling C object subprojects/openssl-3.0.2/libcrypto.a.p/crypto_ct_ct_b64.c.obj
  536. 117 error [85/1296] Compiling C object subprojects/openssl-3.0.2/libcrypto.a.p/crypto_ct_ct_log.c.obj
  537. 117 error [86/1296] Compiling C object subprojects/openssl-3.0.2/libcrypto.a.p/crypto_ct_ct_oct.c.obj
  538. 117 error [87/1296] Compiling C object subprojects/openssl-3.0.2/libcrypto.a.p/crypto_crmf_crmf_err.c.obj
  539. 117 error [88/1296] Compiling C object subprojects/openssl-3.0.2/libcrypto.a.p/crypto_ct_ct_policy.c.obj
  540. 117 error [89/1296] Compiling C object subprojects/openssl-3.0.2/libcrypto.a.p/crypto_des_cfb64ede.c.obj
  541. 117 error [90/1296] Compiling C object subprojects/openssl-3.0.2/libcrypto.a.p/crypto_crmf_crmf_pbm.c.obj
  542. 117 error [91/1296] Compiling C object subprojects/openssl-3.0.2/libcrypto.a.p/crypto_ct_ct_sct.c.obj
  543. 117 error [92/1296] Compiling C object subprojects/openssl-3.0.2/libcrypto.a.p/crypto_des_cfb64enc.c.obj
  544. 117 error [93/1296] Compiling C object subprojects/openssl-3.0.2/libcrypto.a.p/crypto_ct_ct_vfy.c.obj
  545. 117 error [94/1296] Compiling C object subprojects/openssl-3.0.2/libcrypto.a.p/crypto_des_cbc_cksm.c.obj
  546. 117 error [95/1296] Compiling C object subprojects/openssl-3.0.2/libcrypto.a.p/crypto_ct_ct_sct_ctx.c.obj
  547. 117 error [96/1296] Compiling C object subprojects/openssl-3.0.2/libcrypto.a.p/crypto_des_cbc_enc.c.obj
  548. 117 error [97/1296] Compiling C object subprojects/openssl-3.0.2/libcrypto.a.p/crypto_ct_ct_x509v3.c.obj
  549. 117 error [98/1296] Compiling C object subprojects/openssl-3.0.2/libcrypto.a.p/crypto_des_ofb64enc.c.obj
  550. 117 error [99/1296] Compiling C object subprojects/openssl-3.0.2/libcrypto.a.p/crypto_ct_ct_prn.c.obj
  551. 117 error [100/1296] Compiling C object subprojects/openssl-3.0.2/libcrypto.a.p/crypto_des_ofb_enc.c.obj
  552. 117 error [101/1296] Compiling C object subprojects/openssl-3.0.2/libcrypto.a.p/crypto_des_ecb_enc.c.obj
  553. 117 error [102/1296] Compiling C object subprojects/openssl-3.0.2/libcrypto.a.p/crypto_des_ofb64ede.c.obj
  554. 117 error [103/1296] Compiling C object subprojects/openssl-3.0.2/libcrypto.a.p/crypto_des_des_enc.c.obj
  555. 117 error [104/1296] Compiling C object subprojects/openssl-3.0.2/libcrypto.a.p/crypto_des_fcrypt_b.c.obj
  556. 117 error [105/1296] Compiling C object subprojects/openssl-3.0.2/libcrypto.a.p/crypto_des_cfb_enc.c.obj
  557. 117 error [106/1296] Compiling C object subprojects/openssl-3.0.2/libcrypto.a.p/crypto_des_fcrypt.c.obj
  558. 117 error [107/1296] Compiling C object subprojects/openssl-3.0.2/libcrypto.a.p/crypto_des_ecb3_enc.c.obj
  559. 117 error [108/1296] Compiling C object subprojects/openssl-3.0.2/libcrypto.a.p/crypto_des_qud_cksm.c.obj
  560. 117 error [109/1296] Compiling C object subprojects/openssl-3.0.2/libcrypto.a.p/crypto_des_str2key.c.obj
  561. 117 error [110/1296] Compiling C object subprojects/openssl-3.0.2/libcrypto.a.p/crypto_des_pcbc_enc.c.obj
  562. 117 error [111/1296] Compiling C object subprojects/openssl-3.0.2/libcrypto.a.p/crypto_des_rand_key.c.obj
  563. 117 error [112/1296] Compiling C object subprojects/openssl-3.0.2/libcrypto.a.p/crypto_des_set_key.c.obj
  564. 117 error [113/1296] Compiling C object subprojects/openssl-3.0.2/libcrypto.a.p/crypto_des_xcbc_enc.c.obj
  565. 117 error [114/1296] Compiling C object subprojects/openssl-3.0.2/libcrypto.a.p/crypto_dh_dh_depr.c.obj
  566. 117 error [115/1296] Compiling C object subprojects/openssl-3.0.2/libcrypto.a.p/crypto_dh_dh_err.c.obj
  567. 117 error [116/1296] Compiling C object subprojects/openssl-3.0.2/libcrypto.a.p/crypto_dh_dh_asn1.c.obj
  568. 117 error [117/1296] Compiling C object subprojects/openssl-3.0.2/libcrypto.a.p/crypto_dh_dh_check.c.obj
  569. 117 error [118/1296] Compiling C object subprojects/openssl-3.0.2/libcrypto.a.p/crypto_dh_dh_gen.c.obj
  570. 117 error [119/1296] Compiling C object subprojects/openssl-3.0.2/libcrypto.a.p/crypto_dh_dh_ameth.c.obj
  571. 117 error [120/1296] Compiling C object subprojects/openssl-3.0.2/libcrypto.a.p/crypto_dh_dh_backend.c.obj
  572. 117 error [121/1296] Compiling C object subprojects/openssl-3.0.2/libcrypto.a.p/crypto_dsa_dsa_asn1.c.obj
  573. 117 error [122/1296] Compiling C object subprojects/openssl-3.0.2/libcrypto.a.p/crypto_dsa_dsa_ameth.c.obj
  574. 117 error [123/1296] Compiling C object subprojects/openssl-3.0.2/libcrypto.a.p/crypto_dh_dh_group_params.c.obj
  575. 117 error [124/1296] Compiling C object subprojects/openssl-3.0.2/libcrypto.a.p/crypto_dh_dh_rfc5114.c.obj
  576. 117 error [125/1296] Compiling C object subprojects/openssl-3.0.2/libcrypto.a.p/crypto_dh_dh_lib.c.obj
  577. 117 error [126/1296] Compiling C object subprojects/openssl-3.0.2/libcrypto.a.p/crypto_dh_dh_kdf.c.obj
  578. 117 error [127/1296] Compiling C object subprojects/openssl-3.0.2/libcrypto.a.p/crypto_dh_dh_key.c.obj
  579. 117 error [128/1296] Compiling C object subprojects/openssl-3.0.2/libcrypto.a.p/crypto_dh_dh_meth.c.obj
  580. 117 error [129/1296] Compiling C object subprojects/openssl-3.0.2/libcrypto.a.p/crypto_dh_dh_pmeth.c.obj
  581. 117 error [130/1296] Compiling C object subprojects/openssl-3.0.2/libcrypto.a.p/crypto_dh_dh_prn.c.obj
  582. 117 error [131/1296] Compiling C object subprojects/openssl-3.0.2/libcrypto.a.p/crypto_dsa_dsa_err.c.obj
  583. 117 error [132/1296] Compiling C object subprojects/openssl-3.0.2/libcrypto.a.p/crypto_dsa_dsa_backend.c.obj
  584. 117 error [133/1296] Compiling C object subprojects/openssl-3.0.2/libcrypto.a.p/crypto_dsa_dsa_lib.c.obj
  585. 117 error [134/1296] Compiling C object subprojects/openssl-3.0.2/libcrypto.a.p/crypto_dsa_dsa_check.c.obj
  586. 117 error [135/1296] Compiling C object subprojects/openssl-3.0.2/libcrypto.a.p/crypto_dsa_dsa_depr.c.obj
  587. 117 error [136/1296] Compiling C object subprojects/openssl-3.0.2/libcrypto.a.p/crypto_dsa_dsa_key.c.obj
  588. 117 error [137/1296] Compiling C object subprojects/openssl-3.0.2/libcrypto.a.p/crypto_dsa_dsa_meth.c.obj
  589. 117 error [138/1296] Compiling C object subprojects/openssl-3.0.2/libcrypto.a.p/crypto_dsa_dsa_ossl.c.obj
  590. 117 error [139/1296] Compiling C object subprojects/openssl-3.0.2/libcrypto.a.p/crypto_dsa_dsa_gen.c.obj
  591. 117 error [140/1296] Compiling C object subprojects/openssl-3.0.2/libcrypto.a.p/crypto_dsa_dsa_vrf.c.obj
  592. 117 error [141/1296] Compiling C object subprojects/openssl-3.0.2/libcrypto.a.p/crypto_dso_dso_openssl.c.obj
  593. 117 error [142/1296] Compiling C object subprojects/openssl-3.0.2/libcrypto.a.p/crypto_dso_dso_dl.c.obj
  594. 117 error [143/1296] Compiling C object subprojects/openssl-3.0.2/libcrypto.a.p/crypto_dso_dso_err.c.obj
  595. 117 error [144/1296] Compiling C object subprojects/openssl-3.0.2/libcrypto.a.p/crypto_dsa_dsa_sign.c.obj
  596. 117 error [145/1296] Compiling C object subprojects/openssl-3.0.2/libcrypto.a.p/crypto_dsa_dsa_prn.c.obj
  597. 117 error [146/1296] Compiling C object subprojects/openssl-3.0.2/libcrypto.a.p/crypto_dso_dso_lib.c.obj
  598. 117 error [147/1296] Compiling C object subprojects/openssl-3.0.2/libcrypto.a.p/crypto_dso_dso_dlfcn.c.obj
  599. 117 error [148/1296] Compiling C object subprojects/openssl-3.0.2/libcrypto.a.p/crypto_dso_dso_vms.c.obj
  600. 117 error [149/1296] Compiling C object subprojects/openssl-3.0.2/libcrypto.a.p/crypto_dsa_dsa_pmeth.c.obj
  601. 117 error [150/1296] Compiling C object subprojects/openssl-3.0.2/libcrypto.a.p/crypto_ec_curve448_arch_64_f_impl64.c.obj
  602. 117 error [151/1296] Compiling C object subprojects/openssl-3.0.2/libcrypto.a.p/crypto_dso_dso_win32.c.obj
  603. 117 error [152/1296] Compiling C object subprojects/openssl-3.0.2/libcrypto.a.p/crypto_ec_curve448_arch_32_f_impl32.c.obj
  604. 117 error [153/1296] Compiling C object subprojects/openssl-3.0.2/libcrypto.a.p/crypto_ec_curve448_curve448.c.obj
  605. 117 error [154/1296] Compiling C object subprojects/openssl-3.0.2/libcrypto.a.p/crypto_ec_curve448_curve448_tables.c.obj
  606. 117 error [155/1296] Compiling C object subprojects/openssl-3.0.2/libcrypto.a.p/crypto_ec_curve448_eddsa.c.obj
  607. 117 error [156/1296] Compiling C object subprojects/openssl-3.0.2/libcrypto.a.p/crypto_ec_curve448_scalar.c.obj
  608. 117 error [157/1296] Compiling C object subprojects/openssl-3.0.2/libcrypto.a.p/crypto_ec_curve25519.c.obj
  609. 117 error [158/1296] Compiling C object subprojects/openssl-3.0.2/libcrypto.a.p/crypto_ec_ec2_oct.c.obj
  610. 117 error [159/1296] Compiling C object subprojects/openssl-3.0.2/libcrypto.a.p/crypto_ec_ec2_smpl.c.obj
  611. 117 error [160/1296] Compiling C object subprojects/openssl-3.0.2/libcrypto.a.p/crypto_ec_ec_ameth.c.obj
  612. 117 error [161/1296] Compiling C object subprojects/openssl-3.0.2/libcrypto.a.p/crypto_ec_curve448_f_generic.c.obj
  613. 117 error [162/1296] Compiling C object subprojects/openssl-3.0.2/libcrypto.a.p/crypto_ec_ec_deprecated.c.obj
  614. 117 error [163/1296] Compiling C object subprojects/openssl-3.0.2/libcrypto.a.p/crypto_ec_ec_curve.c.obj
  615. 117 error [164/1296] Compiling C object subprojects/openssl-3.0.2/libcrypto.a.p/crypto_ec_ec_check.c.obj
  616. 117 error [165/1296] Compiling C object subprojects/openssl-3.0.2/libcrypto.a.p/crypto_ec_ec_cvt.c.obj
  617. 117 error [166/1296] Compiling C object subprojects/openssl-3.0.2/libcrypto.a.p/crypto_ec_ec_asn1.c.obj
  618. 117 error [167/1296] Compiling C object subprojects/openssl-3.0.2/libcrypto.a.p/crypto_ec_ec_key.c.obj
  619. 117 error [168/1296] Compiling C object subprojects/openssl-3.0.2/libcrypto.a.p/crypto_ec_ec_err.c.obj
  620. 117 error [169/1296] Compiling C object subprojects/openssl-3.0.2/libcrypto.a.p/crypto_ec_ec_kmeth.c.obj
  621. 117 error [170/1296] Compiling C object subprojects/openssl-3.0.2/libcrypto.a.p/crypto_ec_ec_oct.c.obj
  622. 117 error [171/1296] Compiling C object subprojects/openssl-3.0.2/libcrypto.a.p/crypto_ec_ecdh_ossl.c.obj
  623. 117 error [172/1296] Compiling C object subprojects/openssl-3.0.2/libcrypto.a.p/crypto_ec_ecdsa_sign.c.obj
  624. 117 error [173/1296] Compiling C object subprojects/openssl-3.0.2/libcrypto.a.p/crypto_ec_ec_backend.c.obj
  625. 117 error [174/1296] Compiling C object subprojects/openssl-3.0.2/libcrypto.a.p/crypto_ec_ec_print.c.obj
  626. 117 error [175/1296] Compiling C object subprojects/openssl-3.0.2/libcrypto.a.p/crypto_ec_ec_lib.c.obj
  627. 117 error [176/1296] Compiling C object subprojects/openssl-3.0.2/libcrypto.a.p/crypto_ec_ecdh_kdf.c.obj
  628. 117 error [177/1296] Compiling C object subprojects/openssl-3.0.2/libcrypto.a.p/crypto_ec_ec_pmeth.c.obj
  629. 117 error [178/1296] Compiling C object subprojects/openssl-3.0.2/libcrypto.a.p/crypto_ec_ecdsa_vrf.c.obj
  630. 117 error [179/1296] Compiling C object subprojects/openssl-3.0.2/libcrypto.a.p/crypto_ec_ecdsa_ossl.c.obj
  631. 117 error [180/1296] Compiling C object subprojects/openssl-3.0.2/libcrypto.a.p/crypto_ec_ecp_oct.c.obj
  632. 117 error [181/1296] Compiling C object subprojects/openssl-3.0.2/libcrypto.a.p/crypto_ec_ec_mult.c.obj
  633. 117 error [182/1296] Compiling C object subprojects/openssl-3.0.2/libcrypto.a.p/crypto_ec_ecx_key.c.obj
  634. 117 error [183/1296] Compiling C object subprojects/openssl-3.0.2/libcrypto.a.p/crypto_ec_ecp_mont.c.obj
  635. 117 error [184/1296] Compiling C object subprojects/openssl-3.0.2/libcrypto.a.p/crypto_ec_ecp_nist.c.obj
  636. 117 error [185/1296] Compiling C object subprojects/openssl-3.0.2/libcrypto.a.p/crypto_ec_ecx_meth.c.obj
  637. 117 error [186/1296] Compiling C object subprojects/openssl-3.0.2/libcrypto.a.p/crypto_ec_ecp_smpl.c.obj
  638. 117 error [187/1296] Compiling C object subprojects/openssl-3.0.2/libcrypto.a.p/crypto_ec_eck_prn.c.obj
  639. 117 error [188/1296] Compiling C object subprojects/openssl-3.0.2/libcrypto.a.p/crypto_encode_decode_decoder_err.c.obj
  640. 117 error [189/1296] Compiling C object subprojects/openssl-3.0.2/libcrypto.a.p/crypto_ec_ecx_backend.c.obj
  641. 117 error [190/1296] Compiling C object subprojects/openssl-3.0.2/libcrypto.a.p/crypto_encode_decode_decoder_meth.c.obj
  642. 117 error [191/1296] Compiling C object subprojects/openssl-3.0.2/libcrypto.a.p/crypto_encode_decode_decoder_lib.c.obj
  643. 117 error [192/1296] Compiling C object subprojects/openssl-3.0.2/libcrypto.a.p/crypto_evp_bio_ok.c.obj
  644. 117 error [193/1296] Compiling C object subprojects/openssl-3.0.2/libcrypto.a.p/crypto_evp_c_alld.c.obj
  645. 117 error [194/1296] Compiling C object subprojects/openssl-3.0.2/libcrypto.a.p/crypto_encode_decode_decoder_pkey.c.obj
  646. 117 error [195/1296] Compiling C object subprojects/openssl-3.0.2/libcrypto.a.p/crypto_evp_bio_md.c.obj
  647. 117 error [196/1296] Compiling C object subprojects/openssl-3.0.2/libcrypto.a.p/crypto_evp_bio_b64.c.obj
  648. 117 error [197/1296] Compiling C object subprojects/openssl-3.0.2/libcrypto.a.p/crypto_ess_ess_err.c.obj
  649. 117 error [198/1296] Compiling C object subprojects/openssl-3.0.2/libcrypto.a.p/crypto_evp_bio_enc.c.obj
  650. 117 error [199/1296] Compiling C object subprojects/openssl-3.0.2/libcrypto.a.p/crypto_ess_ess_lib.c.obj
  651. 117 error [200/1296] Compiling C object subprojects/openssl-3.0.2/libcrypto.a.p/crypto_evp_c_allc.c.obj
  652. 117 error [201/1296] Compiling C object subprojects/openssl-3.0.2/libcrypto.a.p/crypto_evp_asymcipher.c.obj
  653. 117 error [202/1296] Compiling C object subprojects/openssl-3.0.2/libcrypto.a.p/crypto_encode_decode_encoder_err.c.obj
  654. 117 error [203/1296] Compiling C object subprojects/openssl-3.0.2/libcrypto.a.p/crypto_engine_eng_cnf.c.obj
  655. 117 error [204/1296] Compiling C object subprojects/openssl-3.0.2/libcrypto.a.p/crypto_engine_eng_all.c.obj
  656. 117 error [205/1296] Compiling C object subprojects/openssl-3.0.2/libcrypto.a.p/crypto_encode_decode_encoder_lib.c.obj
  657. 117 error [206/1296] Compiling C object subprojects/openssl-3.0.2/libcrypto.a.p/crypto_engine_eng_ctrl.c.obj
  658. 117 error [207/1296] Compiling C object subprojects/openssl-3.0.2/libcrypto.a.p/crypto_encode_decode_encoder_pkey.c.obj
  659. 117 error [208/1296] Compiling C object subprojects/openssl-3.0.2/libcrypto.a.p/crypto_engine_eng_dyn.c.obj
  660. 117 error [209/1296] Compiling C object subprojects/openssl-3.0.2/libcrypto.a.p/crypto_encode_decode_encoder_meth.c.obj
  661. 117 error [210/1296] Compiling C object subprojects/openssl-3.0.2/libcrypto.a.p/crypto_engine_eng_rdrand.c.obj
  662. 117 error [211/1296] Compiling C object subprojects/openssl-3.0.2/libcrypto.a.p/crypto_engine_eng_pkey.c.obj
  663. 117 error [212/1296] Compiling C object subprojects/openssl-3.0.2/libcrypto.a.p/crypto_engine_eng_init.c.obj
  664. 117 error [213/1296] Compiling C object subprojects/openssl-3.0.2/libcrypto.a.p/crypto_engine_eng_table.c.obj
  665. 117 error [214/1296] Compiling C object subprojects/openssl-3.0.2/libcrypto.a.p/crypto_engine_eng_lib.c.obj
  666. 117 error [215/1296] Compiling C object subprojects/openssl-3.0.2/libcrypto.a.p/crypto_engine_eng_err.c.obj
  667. 117 error [216/1296] Compiling C object subprojects/openssl-3.0.2/libcrypto.a.p/crypto_engine_eng_openssl.c.obj
  668. 117 error [217/1296] Compiling C object subprojects/openssl-3.0.2/libcrypto.a.p/crypto_engine_eng_list.c.obj
  669. 117 error [218/1296] Compiling C object subprojects/openssl-3.0.2/libcrypto.a.p/crypto_engine_eng_fat.c.obj
  670. 117 error [219/1296] Compiling C object subprojects/openssl-3.0.2/libcrypto.a.p/crypto_engine_tb_eckey.c.obj
  671. 117 error [220/1296] Compiling C object subprojects/openssl-3.0.2/libcrypto.a.p/crypto_engine_tb_dh.c.obj
  672. 117 error [221/1296] Compiling C object subprojects/openssl-3.0.2/libcrypto.a.p/crypto_engine_tb_rsa.c.obj
  673. 117 error [222/1296] Compiling C object subprojects/openssl-3.0.2/libcrypto.a.p/crypto_engine_tb_cipher.c.obj
  674. 117 error [223/1296] Compiling C object subprojects/openssl-3.0.2/libcrypto.a.p/crypto_engine_tb_pkmeth.c.obj
  675. 117 error [224/1296] Compiling C object subprojects/openssl-3.0.2/libcrypto.a.p/crypto_engine_tb_digest.c.obj
  676. 117 error [225/1296] Compiling C object subprojects/openssl-3.0.2/libcrypto.a.p/crypto_engine_tb_dsa.c.obj
  677. 117 error [226/1296] Compiling C object subprojects/openssl-3.0.2/libcrypto.a.p/crypto_engine_tb_asnmth.c.obj
  678. 117 error [227/1296] Compiling C object subprojects/openssl-3.0.2/libcrypto.a.p/crypto_err_err_prn.c.obj
  679. 117 error [228/1296] Compiling C object subprojects/openssl-3.0.2/libcrypto.a.p/crypto_engine_tb_rand.c.obj
  680. 117 error [229/1296] Compiling C object subprojects/openssl-3.0.2/libcrypto.a.p/crypto_err_err.c.obj
  681. 117 error [230/1296] Compiling C object subprojects/openssl-3.0.2/libcrypto.a.p/crypto_err_err_blocks.c.obj
  682. 117 error [231/1296] Compiling C object subprojects/openssl-3.0.2/libcrypto.a.p/crypto_err_err_all_legacy.c.obj
  683. 117 error [232/1296] Compiling C object subprojects/openssl-3.0.2/libcrypto.a.p/crypto_err_err_all.c.obj
  684. 117 error [233/1296] Compiling C object subprojects/openssl-3.0.2/libcrypto.a.p/crypto_asn1_a_object.c.obj
  685. 117 error [234/1296] Compiling C object subprojects/openssl-3.0.2/libcrypto.a.p/crypto_ess_ess_asn1.c.obj
  686. 117 error [235/1296] Compiling C object subprojects/openssl-3.0.2/libcrypto.a.p/crypto_aria_aria.c.obj
  687. 117 error [236/1296] Compiling C object subprojects/openssl-3.0.2/libcrypto.a.p/crypto_asn1_a_bitstr.c.obj
  688. 117 error [237/1296] Compiling C object subprojects/openssl-3.0.2/libcrypto.a.p/crypto_asn1_a_digest.c.obj
  689. 117 error [238/1296] Compiling C object subprojects/openssl-3.0.2/libcrypto.a.p/crypto_asn1_a_dup.c.obj
  690. 117 error [239/1296] Compiling C object subprojects/openssl-3.0.2/libcrypto.a.p/crypto_asn1_a_mbstr.c.obj
  691. 117 error [240/1296] Compiling C object subprojects/openssl-3.0.2/libcrypto.a.p/crypto_asn1_a_d2i_fp.c.obj
  692. 117 error [241/1296] Compiling C object subprojects/openssl-3.0.2/libcrypto.a.p/crypto_asn1_a_i2d_fp.c.obj
  693. 117 error [242/1296] Compiling C object subprojects/openssl-3.0.2/libcrypto.a.p/crypto_asn1_a_int.c.obj
  694. 117 error [243/1296] Compiling C object subprojects/openssl-3.0.2/libcrypto.a.p/crypto_asn1_a_gentm.c.obj
  695. 117 error [244/1296] Compiling C object subprojects/openssl-3.0.2/libcrypto.a.p/crypto_asn1_a_strnid.c.obj
  696. 117 error [245/1296] Compiling C object subprojects/openssl-3.0.2/libcrypto.a.p/crypto_asn1_a_octet.c.obj
  697. 117 error [246/1296] Compiling C object subprojects/openssl-3.0.2/libcrypto.a.p/crypto_asn1_a_print.c.obj
  698. 117 error [247/1296] Compiling C object subprojects/openssl-3.0.2/libcrypto.a.p/crypto_asn1_a_strex.c.obj
  699. 117 error [248/1296] Compiling C object subprojects/openssl-3.0.2/libcrypto.a.p/crypto_asn1_a_utf8.c.obj
  700. 117 error [249/1296] Compiling C object subprojects/openssl-3.0.2/libcrypto.a.p/crypto_asn1_a_sign.c.obj
  701. 117 error [250/1296] Compiling C object subprojects/openssl-3.0.2/libcrypto.a.p/crypto_asn1_a_time.c.obj
  702. 117 error [251/1296] Compiling C object subprojects/openssl-3.0.2/libcrypto.a.p/crypto_asn1_a_verify.c.obj
  703. 117 error [252/1296] Compiling C object subprojects/openssl-3.0.2/libcrypto.a.p/crypto_asn1_a_utctm.c.obj
  704. 117 error [253/1296] Compiling C object subprojects/openssl-3.0.2/libcrypto.a.p/crypto_asn1_a_type.c.obj
  705. 117 error [254/1296] Compiling C object subprojects/openssl-3.0.2/libcrypto.a.p/crypto_asn1_asn1_lib.c.obj
  706. 117 error [255/1296] Compiling C object subprojects/openssl-3.0.2/libcrypto.a.p/crypto_asn1_asn1_item_list.c.obj
  707. 117 error [256/1296] Compiling C object subprojects/openssl-3.0.2/libcrypto.a.p/crypto_asn1_asn1_err.c.obj
  708. 117 error [257/1296] Compiling C object subprojects/openssl-3.0.2/libcrypto.a.p/crypto_asn1_asn1_gen.c.obj
  709. 117 error [258/1296] Compiling C object subprojects/openssl-3.0.2/libcrypto.a.p/crypto_asn1_ameth_lib.c.obj
  710. 117 error [259/1296] Compiling C object subprojects/openssl-3.0.2/libcrypto.a.p/crypto_asn1_asn1_parse.c.obj
  711. 117 error [260/1296] Compiling C object subprojects/openssl-3.0.2/libcrypto.a.p/crypto_asn1_asn_pack.c.obj
  712. 117 error [261/1296] Compiling C object subprojects/openssl-3.0.2/libcrypto.a.p/crypto_asn1_asn_moid.c.obj
  713. 117 error [262/1296] Compiling C object subprojects/openssl-3.0.2/libcrypto.a.p/crypto_asn1_asn_mstbl.c.obj
  714. 117 error [263/1296] Compiling C object subprojects/openssl-3.0.2/libcrypto.a.p/crypto_asn1_d2i_param.c.obj
  715. 117 error [264/1296] Compiling C object subprojects/openssl-3.0.2/libcrypto.a.p/crypto_asn1_asn_mime.c.obj
  716. 117 error [265/1296] Compiling C object subprojects/openssl-3.0.2/libcrypto.a.p/crypto_asn1_bio_ndef.c.obj
  717. 117 error [266/1296] Compiling C object subprojects/openssl-3.0.2/libcrypto.a.p/crypto_asn1_bio_asn1.c.obj
  718. 117 error [267/1296] Compiling C object subprojects/openssl-3.0.2/libcrypto.a.p/crypto_asn1_d2i_pu.c.obj
  719. 117 error [268/1296] Compiling C object subprojects/openssl-3.0.2/libcrypto.a.p/crypto_asn1_d2i_pr.c.obj
  720. 117 error [269/1296] Compiling C object subprojects/openssl-3.0.2/libcrypto.a.p/crypto_asn1_p5_scrypt.c.obj
  721. 117 error [270/1296] Compiling C object subprojects/openssl-3.0.2/libcrypto.a.p/crypto_asn1_nsseq.c.obj
  722. 117 error [271/1296] Compiling C object subprojects/openssl-3.0.2/libcrypto.a.p/crypto_asn1_evp_asn1.c.obj
  723. 117 error [272/1296] Compiling C object subprojects/openssl-3.0.2/libcrypto.a.p/crypto_asn1_f_string.c.obj
  724. 117 error [273/1296] Compiling C object subprojects/openssl-3.0.2/libcrypto.a.p/crypto_asn1_f_int.c.obj
  725. 117 error [274/1296] Compiling C object subprojects/openssl-3.0.2/libcrypto.a.p/crypto_asn1_p5_pbe.c.obj
  726. 117 error [275/1296] Compiling C object subprojects/openssl-3.0.2/libcrypto.a.p/crypto_asn1_n_pkey.c.obj
  727. 117 error [276/1296] Compiling C object subprojects/openssl-3.0.2/libcrypto.a.p/crypto_asn1_p5_pbev2.c.obj
  728. 117 error [277/1296] Compiling C object subprojects/openssl-3.0.2/libcrypto.a.p/crypto_asn1_i2d_evp.c.obj
  729. 117 error [278/1296] Compiling C object subprojects/openssl-3.0.2/libcrypto.a.p/crypto_asn1_p8_pkey.c.obj
  730. 117 error [279/1296] Compiling C object subprojects/openssl-3.0.2/libcrypto.a.p/crypto_asn1_t_spki.c.obj
  731. 117 error [280/1296] Compiling C object subprojects/openssl-3.0.2/libcrypto.a.p/crypto_asn1_t_bitst.c.obj
  732. 117 error [281/1296] Compiling C object subprojects/openssl-3.0.2/libcrypto.a.p/crypto_asn1_tasn_dec.c.obj
  733. 117 error [282/1296] Compiling C object subprojects/openssl-3.0.2/libcrypto.a.p/crypto_asn1_tasn_enc.c.obj
  734. 117 error [283/1296] Compiling C object subprojects/openssl-3.0.2/libcrypto.a.p/crypto_asn1_tasn_scn.c.obj
  735. 117 error [284/1296] Compiling C object subprojects/openssl-3.0.2/libcrypto.a.p/crypto_asn1_tasn_new.c.obj
  736. 117 error [285/1296] Compiling C object subprojects/openssl-3.0.2/libcrypto.a.p/crypto_asn1_tasn_prn.c.obj
  737. 117 error [286/1296] Compiling C object subprojects/openssl-3.0.2/libcrypto.a.p/crypto_asn1_tasn_fre.c.obj
  738. 117 error [287/1296] Compiling C object subprojects/openssl-3.0.2/libcrypto.a.p/crypto_asn1_t_pkey.c.obj
  739. 117 error [288/1296] Compiling C object subprojects/openssl-3.0.2/libcrypto.a.p/crypto_asn1_tasn_typ.c.obj
  740. 117 error [289/1296] Compiling C object subprojects/openssl-3.0.2/libcrypto.a.p/crypto_asn1_tasn_utl.c.obj
  741. 117 error [290/1296] Compiling C object subprojects/openssl-3.0.2/libcrypto.a.p/crypto_asn1_x_int64.c.obj
  742. 117 error [291/1296] Compiling C object subprojects/openssl-3.0.2/libcrypto.a.p/crypto_asn1_x_spki.c.obj
  743. 117 error [292/1296] Compiling C object subprojects/openssl-3.0.2/libcrypto.a.p/crypto_asn1_x_info.c.obj
  744. 117 error [293/1296] Compiling C object subprojects/openssl-3.0.2/libcrypto.a.p/crypto_asn1_x_bignum.c.obj
  745. 117 error [294/1296] Compiling C object subprojects/openssl-3.0.2/libcrypto.a.p/crypto_asn1_x_algor.c.obj
  746. 117 error [295/1296] Compiling C object subprojects/openssl-3.0.2/libcrypto.a.p/crypto_asn1_x_long.c.obj
  747. 117 error [296/1296] Compiling C object subprojects/openssl-3.0.2/libcrypto.a.p/crypto_asn1_x_pkey.c.obj
  748. 117 error [297/1296] Compiling C object subprojects/openssl-3.0.2/libcrypto.a.p/crypto_bf_bf_cfb64.c.obj
  749. 117 error [298/1296] Compiling C object subprojects/openssl-3.0.2/libcrypto.a.p/crypto_asn1_x_sig.c.obj
  750. 117 error [299/1296] Compiling C object subprojects/openssl-3.0.2/libcrypto.a.p/crypto_asn1_x_val.c.obj
  751. 117 error [300/1296] Compiling C object subprojects/openssl-3.0.2/libcrypto.a.p/crypto_bf_bf_ecb.c.obj
  752. 117 error [301/1296] Compiling C object subprojects/openssl-3.0.2/libcrypto.a.p/crypto_bf_bf_ofb64.c.obj
  753. 117 error [302/1296] Compiling C object subprojects/openssl-3.0.2/libcrypto.a.p/crypto_async_async_wait.c.obj
  754. 117 error [303/1296] Compiling C object subprojects/openssl-3.0.2/libcrypto.a.p/crypto_async_arch_async_win.c.obj
  755. 117 error [304/1296] Compiling C object subprojects/openssl-3.0.2/libcrypto.a.p/crypto_bf_bf_enc.c.obj
  756. 117 error [305/1296] Compiling C object subprojects/openssl-3.0.2/libcrypto.a.p/crypto_async_arch_async_null.c.obj
  757. 117 error [306/1296] Compiling C object subprojects/openssl-3.0.2/libcrypto.a.p/crypto_async_async_err.c.obj
  758. 117 error [307/1296] Compiling C object subprojects/openssl-3.0.2/libcrypto.a.p/crypto_bf_bf_skey.c.obj
  759. 117 error [308/1296] Compiling C object subprojects/openssl-3.0.2/libcrypto.a.p/crypto_async_arch_async_posix.c.obj
  760. 117 error [309/1296] Compiling C object subprojects/openssl-3.0.2/libcrypto.a.p/crypto_async_async.c.obj
  761. 117 error [310/1296] Compiling C object subprojects/openssl-3.0.2/libcrypto.a.p/crypto_bio_bf_prefix.c.obj
  762. 117 error [311/1296] Compiling C object subprojects/openssl-3.0.2/libcrypto.a.p/crypto_bio_bio_dump.c.obj
  763. 117 error [312/1296] Compiling C object subprojects/openssl-3.0.2/libcrypto.a.p/crypto_bio_bf_readbuff.c.obj
  764. 117 error [313/1296] Compiling C object subprojects/openssl-3.0.2/libcrypto.a.p/crypto_bio_bf_nbio.c.obj
  765. 117 error [314/1296] Compiling C object subprojects/openssl-3.0.2/libcrypto.a.p/crypto_bio_bio_cb.c.obj
  766. 117 error [315/1296] Compiling C object subprojects/openssl-3.0.2/libcrypto.a.p/crypto_bio_bf_buff.c.obj
  767. 117 error [316/1296] Compiling C object subprojects/openssl-3.0.2/libcrypto.a.p/crypto_bio_bf_lbuf.c.obj
  768. 117 error [317/1296] Compiling C object subprojects/openssl-3.0.2/libcrypto.a.p/crypto_bio_bf_null.c.obj
  769. 117 error [318/1296] Compiling C object subprojects/openssl-3.0.2/libcrypto.a.p/crypto_bio_bio_addr.c.obj
  770. 117 error [319/1296] Compiling C object subprojects/openssl-3.0.2/libcrypto.a.p/crypto_bio_bio_sock2.c.obj
  771. 117 error [320/1296] Compiling C object subprojects/openssl-3.0.2/libcrypto.a.p/crypto_bio_bio_lib.c.obj
  772. 117 error [321/1296] Compiling C object subprojects/openssl-3.0.2/libcrypto.a.p/crypto_bio_bio_sock.c.obj
  773. 117 error [322/1296] Compiling C object subprojects/openssl-3.0.2/libcrypto.a.p/crypto_bio_bss_acpt.c.obj
  774. 117 error [323/1296] Compiling C object subprojects/openssl-3.0.2/libcrypto.a.p/crypto_bio_bio_print.c.obj
  775. 117 error [324/1296] Compiling C object subprojects/openssl-3.0.2/libcrypto.a.p/crypto_bio_bio_err.c.obj
  776. 117 error [325/1296] Compiling C object subprojects/openssl-3.0.2/libcrypto.a.p/crypto_bio_bss_conn.c.obj
  777. 117 error [326/1296] Compiling C object subprojects/openssl-3.0.2/libcrypto.a.p/crypto_bio_bss_bio.c.obj
  778. 117 error [327/1296] Compiling C object subprojects/openssl-3.0.2/libcrypto.a.p/crypto_bio_bio_meth.c.obj
  779. 117 error [328/1296] Compiling C object subprojects/openssl-3.0.2/libcrypto.a.p/crypto_bio_bss_dgram.c.obj
  780. 117 error [329/1296] Compiling C object subprojects/openssl-3.0.2/libcrypto.a.p/crypto_bio_bss_core.c.obj
  781. 117 error [330/1296] Compiling C object subprojects/openssl-3.0.2/libcrypto.a.p/crypto_bio_bss_mem.c.obj
  782. 117 error [331/1296] Compiling C object subprojects/openssl-3.0.2/libcrypto.a.p/crypto_bio_bss_file.c.obj
  783. 117 error [332/1296] Compiling C object subprojects/openssl-3.0.2/libcrypto.a.p/crypto_bio_bss_sock.c.obj
  784. 117 error [333/1296] Compiling C object subprojects/openssl-3.0.2/libcrypto.a.p/crypto_bio_bss_null.c.obj
  785. 117 error [334/1296] Compiling C object subprojects/openssl-3.0.2/libcrypto.a.p/crypto_bn_bn_asm.c.obj
  786. 117 error [335/1296] Compiling C object subprojects/openssl-3.0.2/libcrypto.a.p/crypto_bio_ossl_core_bio.c.obj
  787. 117 error [336/1296] Compiling C object subprojects/openssl-3.0.2/libcrypto.a.p/crypto_bn_bn_add.c.obj
  788. 117 error [337/1296] Compiling C object subprojects/openssl-3.0.2/libcrypto.a.p/crypto_bio_bss_log.c.obj
  789. 117 error [338/1296] Compiling C object subprojects/openssl-3.0.2/libcrypto.a.p/crypto_bn_bn_blind.c.obj
  790. 117 error [339/1296] Compiling C object subprojects/openssl-3.0.2/libcrypto.a.p/crypto_bn_bn_exp2.c.obj
  791. 117 error [340/1296] Compiling C object subprojects/openssl-3.0.2/libcrypto.a.p/crypto_bio_bss_fd.c.obj
  792. 117 error [341/1296] Compiling C object subprojects/openssl-3.0.2/libcrypto.a.p/crypto_bn_bn_conv.c.obj
  793. 117 error [342/1296] Compiling C object subprojects/openssl-3.0.2/libcrypto.a.p/crypto_bn_bn_depr.c.obj
  794. 117 error [343/1296] Compiling C object subprojects/openssl-3.0.2/libcrypto.a.p/crypto_bn_bn_err.c.obj
  795. 117 error [344/1296] Compiling C object subprojects/openssl-3.0.2/libcrypto.a.p/crypto_bn_bn_div.c.obj
  796. 117 error [345/1296] Compiling C object subprojects/openssl-3.0.2/libcrypto.a.p/crypto_bn_bn_const.c.obj
  797. 117 error [346/1296] Compiling C object subprojects/openssl-3.0.2/libcrypto.a.p/crypto_bn_bn_dh.c.obj
  798. 117 error [347/1296] Compiling C object subprojects/openssl-3.0.2/libcrypto.a.p/crypto_bn_bn_ctx.c.obj
  799. 117 error [348/1296] Compiling C object subprojects/openssl-3.0.2/libcrypto.a.p/crypto_bn_bn_exp.c.obj
  800. 117 error [349/1296] Compiling C object subprojects/openssl-3.0.2/libcrypto.a.p/crypto_bn_bn_gcd.c.obj
  801. 117 error [350/1296] Compiling C object subprojects/openssl-3.0.2/libcrypto.a.p/providers_implementations_kdfs_sshkdf.c.obj
  802. 117 error [351/1296] Compiling C object subprojects/openssl-3.0.2/libcrypto.a.p/crypto_bn_bn_gf2m.c.obj
  803. 117 error [352/1296] Compiling C object subprojects/openssl-3.0.2/libcrypto.a.p/providers_implementations_kdfs_pbkdf2_fips.c.obj
  804. 117 error [353/1296] Compiling C object subprojects/openssl-3.0.2/libcrypto.a.p/providers_implementations_kdfs_sskdf.c.obj
  805. 117 error [354/1296] Compiling C object subprojects/openssl-3.0.2/libcrypto.a.p/providers_implementations_kdfs_scrypt.c.obj
  806. 117 error [355/1296] Compiling C object subprojects/openssl-3.0.2/libcrypto.a.p/providers_implementations_kdfs_pkcs12kdf.c.obj
  807. 117 error [356/1296] Compiling C object subprojects/openssl-3.0.2/libcrypto.a.p/crypto_x509_v3_pmaps.c.obj
  808. 117 error [357/1296] Compiling C object subprojects/openssl-3.0.2/libcrypto.a.p/providers_implementations_kdfs_tls1_prf.c.obj
  809. 117 error [358/1296] Compiling C object subprojects/openssl-3.0.2/libcrypto.a.p/crypto_x509_v3_ist.c.obj
  810. 117 error [359/1296] Compiling C object subprojects/openssl-3.0.2/libcrypto.a.p/crypto_x509_v3_pku.c.obj
  811. 117 error [360/1296] Compiling C object subprojects/openssl-3.0.2/libcrypto.a.p/crypto_x509_v3_prn.c.obj
  812. 117 error [361/1296] Compiling C object subprojects/openssl-3.0.2/libcrypto.a.p/crypto_x509_v3_pcons.c.obj
  813. 117 error [362/1296] Compiling C object subprojects/openssl-3.0.2/libcrypto.a.p/crypto_x509_v3_pcia.c.obj
  814. 117 error [363/1296] Compiling C object subprojects/openssl-3.0.2/libcrypto.a.p/crypto_x509_v3_ncons.c.obj
  815. 117 error [364/1296] Compiling C object subprojects/openssl-3.0.2/libcrypto.a.p/crypto_x509_v3_int.c.obj
  816. 117 error [365/1296] Compiling C object subprojects/openssl-3.0.2/libcrypto.a.p/crypto_x509_v3_pci.c.obj
  817. 117 error [366/1296] Compiling C object subprojects/openssl-3.0.2/libcrypto.a.p/crypto_x509_v3_lib.c.obj
  818. 117 error [367/1296] Compiling C object subprojects/openssl-3.0.2/libcrypto.a.p/crypto_x509_v3err.c.obj
  819. 117 error [368/1296] Compiling C object subprojects/openssl-3.0.2/libcrypto.a.p/crypto_x509_v3_san.c.obj
  820. 117 error [369/1296] Compiling C object subprojects/openssl-3.0.2/libcrypto.a.p/crypto_x509_v3_utl.c.obj
  821. 117 error [370/1296] Compiling C object subprojects/openssl-3.0.2/libcrypto.a.p/crypto_x509_v3_sxnet.c.obj
  822. 117 error [371/1296] Compiling C object subprojects/openssl-3.0.2/libcrypto.a.p/crypto_x509_v3_tlsf.c.obj
  823. 117 error [372/1296] Compiling C object subprojects/openssl-3.0.2/libcrypto.a.p/crypto_x509_v3_skid.c.obj
  824. 117 error [373/1296] Compiling C object subprojects/openssl-3.0.2/libcrypto.a.p/crypto_x509_x509_att.c.obj
  825. 117 error [374/1296] Compiling C object subprojects/openssl-3.0.2/libcrypto.a.p/crypto_x509_v3_utf8.c.obj
  826. 117 error [375/1296] Compiling C object subprojects/openssl-3.0.2/libcrypto.a.p/crypto_x509_x509_err.c.obj
  827. 117 error [376/1296] Compiling C object subprojects/openssl-3.0.2/libcrypto.a.p/crypto_x509_x509_ext.c.obj
  828. 117 error [377/1296] Compiling C object subprojects/openssl-3.0.2/libcrypto.a.p/crypto_x509_v3_purp.c.obj
  829. 117 error [378/1296] Compiling C object subprojects/openssl-3.0.2/libcrypto.a.p/crypto_x509_x509_meth.c.obj
  830. 117 error [379/1296] Compiling C object subprojects/openssl-3.0.2/libcrypto.a.p/crypto_x509_x509_cmp.c.obj
  831. 117 error [380/1296] Compiling C object subprojects/openssl-3.0.2/libcrypto.a.p/crypto_x509_x509_obj.c.obj
  832. 117 error [381/1296] Compiling C object subprojects/openssl-3.0.2/libcrypto.a.p/crypto_x509_x509_lu.c.obj
  833. 117 error [382/1296] Compiling C object subprojects/openssl-3.0.2/libcrypto.a.p/crypto_x509_x509_r2x.c.obj
  834. 117 error [383/1296] Compiling C object subprojects/openssl-3.0.2/libcrypto.a.p/crypto_x509_x509_def.c.obj
  835. 117 error [384/1296] Compiling C object subprojects/openssl-3.0.2/libcrypto.a.p/crypto_x509_x509_d2.c.obj
  836. 117 error [385/1296] Compiling C object subprojects/openssl-3.0.2/libcrypto.a.p/crypto_x509_x509_txt.c.obj
  837. 117 error [386/1296] Compiling C object subprojects/openssl-3.0.2/libcrypto.a.p/crypto_x509_x509_v3.c.obj
  838. 117 error [387/1296] Compiling C object subprojects/openssl-3.0.2/libcrypto.a.p/crypto_x509_x509_req.c.obj
  839. 117 error [388/1296] Compiling C object subprojects/openssl-3.0.2/libcrypto.a.p/crypto_x509_x509_vpm.c.obj
  840. 117 error [389/1296] Compiling C object subprojects/openssl-3.0.2/libcrypto.a.p/crypto_x509_x509_trust.c.obj
  841. 117 error [390/1296] Compiling C object subprojects/openssl-3.0.2/libcrypto.a.p/crypto_x509_x509name.c.obj
  842. 117 error [391/1296] Compiling C object subprojects/openssl-3.0.2/libcrypto.a.p/crypto_x509_x509_set.c.obj
  843. 117 error [392/1296] Compiling C object subprojects/openssl-3.0.2/libcrypto.a.p/crypto_x509_x509cset.c.obj
  844. 117 error [393/1296] Compiling C object subprojects/openssl-3.0.2/libcrypto.a.p/crypto_x509_x_name.c.obj
  845. 117 error [394/1296] Compiling C object subprojects/openssl-3.0.2/libcrypto.a.p/crypto_x509_x509_vfy.c.obj
  846. 117 error [395/1296] Compiling C object subprojects/openssl-3.0.2/libcrypto.a.p/crypto_x509_x_all.c.obj
  847. 117 error [396/1296] Compiling C object subprojects/openssl-3.0.2/libcrypto.a.p/crypto_x509_x_crl.c.obj
  848. 117 error [397/1296] Compiling C object subprojects/openssl-3.0.2/libcrypto.a.p/crypto_x509_x509type.c.obj
  849. 117 error [398/1296] Compiling C object subprojects/openssl-3.0.2/libcrypto.a.p/crypto_x509_x_exten.c.obj
  850. 117 error [399/1296] Compiling C object subprojects/openssl-3.0.2/libcrypto.a.p/crypto_x509_x_attrib.c.obj
  851. 117 error [400/1296] Compiling C object subprojects/openssl-3.0.2/libcrypto.a.p/crypto_x509_x509spki.c.obj
  852. 117 error [401/1296] Compiling C object subprojects/openssl-3.0.2/libcrypto.a.p/crypto_x509_x509rset.c.obj
  853. 117 error [402/1296] Compiling C object subprojects/openssl-3.0.2/libcrypto.a.p/providers_nullprov.c.obj
  854. 117 error [403/1296] Compiling C object subprojects/openssl-3.0.2/libcrypto.a.p/crypto_x509_x_pubkey.c.obj
  855. 117 error [404/1296] Compiling C object subprojects/openssl-3.0.2/libcrypto.a.p/providers_common_der_der_rsa_sig.c.obj
  856. 117 error [405/1296] Compiling C object subprojects/openssl-3.0.2/libcrypto.a.p/providers_defltprov.c.obj
  857. 117 error [406/1296] Compiling C object subprojects/openssl-3.0.2/libcrypto.a.p/crypto_x509_x_x509a.c.obj
  858. 117 error [407/1296] Compiling C object subprojects/openssl-3.0.2/libcrypto.a.p/providers_baseprov.c.obj
  859. 117 error [408/1296] Compiling C object subprojects/openssl-3.0.2/libcrypto.a.p/engines_e_capi.c.obj
  860. 117 error [409/1296] Compiling C object subprojects/openssl-3.0.2/libcrypto.a.p/providers_prov_running.c.obj
  861. 117 error [410/1296] Compiling C object subprojects/openssl-3.0.2/libcrypto.a.p/engines_e_padlock.c.obj
  862. 117 error [411/1296] Compiling C object subprojects/openssl-3.0.2/libcrypto.a.p/providers_common_bio_prov.c.obj
  863. 117 error [412/1296] Compiling C object subprojects/openssl-3.0.2/libcrypto.a.p/crypto_x509_x_req.c.obj
  864. 117 error [413/1296] Compiling C object subprojects/openssl-3.0.2/libcrypto.a.p/crypto_x509_x_x509.c.obj
  865. 117 error [414/1296] Compiling C object subprojects/openssl-3.0.2/libcrypto.a.p/providers_common_der_der_sm2_sig.c.obj
  866. 117 error [415/1296] Compiling C object subprojects/openssl-3.0.2/libcrypto.a.p/providers_common_provider_seeding.c.obj
  867. 117 error [416/1296] Compiling C object subprojects/openssl-3.0.2/libcrypto.a.p/providers_common_der_der_sm2_key.c.obj
  868. 117 error [417/1296] Compiling C object subprojects/openssl-3.0.2/libcrypto.a.p/providers_common_provider_util.c.obj
  869. 117 error [418/1296] Compiling C object subprojects/openssl-3.0.2/libcrypto.a.p/providers_common_digest_to_nid.c.obj
  870. 117 error [419/1296] Compiling C object subprojects/openssl-3.0.2/libcrypto.a.p/providers_implementations_ciphers_cipher_aes.c.obj
  871. 117 error [420/1296] Compiling C object subprojects/openssl-3.0.2/libcrypto.a.p/providers_common_securitycheck.c.obj
  872. 117 error [421/1296] Compiling C object subprojects/openssl-3.0.2/libcrypto.a.p/providers_implementations_asymciphers_rsa_enc.c.obj
  873. 117 error [422/1296] Compiling C object subprojects/openssl-3.0.2/libcrypto.a.p/providers_common_capabilities.c.obj
  874. 117 error [423/1296] Compiling C object subprojects/openssl-3.0.2/libcrypto.a.p/providers_implementations_asymciphers_sm2_enc.c.obj
  875. 117 error [424/1296] Compiling C object subprojects/openssl-3.0.2/libcrypto.a.p/providers_common_securitycheck_default.c.obj
  876. 117 error [425/1296] Compiling C object subprojects/openssl-3.0.2/libcrypto.a.p/providers_implementations_ciphers_cipher_aes_cbc_hmac_sha1_hw.c.obj
  877. 117 error [426/1296] Compiling C object subprojects/openssl-3.0.2/libcrypto.a.p/providers_implementations_ciphers_cipher_aes_cbc_hmac_sha.c.obj
  878. 117 error [427/1296] Compiling C object subprojects/openssl-3.0.2/libcrypto.a.p/providers_implementations_ciphers_cipher_aes_hw.c.obj
  879. 117 error [428/1296] Compiling C object subprojects/openssl-3.0.2/libcrypto.a.p/providers_implementations_ciphers_cipher_aes_ocb.c.obj
  880. 117 error [429/1296] Compiling C object subprojects/openssl-3.0.2/libcrypto.a.p/providers_implementations_ciphers_cipher_aes_ccm.c.obj
  881. 117 error [430/1296] Compiling C object subprojects/openssl-3.0.2/libcrypto.a.p/providers_implementations_ciphers_cipher_aes_ccm_hw.c.obj
  882. 117 error [431/1296] Compiling C object subprojects/openssl-3.0.2/libcrypto.a.p/providers_implementations_ciphers_cipher_aes_gcm_hw.c.obj
  883. 117 error [432/1296] Compiling C object subprojects/openssl-3.0.2/libcrypto.a.p/providers_implementations_ciphers_cipher_aes_gcm.c.obj
  884. 117 error [433/1296] Compiling C object subprojects/openssl-3.0.2/libcrypto.a.p/providers_implementations_ciphers_cipher_aes_cbc_hmac_sha256_hw.c.obj
  885. 117 error [434/1296] Compiling C object subprojects/openssl-3.0.2/libcrypto.a.p/providers_implementations_ciphers_cipher_aes_xts_fips.c.obj
  886. 117 error [435/1296] Compiling C object subprojects/openssl-3.0.2/libcrypto.a.p/providers_implementations_ciphers_cipher_aes_xts_hw.c.obj
  887. 117 error [436/1296] Compiling C object subprojects/openssl-3.0.2/libcrypto.a.p/providers_implementations_ciphers_cipher_aes_siv_hw.c.obj
  888. 117 error [437/1296] Compiling C object subprojects/openssl-3.0.2/libcrypto.a.p/providers_implementations_ciphers_cipher_aes_xts.c.obj
  889. 117 error [438/1296] Compiling C object subprojects/openssl-3.0.2/libcrypto.a.p/providers_implementations_ciphers_cipher_aria.c.obj
  890. 117 error [439/1296] Compiling C object subprojects/openssl-3.0.2/libcrypto.a.p/providers_implementations_ciphers_cipher_aes_ocb_hw.c.obj
  891. 117 error [440/1296] Compiling C object subprojects/openssl-3.0.2/libcrypto.a.p/providers_implementations_ciphers_cipher_aes_wrp.c.obj
  892. 117 error [441/1296] Compiling C object subprojects/openssl-3.0.2/libcrypto.a.p/providers_implementations_ciphers_cipher_aes_siv.c.obj
  893. 117 error [442/1296] Compiling C object subprojects/openssl-3.0.2/libcrypto.a.p/providers_implementations_ciphers_cipher_aria_gcm.c.obj
  894. 117 error [443/1296] Compiling C object subprojects/openssl-3.0.2/libcrypto.a.p/providers_implementations_ciphers_cipher_aria_ccm_hw.c.obj
  895. 117 error [444/1296] Compiling C object subprojects/openssl-3.0.2/libcrypto.a.p/providers_implementations_ciphers_cipher_aria_gcm_hw.c.obj
  896. 117 error [445/1296] Compiling C object subprojects/openssl-3.0.2/libcrypto.a.p/providers_implementations_ciphers_cipher_aria_hw.c.obj
  897. 117 error [446/1296] Compiling C object subprojects/openssl-3.0.2/libcrypto.a.p/providers_implementations_ciphers_cipher_camellia.c.obj
  898. 117 error [447/1296] Compiling C object subprojects/openssl-3.0.2/libcrypto.a.p/providers_implementations_ciphers_cipher_camellia_hw.c.obj
  899. 117 error [448/1296] Compiling C object subprojects/openssl-3.0.2/libcrypto.a.p/providers_implementations_ciphers_cipher_aria_ccm.c.obj
  900. 117 error [449/1296] Compiling C object subprojects/openssl-3.0.2/libcrypto.a.p/providers_implementations_ciphers_cipher_chacha20.c.obj
  901. 117 error [450/1296] Compiling C object subprojects/openssl-3.0.2/libcrypto.a.p/providers_implementations_ciphers_cipher_chacha20_poly1305.c.obj
  902. 117 error [451/1296] Compiling C object subprojects/openssl-3.0.2/libcrypto.a.p/providers_implementations_ciphers_cipher_chacha20_poly1305_hw.c.obj
  903. 117 error [452/1296] Compiling C object subprojects/openssl-3.0.2/libcrypto.a.p/providers_implementations_ciphers_cipher_null.c.obj
  904. 117 error [453/1296] Compiling C object subprojects/openssl-3.0.2/libcrypto.a.p/providers_implementations_ciphers_cipher_cts.c.obj
  905. 117 error [454/1296] Compiling C object subprojects/openssl-3.0.2/libcrypto.a.p/providers_implementations_ciphers_cipher_sm4.c.obj
  906. 117 error [455/1296] Compiling C object subprojects/openssl-3.0.2/libcrypto.a.p/providers_implementations_ciphers_cipher_chacha20_hw.c.obj
  907. 117 error [456/1296] Compiling C object subprojects/openssl-3.0.2/libcrypto.a.p/providers_implementations_ciphers_cipher_tdes_default.c.obj
  908. 117 error [457/1296] Compiling C object subprojects/openssl-3.0.2/libcrypto.a.p/providers_implementations_ciphers_cipher_tdes_hw.c.obj
  909. 117 error [458/1296] Compiling C object subprojects/openssl-3.0.2/libcrypto.a.p/providers_implementations_ciphers_cipher_tdes_wrap.c.obj
  910. 117 error [459/1296] Compiling C object subprojects/openssl-3.0.2/libcrypto.a.p/providers_implementations_ciphers_cipher_sm4_hw.c.obj
  911. 117 error [460/1296] Compiling C object subprojects/openssl-3.0.2/libcrypto.a.p/providers_implementations_ciphers_cipher_tdes_default_hw.c.obj
  912. 117 error [461/1296] Compiling C object subprojects/openssl-3.0.2/libcrypto.a.p/providers_implementations_ciphers_cipher_tdes.c.obj
  913. 117 error [462/1296] Compiling C object subprojects/openssl-3.0.2/libcrypto.a.p/providers_implementations_ciphers_cipher_tdes_common.c.obj
  914. 117 error [463/1296] Compiling C object subprojects/openssl-3.0.2/libcrypto.a.p/providers_implementations_digests_blake2_prov.c.obj
  915. 117 error [464/1296] Compiling C object subprojects/openssl-3.0.2/libcrypto.a.p/providers_implementations_ciphers_cipher_tdes_wrap_hw.c.obj
  916. 117 error [465/1296] Compiling C object subprojects/openssl-3.0.2/libcrypto.a.p/providers_implementations_digests_md5_prov.c.obj
  917. 117 error [466/1296] Compiling C object subprojects/openssl-3.0.2/libcrypto.a.p/providers_implementations_digests_md5_sha1_prov.c.obj
  918. 117 error [467/1296] Compiling C object subprojects/openssl-3.0.2/libcrypto.a.p/providers_implementations_digests_sha2_prov.c.obj
  919. 117 error [468/1296] Compiling C object subprojects/openssl-3.0.2/libcrypto.a.p/providers_implementations_encode_decode_decode_msblob2key.c.obj
  920. 117 error [469/1296] Compiling C object subprojects/openssl-3.0.2/libcrypto.a.p/providers_implementations_encode_decode_decode_epki2pki.c.obj
  921. 117 error [470/1296] Compiling C object subprojects/openssl-3.0.2/libcrypto.a.p/providers_implementations_digests_null_prov.c.obj
  922. 117 error [471/1296] Compiling C object subprojects/openssl-3.0.2/libcrypto.a.p/providers_implementations_digests_sha3_prov.c.obj
  923. 117 error [472/1296] Compiling C object subprojects/openssl-3.0.2/libcrypto.a.p/providers_implementations_digests_sm3_prov.c.obj
  924. 117 error [473/1296] Compiling C object subprojects/openssl-3.0.2/libcrypto.a.p/providers_implementations_encode_decode_encode_key2blob.c.obj
  925. 117 error [474/1296] Compiling C object subprojects/openssl-3.0.2/libcrypto.a.p/providers_implementations_encode_decode_decode_der2key.c.obj
  926. 117 error [475/1296] Compiling C object subprojects/openssl-3.0.2/libcrypto.a.p/providers_implementations_encode_decode_decode_pvk2key.c.obj
  927. 117 error [476/1296] Compiling C object subprojects/openssl-3.0.2/libcrypto.a.p/providers_implementations_encode_decode_decode_pem2der.c.obj
  928. 117 error [477/1296] Compiling C object subprojects/openssl-3.0.2/libcrypto.a.p/providers_implementations_encode_decode_encode_key2any.c.obj
  929. 117 error [478/1296] Compiling C object subprojects/openssl-3.0.2/libcrypto.a.p/providers_implementations_encode_decode_encode_key2ms.c.obj
  930. 117 error [479/1296] Compiling C object subprojects/openssl-3.0.2/libcrypto.a.p/providers_implementations_encode_decode_encode_key2text.c.obj
  931. 117 error [480/1296] Compiling C object subprojects/openssl-3.0.2/libcrypto.a.p/providers_implementations_encode_decode_endecoder_common.c.obj
  932. 117 error [481/1296] Compiling C object subprojects/openssl-3.0.2/libcrypto.a.p/providers_implementations_encode_decode_decode_spki2typespki.c.obj
  933. 117 error [482/1296] Compiling C object subprojects/openssl-3.0.2/libcrypto.a.p/providers_implementations_exchange_ecdh_exch.c.obj
  934. 117 error [483/1296] Compiling C object subprojects/openssl-3.0.2/libcrypto.a.p/providers_implementations_exchange_dh_exch.c.obj
  935. 117 error [484/1296] Compiling C object subprojects/openssl-3.0.2/libcrypto.a.p/providers_implementations_kdfs_kbkdf.c.obj
  936. 117 error [485/1296] Compiling C object subprojects/openssl-3.0.2/libcrypto.a.p/providers_implementations_exchange_ecx_exch.c.obj
  937. 117 error [486/1296] Compiling C object subprojects/openssl-3.0.2/libcrypto.a.p/providers_implementations_exchange_kdf_exch.c.obj
  938. 117 error [487/1296] Compiling C object subprojects/openssl-3.0.2/libcrypto.a.p/providers_implementations_kdfs_krb5kdf.c.obj
  939. 117 error [488/1296] Compiling C object subprojects/openssl-3.0.2/libcrypto.a.p/providers_implementations_kdfs_hkdf.c.obj
  940. 117 error [489/1296] Compiling C object subprojects/openssl-3.0.2/libcrypto.a.p/providers_implementations_kdfs_pbkdf2.c.obj
  941. 117 error [490/1296] Compiling C object subprojects/openssl-3.0.2/libcrypto.a.p/providers_implementations_kem_rsa_kem.c.obj
  942. 117 error [491/1296] Compiling C object subprojects/openssl-3.0.2/libcrypto.a.p/providers_implementations_keymgmt_ec_kmgmt.c.obj
  943. 117 error [492/1296] Compiling C object subprojects/openssl-3.0.2/libcrypto.a.p/providers_implementations_digests_blake2s_prov.c.obj
  944. 117 error [493/1296] Compiling C object subprojects/openssl-3.0.2/libcrypto.a.p/providers_implementations_keymgmt_dsa_kmgmt.c.obj
  945. 117 error [494/1296] Compiling C object subprojects/openssl-3.0.2/libcrypto.a.p/providers_implementations_keymgmt_dh_kmgmt.c.obj
  946. 117 error [495/1296] Compiling C object subprojects/openssl-3.0.2/libcrypto.a.p/providers_implementations_keymgmt_ecx_kmgmt.c.obj
  947. 117 error [496/1296] Compiling C object subprojects/openssl-3.0.2/libcrypto.a.p/providers_implementations_macs_blake2s_mac.c.obj
  948. 117 error [497/1296] Compiling C object subprojects/openssl-3.0.2/libcrypto.a.p/providers_implementations_keymgmt_rsa_kmgmt.c.obj
  949. 117 error [498/1296] Compiling C object subprojects/openssl-3.0.2/libcrypto.a.p/providers_implementations_kdfs_x942kdf.c.obj
  950. 117 error [499/1296] Compiling C object subprojects/openssl-3.0.2/libcrypto.a.p/providers_implementations_macs_cmac_prov.c.obj
  951. 117 error [500/1296] Compiling C object subprojects/openssl-3.0.2/libcrypto.a.p/providers_implementations_macs_blake2b_mac.c.obj
  952. 117 error [501/1296] Compiling C object subprojects/openssl-3.0.2/libcrypto.a.p/providers_implementations_keymgmt_kdf_legacy_kmgmt.c.obj
  953. 117 error [502/1296] Compiling C object subprojects/openssl-3.0.2/libcrypto.a.p/providers_implementations_macs_gmac_prov.c.obj
  954. 117 error [503/1296] Compiling C object subprojects/openssl-3.0.2/libcrypto.a.p/providers_implementations_macs_poly1305_prov.c.obj
  955. 117 error [504/1296] Compiling C object subprojects/openssl-3.0.2/libcrypto.a.p/providers_implementations_rands_drbg.c.obj
  956. 117 error [505/1296] Compiling C object subprojects/openssl-3.0.2/libcrypto.a.p/providers_implementations_macs_kmac_prov.c.obj
  957. 117 error [506/1296] Compiling C object subprojects/openssl-3.0.2/libcrypto.a.p/providers_implementations_keymgmt_mac_legacy_kmgmt.c.obj
  958. 117 error [507/1296] Compiling C object subprojects/openssl-3.0.2/libcrypto.a.p/providers_implementations_macs_siphash_prov.c.obj
  959. 117 error [508/1296] Compiling C object subprojects/openssl-3.0.2/libcrypto.a.p/providers_implementations_rands_drbg_ctr.c.obj
  960. 117 error [509/1296] Compiling C object subprojects/openssl-3.0.2/libcrypto.a.p/providers_implementations_rands_crngt.c.obj
  961. 117 error [510/1296] Compiling C object subprojects/openssl-3.0.2/libcrypto.a.p/providers_implementations_macs_hmac_prov.c.obj
  962. 117 error [511/1296] Compiling C object subprojects/openssl-3.0.2/libcrypto.a.p/providers_implementations_rands_test_rng.c.obj
  963. 117 error [512/1296] Compiling C object subprojects/openssl-3.0.2/libcrypto.a.p/providers_implementations_rands_seeding_rand_cpu_x86.c.obj
  964. 117 error [513/1296] Compiling C object subprojects/openssl-3.0.2/libcrypto.a.p/providers_implementations_rands_seed_src.c.obj
  965. 117 error [514/1296] Compiling C object subprojects/openssl-3.0.2/libcrypto.a.p/providers_implementations_rands_seeding_rand_tsc.c.obj
  966. 117 error [515/1296] Compiling C object subprojects/openssl-3.0.2/libcrypto.a.p/providers_implementations_rands_drbg_hmac.c.obj
  967. 117 error [516/1296] Compiling C object subprojects/openssl-3.0.2/libcrypto.a.p/providers_implementations_rands_drbg_hash.c.obj
  968. 117 error [517/1296] Compiling C object subprojects/openssl-3.0.2/libcrypto.a.p/providers_implementations_rands_seeding_rand_unix.c.obj
  969. 117 error [518/1296] Compiling C object subprojects/openssl-3.0.2/libcrypto.a.p/providers_implementations_signature_mac_legacy_sig.c.obj
  970. 117 error [519/1296] Compiling C object subprojects/openssl-3.0.2/libcrypto.a.p/providers_implementations_rands_seeding_rand_win.c.obj
  971. 117 error [520/1296] Compiling C object subprojects/openssl-3.0.2/libcrypto.a.p/providers_implementations_signature_eddsa_sig.c.obj
  972. 117 error [521/1296] Compiling C object subprojects/openssl-3.0.2/libcrypto.a.p/providers_implementations_signature_dsa_sig.c.obj
  973. 117 error [522/1296] Compiling C object subprojects/openssl-3.0.2/libcrypto.a.p/providers_implementations_signature_ecdsa_sig.c.obj
  974. 117 error [523/1296] Compiling C object subprojects/openssl-3.0.2/libcrypto.a.p/providers_implementations_storemgmt_file_store_any2obj.c.obj
  975. 117 error [524/1296] Compiling C object subprojects/openssl-3.0.2/libcrypto.a.p/ssl_s3_cbc.c.obj
  976. 117 error [525/1296] Compiling C object subprojects/openssl-3.0.2/libcrypto.a.p/providers_implementations_signature_rsa_sig.c.obj
  977. 117 error [526/1296] Compiling C object subprojects/openssl-3.0.2/libcrypto.a.p/providers_common_der_der_dsa_sig.c.obj
  978. 117 error [527/1296] Compiling C object subprojects/openssl-3.0.2/libcrypto.a.p/providers_implementations_signature_sm2_sig.c.obj
  979. 117 error [528/1296] Compiling C object subprojects/openssl-3.0.2/libcrypto.a.p/providers_common_der_der_dsa_key.c.obj
  980. 117 error [529/1296] Compiling C object subprojects/openssl-3.0.2/libcrypto.a.p/providers_common_der_der_ecx_key.c.obj
  981. 117 error [530/1296] Compiling C object subprojects/openssl-3.0.2/libcrypto.a.p/providers_implementations_storemgmt_file_store.c.obj
  982. 117 error [531/1296] Compiling C object subprojects/openssl-3.0.2/libcrypto.a.p/providers_common_der_der_ec_sig.c.obj
  983. 117 error [532/1296] Compiling C object subprojects/openssl-3.0.2/libcrypto.a.p/providers_common_provider_ctx.c.obj
  984. 117 error [533/1296] Compiling C object subprojects/openssl-3.0.2/libcrypto.a.p/providers_implementations_ciphers_ciphercommon.c.obj
  985. 117 error [534/1296] Compiling C object subprojects/openssl-3.0.2/libcrypto.a.p/providers_common_provider_err.c.obj
  986. 117 error [535/1296] Compiling C object subprojects/openssl-3.0.2/libcrypto.a.p/providers_common_der_der_rsa_key.c.obj
  987. 117 error [536/1296] Compiling C object subprojects/openssl-3.0.2/libcrypto.a.p/providers_implementations_digests_blake2b_prov.c.obj
  988. 117 error [537/1296] Compiling C object subprojects/openssl-3.0.2/libcrypto.a.p/providers_common_der_der_ec_key.c.obj
  989. 117 error [538/1296] Compiling C object subprojects/openssl-3.0.2/libcrypto.a.p/providers_implementations_ciphers_ciphercommon_block.c.obj
  990. 117 error [539/1296] Compiling C object subprojects/openssl-3.0.2/libcrypto.a.p/ssl_record_tls_pad.c.obj
  991. 117 error [540/1296] Compiling C object subprojects/openssl-3.0.2/libcrypto.a.p/providers_implementations_ciphers_ciphercommon_hw.c.obj
  992. 117 error [541/1296] Compiling C object subprojects/openssl-3.0.2/libcrypto.a.p/providers_implementations_ciphers_ciphercommon_ccm_hw.c.obj
  993. 117 error [542/1296] Compiling C object subprojects/openssl-3.0.2/libcrypto.a.p/providers_implementations_ciphers_cipher_blowfish.c.obj
  994. 117 error [543/1296] Compiling C object subprojects/openssl-3.0.2/libcrypto.a.p/providers_implementations_ciphers_ciphercommon_gcm_hw.c.obj
  995. 117 error [544/1296] Compiling C object subprojects/openssl-3.0.2/libcrypto.a.p/providers_implementations_ciphers_ciphercommon_ccm.c.obj
  996. 117 error [545/1296] Compiling C object subprojects/openssl-3.0.2/libcrypto.a.p/providers_implementations_digests_digestcommon.c.obj
  997. 117 error [546/1296] Compiling C object subprojects/openssl-3.0.2/libcrypto.a.p/providers_implementations_ciphers_ciphercommon_gcm.c.obj
  998. 117 error [547/1296] Compiling C object subprojects/openssl-3.0.2/libcrypto.a.p/providers_implementations_ciphers_cipher_cast5.c.obj
  999. 117 error [548/1296] Compiling C object subprojects/openssl-3.0.2/libcrypto.a.p/providers_implementations_ciphers_cipher_des_hw.c.obj
  1000. 117 error [549/1296] Compiling C object subprojects/openssl-3.0.2/libcrypto.a.p/providers_implementations_ciphers_cipher_cast5_hw.c.obj
  1001. 117 error [550/1296] Compiling C object subprojects/openssl-3.0.2/libcrypto.a.p/providers_implementations_ciphers_cipher_des.c.obj
  1002. 117 error [551/1296] Compiling C object subprojects/openssl-3.0.2/libcrypto.a.p/providers_implementations_ciphers_cipher_blowfish_hw.c.obj
  1003. 117 error [552/1296] Compiling C object subprojects/openssl-3.0.2/libcrypto.a.p/providers_implementations_ciphers_cipher_desx.c.obj
  1004. 117 error [553/1296] Compiling C object subprojects/openssl-3.0.2/libcrypto.a.p/providers_implementations_ciphers_cipher_desx_hw.c.obj
  1005. 117 error [554/1296] Compiling C object subprojects/openssl-3.0.2/libcrypto.a.p/providers_implementations_ciphers_cipher_rc2.c.obj
  1006. 117 error [555/1296] Compiling C object subprojects/openssl-3.0.2/libcrypto.a.p/providers_implementations_ciphers_cipher_rc4.c.obj
  1007. 117 error [556/1296] Compiling C object subprojects/openssl-3.0.2/libcrypto.a.p/providers_implementations_ciphers_cipher_idea.c.obj
  1008. 117 error [557/1296] Compiling C object subprojects/openssl-3.0.2/libcrypto.a.p/providers_implementations_digests_md4_prov.c.obj
  1009. 117 error [558/1296] Compiling C object subprojects/openssl-3.0.2/libcrypto.a.p/providers_implementations_ciphers_cipher_idea_hw.c.obj
  1010. 117 error [559/1296] Compiling C object subprojects/openssl-3.0.2/libcrypto.a.p/providers_implementations_ciphers_cipher_rc2_hw.c.obj
  1011. 117 error [560/1296] Compiling C object subprojects/openssl-3.0.2/libcrypto.a.p/providers_implementations_ciphers_cipher_rc4_hmac_md5_hw.c.obj
  1012. 117 error [561/1296] Compiling C object subprojects/openssl-3.0.2/libcrypto.a.p/providers_implementations_ciphers_cipher_rc4_hmac_md5.c.obj
  1013. 117 error [562/1296] Compiling C object subprojects/openssl-3.0.2/libcrypto.a.p/providers_implementations_ciphers_cipher_seed.c.obj
  1014. 117 error [563/1296] Compiling C object subprojects/openssl-3.0.2/libcrypto.a.p/providers_implementations_ciphers_cipher_seed_hw.c.obj
  1015. 117 error [564/1296] Compiling C object subprojects/openssl-3.0.2/libcrypto.a.p/providers_implementations_digests_mdc2_prov.c.obj
  1016. 117 error [565/1296] Compiling C object subprojects/openssl-3.0.2/libcrypto.a.p/providers_implementations_ciphers_cipher_rc4_hw.c.obj
  1017. 117 error [566/1296] Compiling C object subprojects/openssl-3.0.2/libcrypto.a.p/generated-config_archs_VC-WIN64A_no-asm_providers_common_der_der_dsa_gen.c.obj
  1018. 117 error [567/1296] Compiling C object subprojects/openssl-3.0.2/libcrypto.a.p/providers_legacyprov.c.obj
  1019. 117 error [568/1296] Compiling C object subprojects/openssl-3.0.2/libcrypto.a.p/providers_implementations_digests_ripemd_prov.c.obj
  1020. 117 error [569/1296] Compiling C object subprojects/openssl-3.0.2/libcrypto.a.p/providers_implementations_kdfs_pbkdf1.c.obj
  1021. 117 error [570/1296] Compiling C object subprojects/openssl-3.0.2/libcrypto.a.p/generated-config_archs_VC-WIN64A_no-asm_providers_common_der_der_digests_gen.c.obj
  1022. 117 error [571/1296] Compiling C object subprojects/openssl-3.0.2/libcrypto.a.p/generated-config_archs_VC-WIN64A_no-asm_providers_common_der_der_ec_gen.c.obj
  1023. 117 error [572/1296] Compiling C object subprojects/openssl-3.0.2/libcrypto.a.p/generated-config_archs_VC-WIN64A_no-asm_providers_common_der_der_sm2_gen.c.obj
  1024. 117 error [573/1296] Compiling C object subprojects/openssl-3.0.2/libcrypto.a.p/providers_implementations_digests_wp_prov.c.obj
  1025. 117 error [574/1296] Compiling C object subprojects/openssl-3.0.2/libcrypto.a.p/generated-config_archs_VC-WIN64A_no-asm_providers_common_der_der_wrap_gen.c.obj
  1026. 117 error [575/1296] Compiling C object subprojects/openssl-3.0.2/libcrypto.a.p/generated-config_archs_VC-WIN64A_no-asm_providers_common_der_der_rsa_gen.c.obj
  1027. 117 error [576/1296] Compiling C object subprojects/openssl-3.0.2/libcrypto.a.p/generated-config_archs_VC-WIN64A_no-asm_providers_common_der_der_ecx_gen.c.obj
  1028. 117 error [577/1296] Compiling C object subprojects/openssl-3.0.2/libssl.a.p/ssl_pqueue.c.obj
  1029. 117 error D:\csFiles\psuFiles\springTerm2022\mediasoup3-record-demo\mediasoup3-record-demo\server\node_modules\mediasoup\worker\subprojects\openssl-3.0.2\ssl\ssl_local.h(2878): warning C4133: 'function': incompatible types - from 'volatile int *' to 'volatile LONG64 *'
  1030. 117 error [578/1296] Compiling C object subprojects/openssl-3.0.2/libssl.a.p/ssl_s3_lib.c.obj
  1031. 117 error D:\csFiles\psuFiles\springTerm2022\mediasoup3-record-demo\mediasoup3-record-demo\server\node_modules\mediasoup\worker\subprojects\openssl-3.0.2\ssl\ssl_local.h(2878): warning C4133: 'function': incompatible types - from 'volatile int *' to 'volatile LONG64 *'
  1032. 117 error [579/1296] Compiling C object subprojects/openssl-3.0.2/libssl.a.p/ssl_methods.c.obj
  1033. 117 error D:\csFiles\psuFiles\springTerm2022\mediasoup3-record-demo\mediasoup3-record-demo\server\node_modules\mediasoup\worker\subprojects\openssl-3.0.2\ssl\ssl_local.h(2878): warning C4133: 'function': incompatible types - from 'volatile int *' to 'volatile LONG64 *'
  1034. 117 error [580/1296] Compiling C object subprojects/openssl-3.0.2/libssl.a.p/ssl_d1_lib.c.obj
  1035. 117 error D:\csFiles\psuFiles\springTerm2022\mediasoup3-record-demo\mediasoup3-record-demo\server\node_modules\mediasoup\worker\subprojects\openssl-3.0.2\ssl\ssl_local.h(2878): warning C4133: 'function': incompatible types - from 'volatile int *' to 'volatile LONG64 *'
  1036. 117 error [581/1296] Compiling C object subprojects/openssl-3.0.2/libssl.a.p/ssl_s3_enc.c.obj
  1037. 117 error D:\csFiles\psuFiles\springTerm2022\mediasoup3-record-demo\mediasoup3-record-demo\server\node_modules\mediasoup\worker\subprojects\openssl-3.0.2\ssl\ssl_local.h(2878): warning C4133: 'function': incompatible types - from 'volatile int *' to 'volatile LONG64 *'
  1038. 117 error [582/1296] Compiling C object subprojects/openssl-3.0.2/libssl.a.p/ssl_s3_msg.c.obj
  1039. 117 error D:\csFiles\psuFiles\springTerm2022\mediasoup3-record-demo\mediasoup3-record-demo\server\node_modules\mediasoup\worker\subprojects\openssl-3.0.2\ssl\ssl_local.h(2878): warning C4133: 'function': incompatible types - from 'volatile int *' to 'volatile LONG64 *'
  1040. 117 error [583/1296] Compiling C object subprojects/openssl-3.0.2/libssl.a.p/ssl_bio_ssl.c.obj
  1041. 117 error D:\csFiles\psuFiles\springTerm2022\mediasoup3-record-demo\mediasoup3-record-demo\server\node_modules\mediasoup\worker\subprojects\openssl-3.0.2\ssl\ssl_local.h(2878): warning C4133: 'function': incompatible types - from 'volatile int *' to 'volatile LONG64 *'
  1042. 117 error [584/1296] Compiling C object subprojects/openssl-3.0.2/libssl.a.p/ssl_d1_srtp.c.obj
  1043. 117 error D:\csFiles\psuFiles\springTerm2022\mediasoup3-record-demo\mediasoup3-record-demo\server\node_modules\mediasoup\worker\subprojects\openssl-3.0.2\ssl\ssl_local.h(2878): warning C4133: 'function': incompatible types - from 'volatile int *' to 'volatile LONG64 *'
  1044. 117 error [585/1296] Compiling C object subprojects/openssl-3.0.2/libssl.a.p/ssl_ssl_err_legacy.c.obj
  1045. 117 error [586/1296] Compiling C object subprojects/openssl-3.0.2/libssl.a.p/ssl_d1_msg.c.obj
  1046. 117 error D:\csFiles\psuFiles\springTerm2022\mediasoup3-record-demo\mediasoup3-record-demo\server\node_modules\mediasoup\worker\subprojects\openssl-3.0.2\ssl\ssl_local.h(2878): warning C4133: 'function': incompatible types - from 'volatile int *' to 'volatile LONG64 *'
  1047. 117 error [587/1296] Compiling C object subprojects/openssl-3.0.2/libssl.a.p/ssl_ssl_mcnf.c.obj
  1048. 117 error D:\csFiles\psuFiles\springTerm2022\mediasoup3-record-demo\mediasoup3-record-demo\server\node_modules\mediasoup\worker\subprojects\openssl-3.0.2\ssl\ssl_local.h(2878): warning C4133: 'function': incompatible types - from 'volatile int *' to 'volatile LONG64 *'
  1049. 117 error [588/1296] Compiling C object subprojects/openssl-3.0.2/libssl.a.p/ssl_ssl_err.c.obj
  1050. 117 error [589/1296] Compiling C object subprojects/openssl-3.0.2/libssl.a.p/ssl_ssl_lib.c.obj
  1051. 117 error D:\csFiles\psuFiles\springTerm2022\mediasoup3-record-demo\mediasoup3-record-demo\server\node_modules\mediasoup\worker\subprojects\openssl-3.0.2\ssl\ssl_local.h(2878): warning C4133: 'function': incompatible types - from 'volatile int *' to 'volatile LONG64 *'
  1052. 117 error [590/1296] Compiling C object subprojects/openssl-3.0.2/libssl.a.p/ssl_ssl_asn1.c.obj
  1053. 117 error D:\csFiles\psuFiles\springTerm2022\mediasoup3-record-demo\mediasoup3-record-demo\server\node_modules\mediasoup\worker\subprojects\openssl-3.0.2\ssl\ssl_local.h(2878): warning C4133: 'function': incompatible types - from 'volatile int *' to 'volatile LONG64 *'
  1054. 117 error [591/1296] Compiling C object subprojects/openssl-3.0.2/libssl.a.p/ssl_ssl_cert.c.obj
  1055. 117 error D:\csFiles\psuFiles\springTerm2022\mediasoup3-record-demo\mediasoup3-record-demo\server\node_modules\mediasoup\worker\subprojects\openssl-3.0.2\ssl\ssl_local.h(2878): warning C4133: 'function': incompatible types - from 'volatile int *' to 'volatile LONG64 *'
  1056. 117 error [592/1296] Compiling C object subprojects/openssl-3.0.2/libssl.a.p/ssl_ssl_conf.c.obj
  1057. 117 error D:\csFiles\psuFiles\springTerm2022\mediasoup3-record-demo\mediasoup3-record-demo\server\node_modules\mediasoup\worker\subprojects\openssl-3.0.2\ssl\ssl_local.h(2878): warning C4133: 'function': incompatible types - from 'volatile int *' to 'volatile LONG64 *'
  1058. 117 error [593/1296] Compiling C object subprojects/openssl-3.0.2/libssl.a.p/ssl_ssl_init.c.obj
  1059. 117 error D:\csFiles\psuFiles\springTerm2022\mediasoup3-record-demo\mediasoup3-record-demo\server\node_modules\mediasoup\worker\subprojects\openssl-3.0.2\ssl\ssl_local.h(2878): warning C4133: 'function': incompatible types - from 'volatile int *' to 'volatile LONG64 *'
  1060. 117 error [594/1296] Compiling C object subprojects/openssl-3.0.2/libssl.a.p/ssl_ssl_sess.c.obj
  1061. 117 error D:\csFiles\psuFiles\springTerm2022\mediasoup3-record-demo\mediasoup3-record-demo\server\node_modules\mediasoup\worker\subprojects\openssl-3.0.2\ssl\ssl_local.h(2878): warning C4133: 'function': incompatible types - from 'volatile int *' to 'volatile LONG64 *'
  1062. 117 error [595/1296] Compiling C object subprojects/openssl-3.0.2/libssl.a.p/ssl_ssl_ciph.c.obj
  1063. 117 error D:\csFiles\psuFiles\springTerm2022\mediasoup3-record-demo\mediasoup3-record-demo\server\node_modules\mediasoup\worker\subprojects\openssl-3.0.2\ssl\ssl_local.h(2878): warning C4133: 'function': incompatible types - from 'volatile int *' to 'volatile LONG64 *'
  1064. 117 error [596/1296] Compiling C object subprojects/openssl-3.0.2/libssl.a.p/ssl_ssl_rsa_legacy.c.obj
  1065. 117 error [597/1296] Compiling C object subprojects/openssl-3.0.2/libssl.a.p/ssl_ssl_txt.c.obj
  1066. 117 error D:\csFiles\psuFiles\springTerm2022\mediasoup3-record-demo\mediasoup3-record-demo\server\node_modules\mediasoup\worker\subprojects\openssl-3.0.2\ssl\ssl_local.h(2878): warning C4133: 'function': incompatible types - from 'volatile int *' to 'volatile LONG64 *'
  1067. 117 error [598/1296] Compiling C object subprojects/openssl-3.0.2/libssl.a.p/ssl_ssl_utst.c.obj
  1068. 117 error D:\csFiles\psuFiles\springTerm2022\mediasoup3-record-demo\mediasoup3-record-demo\server\node_modules\mediasoup\worker\subprojects\openssl-3.0.2\ssl\ssl_local.h(2878): warning C4133: 'function': incompatible types - from 'volatile int *' to 'volatile LONG64 *'
  1069. 117 error [599/1296] Compiling C object subprojects/openssl-3.0.2/libssl.a.p/ssl_t1_trce.c.obj
  1070. 117 error D:\csFiles\psuFiles\springTerm2022\mediasoup3-record-demo\mediasoup3-record-demo\server\node_modules\mediasoup\worker\subprojects\openssl-3.0.2\ssl\ssl_local.h(2878): warning C4133: 'function': incompatible types - from 'volatile int *' to 'volatile LONG64 *'
  1071. 117 error [600/1296] Compiling C object subprojects/openssl-3.0.2/libssl.a.p/ssl_ssl_stat.c.obj
  1072. 117 error D:\csFiles\psuFiles\springTerm2022\mediasoup3-record-demo\mediasoup3-record-demo\server\node_modules\mediasoup\worker\subprojects\openssl-3.0.2\ssl\ssl_local.h(2878): warning C4133: 'function': incompatible types - from 'volatile int *' to 'volatile LONG64 *'
  1073. 117 error [601/1296] Compiling C object subprojects/openssl-3.0.2/libssl.a.p/ssl_t1_enc.c.obj
  1074. 117 error D:\csFiles\psuFiles\springTerm2022\mediasoup3-record-demo\mediasoup3-record-demo\server\node_modules\mediasoup\worker\subprojects\openssl-3.0.2\ssl\ssl_local.h(2878): warning C4133: 'function': incompatible types - from 'volatile int *' to 'volatile LONG64 *'
  1075. 117 error [602/1296] Compiling C object subprojects/openssl-3.0.2/libssl.a.p/ssl_ssl_rsa.c.obj
  1076. 117 error D:\csFiles\psuFiles\springTerm2022\mediasoup3-record-demo\mediasoup3-record-demo\server\node_modules\mediasoup\worker\subprojects\openssl-3.0.2\ssl\ssl_local.h(2878): warning C4133: 'function': incompatible types - from 'volatile int *' to 'volatile LONG64 *'
  1077. 117 error [603/1296] Compiling C object subprojects/openssl-3.0.2/libssl.a.p/ssl_t1_lib.c.obj
  1078. 117 error D:\csFiles\psuFiles\springTerm2022\mediasoup3-record-demo\mediasoup3-record-demo\server\node_modules\mediasoup\worker\subprojects\openssl-3.0.2\ssl\ssl_local.h(2878): warning C4133: 'function': incompatible types - from 'volatile int *' to 'volatile LONG64 *'
  1079. 117 error [604/1296] Compiling C object subprojects/openssl-3.0.2/libssl.a.p/ssl_tls_srp.c.obj
  1080. 117 error D:\csFiles\psuFiles\springTerm2022\mediasoup3-record-demo\mediasoup3-record-demo\server\node_modules\mediasoup\worker\subprojects\openssl-3.0.2\ssl\ssl_local.h(2878): warning C4133: 'function': incompatible types - from 'volatile int *' to 'volatile LONG64 *'
  1081. 117 error [605/1296] Compiling C object subprojects/openssl-3.0.2/libssl.a.p/ssl_record_ssl3_record.c.obj
  1082. 117 error D:\csFiles\psuFiles\springTerm2022\mediasoup3-record-demo\mediasoup3-record-demo\server\node_modules\mediasoup\worker\subprojects\openssl-3.0.2\ssl\record\../ssl_local.h(2878): warning C4133: 'function': incompatible types - from 'volatile int *' to 'volatile LONG64 *'
  1083. 117 error [606/1296] Compiling C object subprojects/openssl-3.0.2/libssl.a.p/ssl_record_rec_layer_d1.c.obj
  1084. 117 error D:\csFiles\psuFiles\springTerm2022\mediasoup3-record-demo\mediasoup3-record-demo\server\node_modules\mediasoup\worker\subprojects\openssl-3.0.2\ssl\record\../ssl_local.h(2878): warning C4133: 'function': incompatible types - from 'volatile int *' to 'volatile LONG64 *'
  1085. 117 error [607/1296] Compiling C object subprojects/openssl-3.0.2/libssl.a.p/ssl_tls_depr.c.obj
  1086. 117 error D:\csFiles\psuFiles\springTerm2022\mediasoup3-record-demo\mediasoup3-record-demo\server\node_modules\mediasoup\worker\subprojects\openssl-3.0.2\ssl\ssl_local.h(2878): warning C4133: 'function': incompatible types - from 'volatile int *' to 'volatile LONG64 *'
  1087. 117 error [608/1296] Compiling C object subprojects/openssl-3.0.2/libssl.a.p/ssl_record_ssl3_record_tls13.c.obj
  1088. 117 error D:\csFiles\psuFiles\springTerm2022\mediasoup3-record-demo\mediasoup3-record-demo\server\node_modules\mediasoup\worker\subprojects\openssl-3.0.2\ssl\record\../ssl_local.h(2878): warning C4133: 'function': incompatible types - from 'volatile int *' to 'volatile LONG64 *'
  1089. 117 error [609/1296] Compiling C object subprojects/openssl-3.0.2/libssl.a.p/ssl_tls13_enc.c.obj
  1090. 117 error D:\csFiles\psuFiles\springTerm2022\mediasoup3-record-demo\mediasoup3-record-demo\server\node_modules\mediasoup\worker\subprojects\openssl-3.0.2\ssl\ssl_local.h(2878): warning C4133: 'function': incompatible types - from 'volatile int *' to 'volatile LONG64 *'
  1091. 117 error [610/1296] Compiling C object subprojects/openssl-3.0.2/libssl.a.p/ssl_record_ssl3_buffer.c.obj
  1092. 117 error D:\csFiles\psuFiles\springTerm2022\mediasoup3-record-demo\mediasoup3-record-demo\server\node_modules\mediasoup\worker\subprojects\openssl-3.0.2\ssl\record\../ssl_local.h(2878): warning C4133: 'function': incompatible types - from 'volatile int *' to 'volatile LONG64 *'
  1093. 117 error [611/1296] Compiling C object subprojects/openssl-3.0.2/libssl.a.p/ssl_record_rec_layer_s3.c.obj
  1094. 117 error D:\csFiles\psuFiles\springTerm2022\mediasoup3-record-demo\mediasoup3-record-demo\server\node_modules\mediasoup\worker\subprojects\openssl-3.0.2\ssl\record\../ssl_local.h(2878): warning C4133: 'function': incompatible types - from 'volatile int *' to 'volatile LONG64 *'
  1095. 117 error [612/1296] Compiling C object subprojects/openssl-3.0.2/libssl.a.p/ssl_record_dtls1_bitmap.c.obj
  1096. 117 error D:\csFiles\psuFiles\springTerm2022\mediasoup3-record-demo\mediasoup3-record-demo\server\node_modules\mediasoup\worker\subprojects\openssl-3.0.2\ssl\record\../ssl_local.h(2878): warning C4133: 'function': incompatible types - from 'volatile int *' to 'volatile LONG64 *'
  1097. 117 error [613/1296] Compiling C object subprojects/openssl-3.0.2/libssl.a.p/ssl_statem_statem_lib.c.obj
  1098. 117 error D:\csFiles\psuFiles\springTerm2022\mediasoup3-record-demo\mediasoup3-record-demo\server\node_modules\mediasoup\worker\subprojects\openssl-3.0.2\ssl\statem\../ssl_local.h(2878): warning C4133: 'function': incompatible types - from 'volatile int *' to 'volatile LONG64 *'
  1099. 117 error [614/1296] Compiling C object subprojects/openssl-3.0.2/libssl.a.p/ssl_statem_extensions_cust.c.obj
  1100. 117 error D:\csFiles\psuFiles\springTerm2022\mediasoup3-record-demo\mediasoup3-record-demo\server\node_modules\mediasoup\worker\subprojects\openssl-3.0.2\ssl\statem\../ssl_local.h(2878): warning C4133: 'function': incompatible types - from 'volatile int *' to 'volatile LONG64 *'
  1101. 117 error [615/1296] Compiling C object subprojects/openssl-3.0.2/libssl.a.p/ssl_statem_extensions_srvr.c.obj
  1102. 117 error D:\csFiles\psuFiles\springTerm2022\mediasoup3-record-demo\mediasoup3-record-demo\server\node_modules\mediasoup\worker\subprojects\openssl-3.0.2\ssl\statem\../ssl_local.h(2878): warning C4133: 'function': incompatible types - from 'volatile int *' to 'volatile LONG64 *'
  1103. 117 error [616/1296] Compiling C object subprojects/openssl-3.0.2/libssl.a.p/ssl_statem_extensions_clnt.c.obj
  1104. 117 error D:\csFiles\psuFiles\springTerm2022\mediasoup3-record-demo\mediasoup3-record-demo\server\node_modules\mediasoup\worker\subprojects\openssl-3.0.2\ssl\statem\../ssl_local.h(2878): warning C4133: 'function': incompatible types - from 'volatile int *' to 'volatile LONG64 *'
  1105. 117 error [617/1296] Compiling C object subprojects/openssl-3.0.2/libssl.a.p/ssl_statem_statem_dtls.c.obj
  1106. 117 error D:\csFiles\psuFiles\springTerm2022\mediasoup3-record-demo\mediasoup3-record-demo\server\node_modules\mediasoup\worker\subprojects\openssl-3.0.2\ssl\statem\../ssl_local.h(2878): warning C4133: 'function': incompatible types - from 'volatile int *' to 'volatile LONG64 *'
  1107. 117 error [618/1296] Compiling C object subprojects/openssl-3.0.2/libssl.a.p/ssl_statem_statem.c.obj
  1108. 117 error D:\csFiles\psuFiles\springTerm2022\mediasoup3-record-demo\mediasoup3-record-demo\server\node_modules\mediasoup\worker\subprojects\openssl-3.0.2\ssl\statem\../ssl_local.h(2878): warning C4133: 'function': incompatible types - from 'volatile int *' to 'volatile LONG64 *'
  1109. 117 error [619/1296] Compiling C object subprojects/openssl-3.0.2/libssl.a.p/ssl_statem_extensions.c.obj
  1110. 117 error D:\csFiles\psuFiles\springTerm2022\mediasoup3-record-demo\mediasoup3-record-demo\server\node_modules\mediasoup\worker\subprojects\openssl-3.0.2\ssl\statem\../ssl_local.h(2878): warning C4133: 'function': incompatible types - from 'volatile int *' to 'volatile LONG64 *'
  1111. 117 error ../../../subprojects/openssl-3.0.2/ssl/statem/extensions.c(904): warning C4133: 'function': incompatible types - from 'volatile int *' to 'volatile LONG64 *'
  1112. 117 error [620/1296] Compiling C object subprojects/openssl-3.0.2/libssl.a.p/ssl_statem_statem_srvr.c.obj
  1113. 117 error D:\csFiles\psuFiles\springTerm2022\mediasoup3-record-demo\mediasoup3-record-demo\server\node_modules\mediasoup\worker\subprojects\openssl-3.0.2\ssl\statem\../ssl_local.h(2878): warning C4133: 'function': incompatible types - from 'volatile int *' to 'volatile LONG64 *'
  1114. 117 error [621/1296] Compiling C object subprojects/openssl-3.0.2/libcrypto.a.p/crypto_evp_dh_ctrl.c.obj
  1115. 117 error [622/1296] Compiling C object subprojects/openssl-3.0.2/libcrypto.a.p/crypto_evp_dsa_ctrl.c.obj
  1116. 117 error [623/1296] Compiling C object subprojects/openssl-3.0.2/libcrypto.a.p/crypto_evp_dh_support.c.obj
  1117. 117 error [624/1296] Compiling C object subprojects/openssl-3.0.2/libcrypto.a.p/crypto_evp_e_aes.c.obj
  1118. 117 error [625/1296] Compiling C object subprojects/openssl-3.0.2/libcrypto.a.p/crypto_evp_cmeth_lib.c.obj
  1119. 117 error [626/1296] Compiling C object subprojects/openssl-3.0.2/libcrypto.a.p/crypto_evp_digest.c.obj
  1120. 117 error [627/1296] Compiling C object subprojects/openssl-3.0.2/libssl.a.p/ssl_statem_statem_clnt.c.obj
  1121. 117 error D:\csFiles\psuFiles\springTerm2022\mediasoup3-record-demo\mediasoup3-record-demo\server\node_modules\mediasoup\worker\subprojects\openssl-3.0.2\ssl\statem\../ssl_local.h(2878): warning C4133: 'function': incompatible types - from 'volatile int *' to 'volatile LONG64 *'
  1122. 117 error [628/1296] Compiling C object subprojects/openssl-3.0.2/libcrypto.a.p/crypto_evp_ctrl_params_translate.c.obj
  1123. 117 error [629/1296] Compiling C object subprojects/openssl-3.0.2/libcrypto.a.p/crypto_evp_e_aes_cbc_hmac_sha1.c.obj
  1124. 117 error [630/1296] Compiling C object subprojects/openssl-3.0.2/libcrypto.a.p/crypto_evp_e_aes_cbc_hmac_sha256.c.obj
  1125. 117 error [631/1296] Linking static target subprojects/openssl-3.0.2/libssl.a
  1126. 117 error [632/1296] Compiling C object subprojects/openssl-3.0.2/libcrypto.a.p/crypto_evp_e_aria.c.obj
  1127. 117 error [633/1296] Compiling C object subprojects/openssl-3.0.2/libcrypto.a.p/crypto_evp_e_cast.c.obj
  1128. 117 error [634/1296] Compiling C object subprojects/openssl-3.0.2/libcrypto.a.p/crypto_evp_e_camellia.c.obj
  1129. 117 error [635/1296] Compiling C object subprojects/openssl-3.0.2/libcrypto.a.p/crypto_evp_e_des3.c.obj
  1130. 117 error [636/1296] Compiling C object subprojects/openssl-3.0.2/libcrypto.a.p/crypto_evp_e_des.c.obj
  1131. 117 error [637/1296] Compiling C object subprojects/openssl-3.0.2/libcrypto.a.p/crypto_evp_e_bf.c.obj
  1132. 117 error [638/1296] Compiling C object subprojects/openssl-3.0.2/libcrypto.a.p/crypto_evp_e_chacha20_poly1305.c.obj
  1133. 117 error [639/1296] Compiling C object subprojects/openssl-3.0.2/libcrypto.a.p/crypto_evp_e_idea.c.obj
  1134. 117 error [640/1296] Compiling C object subprojects/openssl-3.0.2/libcrypto.a.p/crypto_evp_e_rc2.c.obj
  1135. 117 error [641/1296] Compiling C object subprojects/openssl-3.0.2/libcrypto.a.p/crypto_evp_e_rc5.c.obj
  1136. 117 error [642/1296] Compiling C object subprojects/openssl-3.0.2/libcrypto.a.p/crypto_evp_e_null.c.obj
  1137. 117 error [643/1296] Compiling C object subprojects/openssl-3.0.2/libcrypto.a.p/crypto_evp_e_sm4.c.obj
  1138. 117 error [644/1296] Compiling C object subprojects/openssl-3.0.2/libcrypto.a.p/crypto_evp_e_rc4_hmac_md5.c.obj
  1139. 117 error [645/1296] Compiling C object subprojects/openssl-3.0.2/libcrypto.a.p/crypto_evp_e_seed.c.obj
  1140. 117 error [646/1296] Compiling C object subprojects/openssl-3.0.2/libcrypto.a.p/crypto_evp_ec_ctrl.c.obj
  1141. 117 error [647/1296] Compiling C object subprojects/openssl-3.0.2/libcrypto.a.p/crypto_evp_e_xcbc_d.c.obj
  1142. 117 error [648/1296] Compiling C object subprojects/openssl-3.0.2/libcrypto.a.p/crypto_evp_e_rc4.c.obj
  1143. 117 error [649/1296] Compiling C object subprojects/openssl-3.0.2/libcrypto.a.p/crypto_evp_evp_err.c.obj
  1144. 117 error [650/1296] Compiling C object subprojects/openssl-3.0.2/libcrypto.a.p/crypto_evp_e_old.c.obj
  1145. 117 error [651/1296] Compiling C object subprojects/openssl-3.0.2/libcrypto.a.p/crypto_evp_evp_pbe.c.obj
  1146. 117 error [652/1296] Compiling C object subprojects/openssl-3.0.2/libcrypto.a.p/crypto_evp_evp_fetch.c.obj
  1147. 117 error [653/1296] Compiling C object subprojects/openssl-3.0.2/libcrypto.a.p/crypto_evp_encode.c.obj
  1148. 117 error [654/1296] Compiling C object subprojects/openssl-3.0.2/libcrypto.a.p/crypto_evp_evp_enc.c.obj
  1149. 117 error [655/1296] Compiling C object subprojects/openssl-3.0.2/libcrypto.a.p/crypto_evp_ec_support.c.obj
  1150. 117 error [656/1296] Compiling C object subprojects/openssl-3.0.2/libcrypto.a.p/crypto_evp_evp_cnf.c.obj
  1151. 117 error [657/1296] Compiling C object subprojects/openssl-3.0.2/libcrypto.a.p/crypto_evp_evp_key.c.obj
  1152. 117 error [658/1296] Compiling C object subprojects/openssl-3.0.2/libcrypto.a.p/crypto_evp_kdf_meth.c.obj
  1153. 117 error [659/1296] Compiling C object subprojects/openssl-3.0.2/libcrypto.a.p/crypto_evp_evp_lib.c.obj
  1154. 117 error [660/1296] Compiling C object subprojects/openssl-3.0.2/libcrypto.a.p/crypto_evp_evp_rand.c.obj
  1155. 117 error [661/1296] Compiling C object subprojects/openssl-3.0.2/libcrypto.a.p/crypto_evp_exchange.c.obj
  1156. 117 error [662/1296] Compiling C object subprojects/openssl-3.0.2/libcrypto.a.p/crypto_evp_kem.c.obj
  1157. 117 error [663/1296] Compiling C object subprojects/openssl-3.0.2/libcrypto.a.p/crypto_evp_keymgmt_lib.c.obj
  1158. 117 error [664/1296] Compiling C object subprojects/openssl-3.0.2/libcrypto.a.p/crypto_evp_kdf_lib.c.obj
  1159. 117 error [665/1296] Compiling C object subprojects/openssl-3.0.2/libcrypto.a.p/crypto_evp_evp_pkey.c.obj
  1160. 117 error [666/1296] Compiling C object subprojects/openssl-3.0.2/libcrypto.a.p/crypto_evp_legacy_blake2.c.obj
  1161. 117 error [667/1296] Compiling C object subprojects/openssl-3.0.2/libcrypto.a.p/crypto_evp_legacy_mdc2.c.obj
  1162. 117 error [668/1296] Compiling C object subprojects/openssl-3.0.2/libcrypto.a.p/crypto_evp_keymgmt_meth.c.obj
  1163. 117 error [669/1296] Compiling C object subprojects/openssl-3.0.2/libcrypto.a.p/crypto_evp_evp_utils.c.obj
  1164. 117 error [670/1296] Compiling C object subprojects/openssl-3.0.2/libcrypto.a.p/crypto_evp_legacy_md5.c.obj
  1165. 117 error [671/1296] Compiling C object subprojects/openssl-3.0.2/libcrypto.a.p/crypto_evp_legacy_md4.c.obj
  1166. 117 error [672/1296] Compiling C object subprojects/openssl-3.0.2/libcrypto.a.p/crypto_evp_legacy_md5_sha1.c.obj
  1167. 117 error [673/1296] Compiling C object subprojects/openssl-3.0.2/libcrypto.a.p/crypto_evp_m_null.c.obj
  1168. 117 error [674/1296] Compiling C object subprojects/openssl-3.0.2/libcrypto.a.p/crypto_evp_legacy_wp.c.obj
  1169. 117 error [675/1296] Compiling C object subprojects/openssl-3.0.2/libcrypto.a.p/crypto_evp_legacy_sha.c.obj
  1170. 117 error [676/1296] Compiling C object subprojects/openssl-3.0.2/libcrypto.a.p/crypto_evp_legacy_ripemd.c.obj
  1171. 117 error [677/1296] Compiling C object subprojects/openssl-3.0.2/libcrypto.a.p/crypto_evp_names.c.obj
  1172. 117 error [678/1296] Compiling C object subprojects/openssl-3.0.2/libcrypto.a.p/crypto_evp_p_enc.c.obj
  1173. 117 error [679/1296] Compiling C object subprojects/openssl-3.0.2/libcrypto.a.p/crypto_evp_p5_crpt.c.obj
  1174. 117 error [680/1296] Compiling C object subprojects/openssl-3.0.2/libcrypto.a.p/crypto_evp_mac_lib.c.obj
  1175. 117 error [681/1296] Compiling C object subprojects/openssl-3.0.2/libcrypto.a.p/crypto_evp_p5_crpt2.c.obj
  1176. 117 error [682/1296] Compiling C object subprojects/openssl-3.0.2/libcrypto.a.p/crypto_evp_mac_meth.c.obj
  1177. 117 error [683/1296] Compiling C object subprojects/openssl-3.0.2/libcrypto.a.p/crypto_evp_p_dec.c.obj
  1178. 117 error [684/1296] Compiling C object subprojects/openssl-3.0.2/libcrypto.a.p/crypto_evp_p_legacy.c.obj
  1179. 117 error [685/1296] Compiling C object subprojects/openssl-3.0.2/libcrypto.a.p/crypto_evp_pmeth_gn.c.obj
  1180. 117 error [686/1296] Compiling C object subprojects/openssl-3.0.2/libcrypto.a.p/crypto_evp_m_sigver.c.obj
  1181. 117 error [687/1296] Compiling C object subprojects/openssl-3.0.2/libcrypto.a.p/crypto_evp_p_verify.c.obj
  1182. 117 error [688/1296] Compiling C object subprojects/openssl-3.0.2/libcrypto.a.p/crypto_evp_pbe_scrypt.c.obj
  1183. 117 error [689/1296] Compiling C object subprojects/openssl-3.0.2/libcrypto.a.p/crypto_evp_pmeth_check.c.obj
  1184. 117 error [690/1296] Compiling C object subprojects/openssl-3.0.2/libcrypto.a.p/crypto_evp_p_seal.c.obj
  1185. 117 error [691/1296] Compiling C object subprojects/openssl-3.0.2/libcrypto.a.p/crypto_evp_p_lib.c.obj
  1186. 117 error [692/1296] Compiling C object subprojects/openssl-3.0.2/libcrypto.a.p/crypto_evp_pmeth_lib.c.obj
  1187. 117 error [693/1296] Compiling C object subprojects/openssl-3.0.2/libcrypto.a.p/crypto_evp_p_sign.c.obj
  1188. 117 error [694/1296] Compiling C object subprojects/openssl-3.0.2/libcrypto.a.p/crypto_evp_p_open.c.obj
  1189. 117 error [695/1296] Compiling C object subprojects/openssl-3.0.2/libcrypto.a.p/crypto_ffc_ffc_key_validate.c.obj
  1190. 117 error [696/1296] Compiling C object subprojects/openssl-3.0.2/libcrypto.a.p/crypto_ffc_ffc_params_generate.c.obj
  1191. 117 error [697/1296] Compiling C object subprojects/openssl-3.0.2/libcrypto.a.p/crypto_ffc_ffc_dh.c.obj
  1192. 117 error [698/1296] Compiling C object subprojects/openssl-3.0.2/libcrypto.a.p/crypto_evp_signature.c.obj
  1193. 117 error [699/1296] Compiling C object subprojects/openssl-3.0.2/libcrypto.a.p/crypto_ffc_ffc_params_validate.c.obj
  1194. 117 error [700/1296] Compiling C object subprojects/openssl-3.0.2/libcrypto.a.p/crypto_ffc_ffc_params.c.obj
  1195. 117 error [701/1296] Compiling C object subprojects/openssl-3.0.2/libcrypto.a.p/crypto_hmac_hmac.c.obj
  1196. 117 error [702/1296] Compiling C object subprojects/openssl-3.0.2/libcrypto.a.p/crypto_ffc_ffc_backend.c.obj
  1197. 117 error [703/1296] Compiling C object subprojects/openssl-3.0.2/libcrypto.a.p/crypto_ffc_ffc_key_generate.c.obj
  1198. 117 error [704/1296] Compiling C object subprojects/openssl-3.0.2/libcrypto.a.p/crypto_http_http_lib.c.obj
  1199. 117 error [705/1296] Compiling C object subprojects/openssl-3.0.2/libcrypto.a.p/crypto_idea_i_cbc.c.obj
  1200. 117 error [706/1296] Compiling C object subprojects/openssl-3.0.2/libcrypto.a.p/crypto_idea_i_ofb64.c.obj
  1201. 117 error [707/1296] Compiling C object subprojects/openssl-3.0.2/libcrypto.a.p/crypto_lhash_lh_stats.c.obj
  1202. 117 error [708/1296] Compiling C object subprojects/openssl-3.0.2/libcrypto.a.p/crypto_kdf_kdf_err.c.obj
  1203. 117 error [709/1296] Compiling C object subprojects/openssl-3.0.2/libcrypto.a.p/crypto_http_http_err.c.obj
  1204. 117 error [710/1296] Compiling C object subprojects/openssl-3.0.2/libcrypto.a.p/crypto_idea_i_skey.c.obj
  1205. 117 error [711/1296] Compiling C object subprojects/openssl-3.0.2/libcrypto.a.p/crypto_idea_i_ecb.c.obj
  1206. 117 error [712/1296] Compiling C object subprojects/openssl-3.0.2/libcrypto.a.p/crypto_idea_i_cfb64.c.obj
  1207. 117 error [713/1296] Compiling C object subprojects/openssl-3.0.2/libcrypto.a.p/crypto_http_http_client.c.obj
  1208. 117 error [714/1296] Compiling C object subprojects/openssl-3.0.2/libcrypto.a.p/crypto_core_algorithm.c.obj
  1209. 117 error [715/1296] Compiling C object subprojects/openssl-3.0.2/libcrypto.a.p/crypto_core_fetch.c.obj
  1210. 117 error [716/1296] Compiling C object subprojects/openssl-3.0.2/libcrypto.a.p/crypto_lhash_lhash.c.obj
  1211. 117 error [717/1296] Compiling C object subprojects/openssl-3.0.2/libcrypto.a.p/crypto_cpt_err.c.obj
  1212. 117 error [718/1296] Compiling C object subprojects/openssl-3.0.2/libcrypto.a.p/crypto_asn1_dsa.c.obj
  1213. 117 error [719/1296] Compiling C object subprojects/openssl-3.0.2/libcrypto.a.p/crypto_core_namemap.c.obj
  1214. 117 error ../../../subprojects/openssl-3.0.2/crypto/core_namemap.c(261): warning C4133: 'function': incompatible types - from 'volatile int *' to 'volatile LONG64 *'
  1215. 117 error [720/1296] Compiling C object subprojects/openssl-3.0.2/libcrypto.a.p/crypto_bsearch.c.obj
  1216. 117 error [721/1296] Compiling C object subprojects/openssl-3.0.2/libcrypto.a.p/crypto_cpuid.c.obj
  1217. 117 error [722/1296] Compiling C object subprojects/openssl-3.0.2/libcrypto.a.p/crypto_context.c.obj
  1218. 117 error [723/1296] Compiling C object subprojects/openssl-3.0.2/libcrypto.a.p/crypto_ctype.c.obj
  1219. 117 error [724/1296] Compiling C object subprojects/openssl-3.0.2/libcrypto.a.p/crypto_ebcdic.c.obj
  1220. 117 error [725/1296] Compiling C object subprojects/openssl-3.0.2/libcrypto.a.p/crypto_cryptlib.c.obj
  1221. 117 error [726/1296] Compiling C object subprojects/openssl-3.0.2/libcrypto.a.p/crypto_getenv.c.obj
  1222. 117 error [727/1296] Compiling C object subprojects/openssl-3.0.2/libcrypto.a.p/crypto_ex_data.c.obj
  1223. 117 error [728/1296] Compiling C object subprojects/openssl-3.0.2/libcrypto.a.p/crypto_info.c.obj
  1224. 117 error [729/1296] Compiling C object subprojects/openssl-3.0.2/libcrypto.a.p/crypto_init.c.obj
  1225. 117 error [730/1296] Compiling C object subprojects/openssl-3.0.2/libcrypto.a.p/crypto_initthread.c.obj
  1226. 117 error [731/1296] Compiling C object subprojects/openssl-3.0.2/libcrypto.a.p/crypto_cversion.c.obj
  1227. 117 error [732/1296] Compiling C object subprojects/openssl-3.0.2/libcrypto.a.p/crypto_der_writer.c.obj
  1228. 117 error [733/1296] Compiling C object subprojects/openssl-3.0.2/libcrypto.a.p/crypto_o_time.c.obj
  1229. 117 error [734/1296] Compiling C object subprojects/openssl-3.0.2/libcrypto.a.p/crypto_o_fopen.c.obj
  1230. 117 error [735/1296] Compiling C object subprojects/openssl-3.0.2/libcrypto.a.p/crypto_o_dir.c.obj
  1231. 117 error [736/1296] Compiling C object subprojects/openssl-3.0.2/libcrypto.a.p/crypto_o_str.c.obj
  1232. 117 error [737/1296] Compiling C object subprojects/openssl-3.0.2/libcrypto.a.p/crypto_mem_clr.c.obj
  1233. 117 error [738/1296] Compiling C object subprojects/openssl-3.0.2/libcrypto.a.p/crypto_o_init.c.obj
  1234. 117 error [739/1296] Compiling C object subprojects/openssl-3.0.2/libcrypto.a.p/crypto_packet.c.obj
  1235. 117 error [740/1296] Compiling C object subprojects/openssl-3.0.2/libcrypto.a.p/crypto_mem.c.obj
  1236. 117 error [741/1296] Compiling C object subprojects/openssl-3.0.2/libcrypto.a.p/crypto_passphrase.c.obj
  1237. 117 error [742/1296] Compiling C object subprojects/openssl-3.0.2/libcrypto.a.p/crypto_mem_sec.c.obj
  1238. 117 error [743/1296] Compiling C object subprojects/openssl-3.0.2/libcrypto.a.p/crypto_params_from_text.c.obj
  1239. 117 error [744/1296] Compiling C object subprojects/openssl-3.0.2/libcrypto.a.p/crypto_params.c.obj
  1240. 117 error [745/1296] Compiling C object subprojects/openssl-3.0.2/libcrypto.a.p/crypto_provider_child.c.obj
  1241. 117 error [746/1296] Compiling C object subprojects/openssl-3.0.2/libcrypto.a.p/crypto_provider.c.obj
  1242. 117 error [747/1296] Compiling C object subprojects/openssl-3.0.2/libcrypto.a.p/crypto_provider_conf.c.obj
  1243. 117 error [748/1296] Compiling C object subprojects/openssl-3.0.2/libcrypto.a.p/crypto_param_build_set.c.obj
  1244. 117 error [749/1296] Compiling C object subprojects/openssl-3.0.2/libcrypto.a.p/crypto_params_dup.c.obj
  1245. 117 error [750/1296] Compiling C object subprojects/openssl-3.0.2/libcrypto.a.p/crypto_sparse_array.c.obj
  1246. 117 error [751/1296] Compiling C object subprojects/openssl-3.0.2/libcrypto.a.p/crypto_param_build.c.obj
  1247. 117 error [752/1296] Compiling C object subprojects/openssl-3.0.2/libcrypto.a.p/crypto_threads_lib.c.obj
  1248. 117 error [753/1296] Compiling C object subprojects/openssl-3.0.2/libcrypto.a.p/crypto_provider_core.c.obj
  1249. 117 error [754/1296] Compiling C object subprojects/openssl-3.0.2/libcrypto.a.p/crypto_punycode.c.obj
  1250. 117 error [755/1296] Compiling C object subprojects/openssl-3.0.2/libcrypto.a.p/crypto_threads_none.c.obj
  1251. 117 error [756/1296] Compiling C object subprojects/openssl-3.0.2/libcrypto.a.p/crypto_provider_predefined.c.obj
  1252. 117 error [757/1296] Compiling C object subprojects/openssl-3.0.2/libcrypto.a.p/crypto_threads_pthread.c.obj
  1253. 117 error [758/1296] Compiling C object subprojects/openssl-3.0.2/libcrypto.a.p/crypto_self_test_core.c.obj
  1254. 117 error [759/1296] Compiling C object subprojects/openssl-3.0.2/libcrypto.a.p/crypto_threads_win.c.obj
  1255. 117 error [760/1296] Compiling C object subprojects/openssl-3.0.2/libcrypto.a.p/crypto_mdc2_mdc2_one.c.obj
  1256. 117 error [761/1296] Compiling C object subprojects/openssl-3.0.2/libcrypto.a.p/crypto_md4_md4_dgst.c.obj
  1257. 117 error [762/1296] Compiling C object subprojects/openssl-3.0.2/libcrypto.a.p/crypto_md5_md5_one.c.obj
  1258. 117 error [763/1296] Compiling C object subprojects/openssl-3.0.2/libcrypto.a.p/crypto_uid.c.obj
  1259. 117 error [764/1296] Compiling C object subprojects/openssl-3.0.2/libcrypto.a.p/crypto_md4_md4_one.c.obj
  1260. 117 error [765/1296] Compiling C object subprojects/openssl-3.0.2/libcrypto.a.p/crypto_trace.c.obj
  1261. 117 error [766/1296] Compiling C object subprojects/openssl-3.0.2/libcrypto.a.p/crypto_md5_md5_dgst.c.obj
  1262. 117 error [767/1296] Compiling C object subprojects/openssl-3.0.2/libcrypto.a.p/crypto_md5_md5_sha1.c.obj
  1263. 117 error [768/1296] Compiling C object subprojects/openssl-3.0.2/libcrypto.a.p/crypto_modes_ofb128.c.obj
  1264. 117 error [769/1296] Compiling C object subprojects/openssl-3.0.2/libcrypto.a.p/crypto_mdc2_mdc2dgst.c.obj
  1265. 117 error [770/1296] Compiling C object subprojects/openssl-3.0.2/libcrypto.a.p/crypto_modes_cfb128.c.obj
  1266. 117 error [771/1296] Compiling C object subprojects/openssl-3.0.2/libcrypto.a.p/crypto_modes_gcm128.c.obj
  1267. 117 error [772/1296] Compiling C object subprojects/openssl-3.0.2/libcrypto.a.p/crypto_modes_cbc128.c.obj
  1268. 117 error [773/1296] Compiling C object subprojects/openssl-3.0.2/libcrypto.a.p/crypto_modes_ccm128.c.obj
  1269. 117 error [774/1296] Compiling C object subprojects/openssl-3.0.2/libcrypto.a.p/crypto_modes_ctr128.c.obj
  1270. 117 error [775/1296] Compiling C object subprojects/openssl-3.0.2/libcrypto.a.p/crypto_modes_cts128.c.obj
  1271. 117 error [776/1296] Compiling C object subprojects/openssl-3.0.2/libcrypto.a.p/crypto_modes_siv128.c.obj
  1272. 117 error [777/1296] Compiling C object subprojects/openssl-3.0.2/libcrypto.a.p/crypto_modes_ocb128.c.obj
  1273. 117 error [778/1296] Compiling C object subprojects/openssl-3.0.2/libcrypto.a.p/crypto_ocsp_ocsp_asn.c.obj
  1274. 117 error [779/1296] Compiling C object subprojects/openssl-3.0.2/libcrypto.a.p/crypto_objects_obj_xref.c.obj
  1275. 117 error [780/1296] Compiling C object subprojects/openssl-3.0.2/libcrypto.a.p/crypto_modes_wrap128.c.obj
  1276. 117 error [781/1296] Compiling C object subprojects/openssl-3.0.2/libcrypto.a.p/crypto_modes_xts128.c.obj
  1277. 117 error [782/1296] Compiling C object subprojects/openssl-3.0.2/libcrypto.a.p/crypto_objects_obj_lib.c.obj
  1278. 117 error [783/1296] Compiling C object subprojects/openssl-3.0.2/libcrypto.a.p/crypto_objects_obj_err.c.obj
  1279. 117 error [784/1296] Compiling C object subprojects/openssl-3.0.2/libcrypto.a.p/crypto_ocsp_ocsp_cl.c.obj
  1280. 117 error [785/1296] Compiling C object subprojects/openssl-3.0.2/libcrypto.a.p/crypto_objects_obj_dat.c.obj
  1281. 117 error [786/1296] Compiling C object subprojects/openssl-3.0.2/libcrypto.a.p/crypto_ocsp_ocsp_err.c.obj
  1282. 117 error [787/1296] Compiling C object subprojects/openssl-3.0.2/libcrypto.a.p/crypto_ocsp_ocsp_lib.c.obj
  1283. 117 error [788/1296] Compiling C object subprojects/openssl-3.0.2/libcrypto.a.p/crypto_objects_o_names.c.obj
  1284. 117 error [789/1296] Compiling C object subprojects/openssl-3.0.2/libcrypto.a.p/crypto_pem_pem_all.c.obj
  1285. 117 error [790/1296] Compiling C object subprojects/openssl-3.0.2/libcrypto.a.p/crypto_ocsp_ocsp_prn.c.obj
  1286. 117 error [791/1296] Compiling C object subprojects/openssl-3.0.2/libcrypto.a.p/crypto_pem_pem_err.c.obj
  1287. 117 error [792/1296] Compiling C object subprojects/openssl-3.0.2/libcrypto.a.p/crypto_ocsp_v3_ocsp.c.obj
  1288. 117 error [793/1296] Compiling C object subprojects/openssl-3.0.2/libcrypto.a.p/crypto_ocsp_ocsp_ext.c.obj
  1289. 117 error [794/1296] Compiling C object subprojects/openssl-3.0.2/libcrypto.a.p/crypto_pem_pem_info.c.obj
  1290. 117 error [795/1296] Compiling C object subprojects/openssl-3.0.2/libcrypto.a.p/crypto_ocsp_ocsp_vfy.c.obj
  1291. 117 error [796/1296] Compiling C object subprojects/openssl-3.0.2/libcrypto.a.p/crypto_ocsp_ocsp_http.c.obj
  1292. 117 error [797/1296] Compiling C object subprojects/openssl-3.0.2/libcrypto.a.p/crypto_ocsp_ocsp_srv.c.obj
  1293. 117 error [798/1296] Compiling C object subprojects/openssl-3.0.2/libcrypto.a.p/crypto_pem_pem_lib.c.obj
  1294. 117 error [799/1296] Compiling C object subprojects/openssl-3.0.2/libcrypto.a.p/crypto_pem_pem_pkey.c.obj
  1295. 117 error [800/1296] Compiling C object subprojects/openssl-3.0.2/libcrypto.a.p/crypto_pem_pem_pk8.c.obj
  1296. 117 error [801/1296] Compiling C object subprojects/openssl-3.0.2/libcrypto.a.p/crypto_pem_pem_xaux.c.obj
  1297. 117 error [802/1296] Compiling C object subprojects/openssl-3.0.2/libcrypto.a.p/crypto_pem_pem_sign.c.obj
  1298. 117 error [803/1296] Compiling C object subprojects/openssl-3.0.2/libcrypto.a.p/crypto_pem_pem_x509.c.obj
  1299. 117 error [804/1296] Compiling C object subprojects/openssl-3.0.2/libcrypto.a.p/crypto_pkcs12_p12_add.c.obj
  1300. 117 error [805/1296] Compiling C object subprojects/openssl-3.0.2/libcrypto.a.p/crypto_pem_pvkfmt.c.obj
  1301. 117 error [806/1296] Compiling C object subprojects/openssl-3.0.2/libcrypto.a.p/crypto_pem_pem_oth.c.obj
  1302. 117 error [807/1296] Compiling C object subprojects/openssl-3.0.2/libcrypto.a.p/crypto_pkcs12_p12_decr.c.obj
  1303. 117 error [808/1296] Compiling C object subprojects/openssl-3.0.2/libcrypto.a.p/crypto_pkcs12_p12_crpt.c.obj
  1304. 117 error [809/1296] Compiling C object subprojects/openssl-3.0.2/libcrypto.a.p/crypto_pkcs12_p12_init.c.obj
  1305. 117 error [810/1296] Compiling C object subprojects/openssl-3.0.2/libcrypto.a.p/crypto_pkcs12_p12_kiss.c.obj
  1306. 117 error [811/1296] Compiling C object subprojects/openssl-3.0.2/libcrypto.a.p/crypto_pkcs12_p12_crt.c.obj
  1307. 117 error [812/1296] Compiling C object subprojects/openssl-3.0.2/libcrypto.a.p/crypto_pkcs12_p12_key.c.obj
  1308. 117 error [813/1296] Compiling C object subprojects/openssl-3.0.2/libcrypto.a.p/crypto_pkcs12_p12_attr.c.obj
  1309. 117 error [814/1296] Compiling C object subprojects/openssl-3.0.2/libcrypto.a.p/crypto_pkcs12_p12_mutl.c.obj
  1310. 117 error [815/1296] Compiling C object subprojects/openssl-3.0.2/libcrypto.a.p/crypto_pkcs12_p12_asn.c.obj
  1311. 117 error [816/1296] Compiling C object subprojects/openssl-3.0.2/libcrypto.a.p/crypto_pkcs7_bio_pk7.c.obj
  1312. 117 error [817/1296] Compiling C object subprojects/openssl-3.0.2/libcrypto.a.p/crypto_pkcs7_pk7_asn1.c.obj
  1313. 117 error [818/1296] Compiling C object subprojects/openssl-3.0.2/libcrypto.a.p/crypto_pkcs7_pk7_attr.c.obj
  1314. 117 error [819/1296] Compiling C object subprojects/openssl-3.0.2/libcrypto.a.p/crypto_pkcs12_pk12err.c.obj
  1315. 117 error [820/1296] Compiling C object subprojects/openssl-3.0.2/libcrypto.a.p/crypto_pkcs12_p12_sbag.c.obj
  1316. 117 error [821/1296] Compiling C object subprojects/openssl-3.0.2/libcrypto.a.p/crypto_pkcs12_p12_npas.c.obj
  1317. 117 error [822/1296] Compiling C object subprojects/openssl-3.0.2/libcrypto.a.p/crypto_pkcs12_p12_p8d.c.obj
  1318. 117 error [823/1296] Compiling C object subprojects/openssl-3.0.2/libcrypto.a.p/crypto_pkcs12_p12_p8e.c.obj
  1319. 117 error [824/1296] Compiling C object subprojects/openssl-3.0.2/libcrypto.a.p/crypto_pkcs12_p12_utl.c.obj
  1320. 117 error [825/1296] Compiling C object subprojects/openssl-3.0.2/libcrypto.a.p/crypto_property_defn_cache.c.obj
  1321. 117 error [826/1296] Compiling C object subprojects/openssl-3.0.2/libcrypto.a.p/crypto_property_property_err.c.obj
  1322. 117 error [827/1296] Compiling C object subprojects/openssl-3.0.2/libcrypto.a.p/crypto_pkcs7_pk7_lib.c.obj
  1323. 117 error [828/1296] Compiling C object subprojects/openssl-3.0.2/libcrypto.a.p/crypto_pkcs7_pkcs7err.c.obj
  1324. 117 error [829/1296] Compiling C object subprojects/openssl-3.0.2/libcrypto.a.p/crypto_property_property.c.obj
  1325. 117 error [830/1296] Compiling C object subprojects/openssl-3.0.2/libcrypto.a.p/crypto_pkcs7_pk7_smime.c.obj
  1326. 117 error [831/1296] Compiling C object subprojects/openssl-3.0.2/libcrypto.a.p/crypto_pkcs7_pk7_mime.c.obj
  1327. 117 error [832/1296] Compiling C object subprojects/openssl-3.0.2/libcrypto.a.p/crypto_pkcs7_pk7_doit.c.obj
  1328. 117 error [833/1296] Compiling C object subprojects/openssl-3.0.2/libcrypto.a.p/crypto_poly1305_poly1305.c.obj
  1329. 117 error [834/1296] Compiling C object subprojects/openssl-3.0.2/libcrypto.a.p/crypto_rand_rand_meth.c.obj
  1330. 117 error [835/1296] Compiling C object subprojects/openssl-3.0.2/libcrypto.a.p/crypto_property_property_query.c.obj
  1331. 117 error [836/1296] Compiling C object subprojects/openssl-3.0.2/libcrypto.a.p/crypto_rand_prov_seed.c.obj
  1332. 117 error [837/1296] Compiling C object subprojects/openssl-3.0.2/libcrypto.a.p/crypto_property_property_string.c.obj
  1333. 117 error [838/1296] Compiling C object subprojects/openssl-3.0.2/libcrypto.a.p/crypto_rand_rand_err.c.obj
  1334. 117 error [839/1296] Compiling C object subprojects/openssl-3.0.2/libcrypto.a.p/crypto_property_property_parse.c.obj
  1335. 117 error [840/1296] Compiling C object subprojects/openssl-3.0.2/libcrypto.a.p/crypto_rand_rand_deprecated.c.obj
  1336. 117 error [841/1296] Compiling C object subprojects/openssl-3.0.2/libcrypto.a.p/crypto_rand_rand_pool.c.obj
  1337. 117 error [842/1296] Compiling C object subprojects/openssl-3.0.2/libcrypto.a.p/crypto_rc2_rc2cfb64.c.obj
  1338. 117 error [843/1296] Compiling C object subprojects/openssl-3.0.2/libcrypto.a.p/crypto_rand_rand_lib.c.obj
  1339. 117 error [844/1296] Compiling C object subprojects/openssl-3.0.2/libcrypto.a.p/crypto_rc2_rc2_skey.c.obj
  1340. 117 error [845/1296] Compiling C object subprojects/openssl-3.0.2/libcrypto.a.p/crypto_rc2_rc2_cbc.c.obj
  1341. 117 error [846/1296] Compiling C object subprojects/openssl-3.0.2/libcrypto.a.p/crypto_rand_randfile.c.obj
  1342. 117 error [847/1296] Compiling C object subprojects/openssl-3.0.2/libcrypto.a.p/crypto_rc2_rc2ofb64.c.obj
  1343. 117 error [848/1296] Compiling C object subprojects/openssl-3.0.2/libcrypto.a.p/crypto_rc2_rc2_ecb.c.obj
  1344. 117 error [849/1296] Compiling C object subprojects/openssl-3.0.2/libcrypto.a.p/crypto_rsa_rsa_crpt.c.obj
  1345. 117 error [850/1296] Compiling C object subprojects/openssl-3.0.2/libcrypto.a.p/crypto_rc4_rc4_skey.c.obj
  1346. 117 error [851/1296] Compiling C object subprojects/openssl-3.0.2/libcrypto.a.p/crypto_rc4_rc4_enc.c.obj
  1347. 117 error [852/1296] Compiling C object subprojects/openssl-3.0.2/libcrypto.a.p/crypto_ripemd_rmd_one.c.obj
  1348. 117 error [853/1296] Compiling C object subprojects/openssl-3.0.2/libcrypto.a.p/crypto_ripemd_rmd_dgst.c.obj
  1349. 117 error [854/1296] Compiling C object subprojects/openssl-3.0.2/libcrypto.a.p/crypto_rsa_rsa_gen.c.obj
  1350. 117 error [855/1296] Compiling C object subprojects/openssl-3.0.2/libcrypto.a.p/crypto_rsa_rsa_ameth.c.obj
  1351. 117 error [856/1296] Compiling C object subprojects/openssl-3.0.2/libcrypto.a.p/crypto_rsa_rsa_chk.c.obj
  1352. 117 error [857/1296] Compiling C object subprojects/openssl-3.0.2/libcrypto.a.p/crypto_rsa_rsa_depr.c.obj
  1353. 117 error [858/1296] Compiling C object subprojects/openssl-3.0.2/libcrypto.a.p/crypto_rsa_rsa_asn1.c.obj
  1354. 117 error [859/1296] Compiling C object subprojects/openssl-3.0.2/libcrypto.a.p/crypto_rsa_rsa_err.c.obj
  1355. 117 error [860/1296] Compiling C object subprojects/openssl-3.0.2/libcrypto.a.p/crypto_rsa_rsa_mp.c.obj
  1356. 117 error [861/1296] Compiling C object subprojects/openssl-3.0.2/libcrypto.a.p/crypto_rsa_rsa_meth.c.obj
  1357. 117 error [862/1296] Compiling C object subprojects/openssl-3.0.2/libcrypto.a.p/crypto_rsa_rsa_pk1.c.obj
  1358. 117 error [863/1296] Compiling C object subprojects/openssl-3.0.2/libcrypto.a.p/crypto_rsa_rsa_backend.c.obj
  1359. 117 error [864/1296] Compiling C object subprojects/openssl-3.0.2/libcrypto.a.p/crypto_rsa_rsa_oaep.c.obj
  1360. 117 error [865/1296] Compiling C object subprojects/openssl-3.0.2/libcrypto.a.p/crypto_rsa_rsa_mp_names.c.obj
  1361. 117 error [866/1296] Compiling C object subprojects/openssl-3.0.2/libcrypto.a.p/crypto_rsa_rsa_pmeth.c.obj
  1362. 117 error [867/1296] Compiling C object subprojects/openssl-3.0.2/libcrypto.a.p/crypto_rsa_rsa_ossl.c.obj
  1363. 117 error [868/1296] Compiling C object subprojects/openssl-3.0.2/libcrypto.a.p/crypto_rsa_rsa_none.c.obj
  1364. 117 error [869/1296] Compiling C object subprojects/openssl-3.0.2/libcrypto.a.p/crypto_rsa_rsa_prn.c.obj
  1365. 117 error [870/1296] Compiling C object subprojects/openssl-3.0.2/libcrypto.a.p/crypto_rsa_rsa_sp800_56b_gen.c.obj
  1366. 117 error [871/1296] Compiling C object subprojects/openssl-3.0.2/libcrypto.a.p/crypto_rsa_rsa_sign.c.obj
  1367. 117 error [872/1296] Compiling C object subprojects/openssl-3.0.2/libcrypto.a.p/crypto_rsa_rsa_lib.c.obj
  1368. 117 error [873/1296] Compiling C object subprojects/openssl-3.0.2/libcrypto.a.p/crypto_rsa_rsa_schemes.c.obj
  1369. 117 error [874/1296] Compiling C object subprojects/openssl-3.0.2/libcrypto.a.p/crypto_rsa_rsa_x931g.c.obj
  1370. 117 error [875/1296] Compiling C object subprojects/openssl-3.0.2/libcrypto.a.p/crypto_seed_seed.c.obj
  1371. 117 error [876/1296] Compiling C object subprojects/openssl-3.0.2/libcrypto.a.p/crypto_rsa_rsa_saos.c.obj
  1372. 117 error [877/1296] Compiling C object subprojects/openssl-3.0.2/libcrypto.a.p/crypto_rsa_rsa_sp800_56b_check.c.obj
  1373. 117 error [878/1296] Compiling C object subprojects/openssl-3.0.2/libcrypto.a.p/crypto_rsa_rsa_x931.c.obj
  1374. 117 error [879/1296] Compiling C object subprojects/openssl-3.0.2/libcrypto.a.p/crypto_rsa_rsa_pss.c.obj
  1375. 117 error [880/1296] Compiling C object subprojects/openssl-3.0.2/libcrypto.a.p/crypto_seed_seed_ecb.c.obj
  1376. 117 error [881/1296] Compiling C object subprojects/openssl-3.0.2/libcrypto.a.p/crypto_seed_seed_ofb.c.obj
  1377. 117 error [882/1296] Compiling C object subprojects/openssl-3.0.2/libcrypto.a.p/crypto_sha_keccak1600.c.obj
  1378. 117 error [883/1296] Compiling C object subprojects/openssl-3.0.2/libcrypto.a.p/crypto_seed_seed_cbc.c.obj
  1379. 117 error [884/1296] Compiling C object subprojects/openssl-3.0.2/libcrypto.a.p/crypto_sha_sha3.c.obj
  1380. 117 error [885/1296] Compiling C object subprojects/openssl-3.0.2/libcrypto.a.p/crypto_sha_sha1_one.c.obj
  1381. 117 error [886/1296] Compiling C object subprojects/openssl-3.0.2/libcrypto.a.p/crypto_seed_seed_cfb.c.obj
  1382. 117 error [887/1296] Compiling C object subprojects/openssl-3.0.2/libcrypto.a.p/crypto_sm3_legacy_sm3.c.obj
  1383. 117 error [888/1296] Compiling C object subprojects/openssl-3.0.2/libcrypto.a.p/crypto_sm2_sm2_crypt.c.obj
  1384. 117 error [889/1296] Compiling C object subprojects/openssl-3.0.2/libcrypto.a.p/crypto_sha_sha1dgst.c.obj
  1385. 117 error [890/1296] Compiling C object subprojects/openssl-3.0.2/libcrypto.a.p/crypto_sha_sha256.c.obj
  1386. 117 error [891/1296] Compiling C object subprojects/openssl-3.0.2/libcrypto.a.p/crypto_sm4_sm4.c.obj
  1387. 117 error [892/1296] Compiling C object subprojects/openssl-3.0.2/libcrypto.a.p/crypto_srp_srp_lib.c.obj
  1388. 117 error [893/1296] Compiling C object subprojects/openssl-3.0.2/libcrypto.a.p/crypto_sm2_sm2_err.c.obj
  1389. 117 error [894/1296] Compiling C object subprojects/openssl-3.0.2/libcrypto.a.p/crypto_sm2_sm2_key.c.obj
  1390. 117 error [895/1296] Compiling C object subprojects/openssl-3.0.2/libcrypto.a.p/crypto_sm2_sm2_sign.c.obj
  1391. 117 error [896/1296] Compiling C object subprojects/openssl-3.0.2/libcrypto.a.p/crypto_siphash_siphash.c.obj
  1392. 117 error [897/1296] Compiling C object subprojects/openssl-3.0.2/libcrypto.a.p/crypto_store_store_meth.c.obj
  1393. 117 error [898/1296] Compiling C object subprojects/openssl-3.0.2/libcrypto.a.p/crypto_store_store_err.c.obj
  1394. 117 error [899/1296] Compiling C object subprojects/openssl-3.0.2/libcrypto.a.p/crypto_store_store_register.c.obj
  1395. 117 error [900/1296] Compiling C object subprojects/openssl-3.0.2/libcrypto.a.p/crypto_store_store_init.c.obj
  1396. 117 error [901/1296] Compiling C object subprojects/openssl-3.0.2/libcrypto.a.p/crypto_sha_sha512.c.obj
  1397. 117 error [902/1296] Compiling C object subprojects/openssl-3.0.2/libcrypto.a.p/crypto_sm3_sm3.c.obj
  1398. 117 error [903/1296] Compiling C object subprojects/openssl-3.0.2/libcrypto.a.p/crypto_store_store_strings.c.obj
  1399. 117 error [904/1296] Compiling C object subprojects/openssl-3.0.2/libcrypto.a.p/crypto_store_store_result.c.obj
  1400. 117 error [905/1296] Compiling C object subprojects/openssl-3.0.2/libcrypto.a.p/crypto_stack_stack.c.obj
  1401. 117 error [906/1296] Compiling C object subprojects/openssl-3.0.2/libcrypto.a.p/crypto_srp_srp_vfy.c.obj
  1402. 117 error [907/1296] Compiling C object subprojects/openssl-3.0.2/libcrypto.a.p/crypto_ts_ts_lib.c.obj
  1403. 117 error [908/1296] Compiling C object subprojects/openssl-3.0.2/libcrypto.a.p/crypto_ts_ts_req_print.c.obj
  1404. 117 error [909/1296] Compiling C object subprojects/openssl-3.0.2/libcrypto.a.p/crypto_store_store_lib.c.obj
  1405. 117 error [910/1296] Compiling C object subprojects/openssl-3.0.2/libcrypto.a.p/crypto_ts_ts_rsp_utils.c.obj
  1406. 117 error [911/1296] Compiling C object subprojects/openssl-3.0.2/libcrypto.a.p/crypto_ts_ts_err.c.obj
  1407. 117 error [912/1296] Compiling C object subprojects/openssl-3.0.2/libcrypto.a.p/crypto_ts_ts_req_utils.c.obj
  1408. 117 error [913/1296] Compiling C object subprojects/openssl-3.0.2/libcrypto.a.p/crypto_ts_ts_rsp_sign.c.obj
  1409. 117 error [914/1296] Compiling C object subprojects/openssl-3.0.2/libcrypto.a.p/crypto_ts_ts_rsp_print.c.obj
  1410. 117 error [915/1296] Compiling C object subprojects/openssl-3.0.2/libcrypto.a.p/crypto_ts_ts_conf.c.obj
  1411. 117 error [916/1296] Compiling C object subprojects/openssl-3.0.2/libcrypto.a.p/crypto_ts_ts_asn1.c.obj
  1412. 117 error [917/1296] Compiling C object subprojects/openssl-3.0.2/libcrypto.a.p/crypto_ui_ui_util.c.obj
  1413. 117 error [918/1296] Compiling C object subprojects/openssl-3.0.2/libcrypto.a.p/crypto_txt_db_txt_db.c.obj
  1414. 117 error [919/1296] Compiling C object subprojects/openssl-3.0.2/libcrypto.a.p/crypto_ui_ui_err.c.obj
  1415. 117 error [920/1296] Compiling C object subprojects/openssl-3.0.2/libcrypto.a.p/crypto_whrlpool_wp_block.c.obj
  1416. 117 error [921/1296] Compiling C object subprojects/openssl-3.0.2/libcrypto.a.p/crypto_ui_ui_null.c.obj
  1417. 117 error [922/1296] Compiling C object subprojects/openssl-3.0.2/libcrypto.a.p/crypto_ts_ts_verify_ctx.c.obj
  1418. 117 error [923/1296] Compiling C object subprojects/openssl-3.0.2/libcrypto.a.p/crypto_ui_ui_lib.c.obj
  1419. 117 error [924/1296] Compiling C object subprojects/openssl-3.0.2/libcrypto.a.p/crypto_whrlpool_wp_dgst.c.obj
  1420. 117 error [925/1296] Compiling C object subprojects/openssl-3.0.2/libcrypto.a.p/crypto_ts_ts_rsp_verify.c.obj
  1421. 117 error [926/1296] Compiling C object subprojects/openssl-3.0.2/libcrypto.a.p/crypto_x509_pcy_cache.c.obj
  1422. 117 error [927/1296] Compiling C object subprojects/openssl-3.0.2/libcrypto.a.p/crypto_x509_by_file.c.obj
  1423. 117 error [928/1296] Compiling C object subprojects/openssl-3.0.2/libcrypto.a.p/crypto_x509_pcy_lib.c.obj
  1424. 117 error [929/1296] Compiling C object subprojects/openssl-3.0.2/libcrypto.a.p/crypto_x509_pcy_map.c.obj
  1425. 117 error [930/1296] Compiling C object subprojects/openssl-3.0.2/libcrypto.a.p/crypto_x509_by_store.c.obj
  1426. 117 error [931/1296] Compiling C object subprojects/openssl-3.0.2/libcrypto.a.p/crypto_ui_ui_openssl.c.obj
  1427. 117 error [932/1296] Compiling C object subprojects/openssl-3.0.2/libcrypto.a.p/crypto_x509_pcy_node.c.obj
  1428. 117 error [933/1296] Compiling C object subprojects/openssl-3.0.2/libcrypto.a.p/crypto_x509_by_dir.c.obj
  1429. 117 error [934/1296] Compiling C object subprojects/openssl-3.0.2/libcrypto.a.p/crypto_x509_pcy_data.c.obj
  1430. 117 error [935/1296] Compiling C object subprojects/openssl-3.0.2/libcrypto.a.p/crypto_x509_t_req.c.obj
  1431. 117 error [936/1296] Compiling C object subprojects/openssl-3.0.2/libcrypto.a.p/crypto_x509_v3_addr.c.obj
  1432. 117 error [937/1296] Compiling C object subprojects/openssl-3.0.2/libcrypto.a.p/crypto_x509_t_x509.c.obj
  1433. 117 error [938/1296] Compiling C object subprojects/openssl-3.0.2/libcrypto.a.p/crypto_x509_t_crl.c.obj
  1434. 117 error [939/1296] Compiling C object subprojects/openssl-3.0.2/libcrypto.a.p/crypto_x509_v3_akeya.c.obj
  1435. 117 error [940/1296] Compiling C object subprojects/openssl-3.0.2/libcrypto.a.p/crypto_x509_v3_admis.c.obj
  1436. 117 error [941/1296] Compiling C object subprojects/openssl-3.0.2/libcrypto.a.p/crypto_x509_v3_asid.c.obj
  1437. 117 error [942/1296] Compiling C object subprojects/openssl-3.0.2/libcrypto.a.p/crypto_x509_v3_akid.c.obj
  1438. 117 error [943/1296] Compiling C object subprojects/openssl-3.0.2/libcrypto.a.p/crypto_x509_pcy_tree.c.obj
  1439. 117 error [944/1296] Compiling C object subprojects/openssl-3.0.2/libcrypto.a.p/crypto_x509_v3_bcons.c.obj
  1440. 117 error [945/1296] Compiling C object subprojects/openssl-3.0.2/libcrypto.a.p/crypto_x509_v3_genn.c.obj
  1441. 117 error [946/1296] Compiling C object subprojects/openssl-3.0.2/libcrypto.a.p/crypto_x509_v3_cpols.c.obj
  1442. 117 error [947/1296] Compiling C object subprojects/openssl-3.0.2/libcrypto.a.p/crypto_x509_v3_bitst.c.obj
  1443. 117 error [948/1296] Compiling C object subprojects/openssl-3.0.2/libcrypto.a.p/crypto_x509_v3_extku.c.obj
  1444. 117 error [949/1296] Compiling C object subprojects/openssl-3.0.2/libcrypto.a.p/crypto_x509_v3_ia5.c.obj
  1445. 117 error [950/1296] Compiling C object subprojects/openssl-3.0.2/libcrypto.a.p/crypto_x509_v3_crld.c.obj
  1446. 117 error [951/1296] Compiling C object subprojects/openssl-3.0.2/libcrypto.a.p/crypto_x509_v3_conf.c.obj
  1447. 117 error [952/1296] Compiling C object subprojects/openssl-3.0.2/libcrypto.a.p/crypto_x509_v3_enum.c.obj
  1448. 117 error [953/1296] Compiling C object subprojects/openssl-3.0.2/libcrypto.a.p/crypto_x509_v3_info.c.obj
  1449. 117 error [954/1296] Compiling C++ object subprojects/abseil-cpp-20211102.0/libabsl_hash.a.p/absl_hash_internal_low_level_hash.cc.obj
  1450. 117 error [955/1296] Compiling C++ object subprojects/abseil-cpp-20211102.0/libabsl_hash.a.p/absl_hash_internal_city.cc.obj
  1451. 117 error [956/1296] Compiling C++ object subprojects/abseil-cpp-20211102.0/libabsl_numeric.a.p/absl_numeric_int128.cc.obj
  1452. 117 error [957/1296] Linking static target subprojects/abseil-cpp-20211102.0/libabsl_numeric.a
  1453. 117 error [958/1296] Compiling C++ object subprojects/abseil-cpp-20211102.0/libabsl_hash.a.p/absl_hash_internal_hash.cc.obj
  1454. 117 error [959/1296] Compiling C object subprojects/libuv-v1.43.0/libuv.a.p/src_inet.c.obj
  1455. 117 error [960/1296] Linking static target subprojects/openssl-3.0.2/libcrypto.a
  1456. 117 error [961/1296] Compiling C++ object subprojects/abseil-cpp-20211102.0/libabsl_base.a.p/absl_base_log_severity.cc.obj
  1457. 117 error [962/1296] Linking static target subprojects/abseil-cpp-20211102.0/libabsl_hash.a
  1458. 117 error [963/1296] Compiling C object subprojects/libuv-v1.43.0/libuv.a.p/src_strscpy.c.obj
  1459. 117 error [964/1296] Compiling C object subprojects/libuv-v1.43.0/libuv.a.p/src_random.c.obj
  1460. 117 error [965/1296] Compiling C object subprojects/libuv-v1.43.0/libuv.a.p/src_threadpool.c.obj
  1461. 117 error [966/1296] Compiling C object subprojects/libuv-v1.43.0/libuv.a.p/src_uv-data-getter-setters.c.obj
  1462. 117 error [967/1296] Compiling C object subprojects/libuv-v1.43.0/libuv.a.p/src_timer.c.obj
  1463. 117 error [968/1296] Compiling C object subprojects/libuv-v1.43.0/libuv.a.p/src_fs-poll.c.obj
  1464. 117 error [969/1296] Compiling C object subprojects/libuv-v1.43.0/libuv.a.p/src_idna.c.obj
  1465. 117 error [970/1296] Compiling C object subprojects/libuv-v1.43.0/libuv.a.p/src_win_dl.c.obj
  1466. 117 error [971/1296] Compiling C object subprojects/libuv-v1.43.0/libuv.a.p/src_win_error.c.obj
  1467. 117 error [972/1296] Compiling C object subprojects/libuv-v1.43.0/libuv.a.p/src_uv-common.c.obj
  1468. 117 error [973/1296] Compiling C object subprojects/libuv-v1.43.0/libuv.a.p/src_win_detect-wakeup.c.obj
  1469. 117 error [974/1296] Compiling C object subprojects/libuv-v1.43.0/libuv.a.p/src_win_core.c.obj
  1470. 117 error [975/1296] Compiling C object subprojects/libuv-v1.43.0/libuv.a.p/src_win_fs.c.obj
  1471. 117 error [976/1296] Compiling C object subprojects/libuv-v1.43.0/libuv.a.p/src_version.c.obj
  1472. 117 error [977/1296] Compiling C object subprojects/libuv-v1.43.0/libuv.a.p/src_win_fs-event.c.obj
  1473. 117 error [978/1296] Compiling C object subprojects/libuv-v1.43.0/libuv.a.p/src_win_async.c.obj
  1474. 117 error [979/1296] Compiling C object subprojects/libuv-v1.43.0/libuv.a.p/src_win_getnameinfo.c.obj
  1475. 117 error [980/1296] Compiling C object subprojects/libuv-v1.43.0/libuv.a.p/src_win_loop-watcher.c.obj
  1476. 117 error [981/1296] Compiling C object subprojects/libuv-v1.43.0/libuv.a.p/src_win_process.c.obj
  1477. 117 error [982/1296] Compiling C object subprojects/libuv-v1.43.0/libuv.a.p/src_win_process-stdio.c.obj
  1478. 117 error [983/1296] Compiling C object subprojects/libuv-v1.43.0/libuv.a.p/src_win_poll.c.obj
  1479. 117 error [984/1296] Compiling C object subprojects/libuv-v1.43.0/libuv.a.p/src_win_handle.c.obj
  1480. 117 error [985/1296] Compiling C object subprojects/libuv-v1.43.0/libuv.a.p/src_win_thread.c.obj
  1481. 117 error [986/1296] Compiling C object subprojects/libuv-v1.43.0/libuv.a.p/src_win_pipe.c.obj
  1482. 117 error [987/1296] Compiling C object subprojects/libuv-v1.43.0/libuv.a.p/src_win_getaddrinfo.c.obj
  1483. 117 error [988/1296] Compiling C object subprojects/libuv-v1.43.0/libuv.a.p/src_win_winapi.c.obj
  1484. 117 error [989/1296] Compiling C object subprojects/libuv-v1.43.0/libuv.a.p/src_win_winsock.c.obj
  1485. 117 error [990/1296] Compiling C object subprojects/libuv-v1.43.0/libuv.a.p/src_win_snprintf.c.obj
  1486. 117 error [991/1296] Compiling C object subprojects/libuv-v1.43.0/libuv.a.p/src_win_udp.c.obj
  1487. 117 error ../../../subprojects/libuv-v1.43.0/src/win/udp.c(1090): warning C4133: 'function': incompatible types - from 'sockaddr_storage *' to 'const sockaddr *'
  1488. 117 error [992/1296] Compiling C object subprojects/libuv-v1.43.0/libuv.a.p/src_win_stream.c.obj
  1489. 117 error [993/1296] Compiling C object subprojects/libuv-v1.43.0/libuv.a.p/src_win_util.c.obj
  1490. 117 error [994/1296] Compiling C object subprojects/libuv-v1.43.0/libuv.a.p/src_win_tty.c.obj
  1491. 117 error [995/1296] Compiling C object subprojects/libuv-v1.43.0/libuv.a.p/src_win_tcp.c.obj
  1492. 117 error [996/1296] Compiling C object subprojects/libuv-v1.43.0/libuv.a.p/src_win_signal.c.obj
  1493. 117 error [997/1296] Compiling C object subprojects/libsrtp-2.4.2/libsrtp2.a.p/crypto_hash_null_auth.c.obj
  1494. 117 error [998/1296] Linking static target subprojects/libuv-v1.43.0/libuv.a
  1495. 117 error [999/1296] Compiling C object subprojects/libsrtp-2.4.2/libsrtp2.a.p/crypto_cipher_aes_gcm_ossl.c.obj
  1496. 117 error [1000/1296] Compiling C object subprojects/libsrtp-2.4.2/libsrtp2.a.p/srtp_srtp.c.obj
  1497. 117 error [1001/1296] Compiling C object subprojects/libsrtp-2.4.2/libsrtp2.a.p/crypto_cipher_aes_icm_ossl.c.obj
  1498. 117 error [1002/1296] Compiling C object subprojects/libsrtp-2.4.2/libsrtp2.a.p/crypto_cipher_cipher_test_cases.c.obj
  1499. 117 error [1003/1296] Compiling C object subprojects/libsrtp-2.4.2/libsrtp2.a.p/crypto_hash_auth_test_cases.c.obj
  1500. 117 error [1004/1296] Compiling C object subprojects/libsrtp-2.4.2/libsrtp2.a.p/crypto_hash_auth.c.obj
  1501. 117 error [1005/1296] Compiling C object subprojects/libsrtp-2.4.2/libsrtp2.a.p/crypto_cipher_null_cipher.c.obj
  1502. 117 error [1006/1296] Compiling C object subprojects/libsrtp-2.4.2/libsrtp2.a.p/crypto_kernel_crypto_kernel.c.obj
  1503. 117 error [1007/1296] Compiling C object subprojects/libsrtp-2.4.2/libsrtp2.a.p/crypto_cipher_cipher.c.obj
  1504. 117 error [1008/1296] Compiling C object subprojects/libsrtp-2.4.2/libsrtp2.a.p/crypto_hash_hmac_ossl.c.obj
  1505. 117 error [1009/1296] Compiling C object subprojects/libsrtp-2.4.2/libsrtp2.a.p/crypto_kernel_err.c.obj
  1506. 117 error [1010/1296] Compiling C object subprojects/libsrtp-2.4.2/libsrtp2.a.p/crypto_kernel_key.c.obj
  1507. 117 error [1011/1296] Compiling C object subprojects/libsrtp-2.4.2/libsrtp2.a.p/crypto_replay_rdbx.c.obj
  1508. 117 error [1012/1296] Compiling C object subprojects/usrsctp-4e06feb01cadcd127d119486b98a4bd3d64aa1e7/libusrsctp.a.p/usrsctplib_user_environment.c.obj
  1509. 117 error [1013/1296] Compiling C object subprojects/libsrtp-2.4.2/libsrtp2.a.p/crypto_kernel_alloc.c.obj
  1510. 117 error [1014/1296] Compiling C object subprojects/libsrtp-2.4.2/libsrtp2.a.p/crypto_replay_rdb.c.obj
  1511. 117 error [1015/1296] Compiling C object subprojects/libsrtp-2.4.2/libsrtp2.a.p/crypto_math_datatypes.c.obj
  1512. 117 error [1016/1296] Linking static target subprojects/libsrtp-2.4.2/libsrtp2.a
  1513. 117 error [1017/1296] Compiling C object subprojects/usrsctp-4e06feb01cadcd127d119486b98a4bd3d64aa1e7/libusrsctp.a.p/usrsctplib_netinet_sctp_auth.c.obj
  1514. 117 error [1018/1296] Compiling C object subprojects/usrsctp-4e06feb01cadcd127d119486b98a4bd3d64aa1e7/libusrsctp.a.p/usrsctplib_user_recv_thread.c.obj
  1515. 117 error [1019/1296] Compiling C object subprojects/usrsctp-4e06feb01cadcd127d119486b98a4bd3d64aa1e7/libusrsctp.a.p/usrsctplib_netinet_sctp_bsd_addr.c.obj
  1516. 117 error [1020/1296] Compiling C object subprojects/usrsctp-4e06feb01cadcd127d119486b98a4bd3d64aa1e7/libusrsctp.a.p/usrsctplib_netinet_sctp_callout.c.obj
  1517. 117 error [1021/1296] Compiling C object subprojects/usrsctp-4e06feb01cadcd127d119486b98a4bd3d64aa1e7/libusrsctp.a.p/usrsctplib_user_socket.c.obj
  1518. 117 error [1022/1296] Compiling C object subprojects/usrsctp-4e06feb01cadcd127d119486b98a4bd3d64aa1e7/libusrsctp.a.p/usrsctplib_netinet_sctp_asconf.c.obj
  1519. 117 error [1023/1296] Compiling C object subprojects/usrsctp-4e06feb01cadcd127d119486b98a4bd3d64aa1e7/libusrsctp.a.p/usrsctplib_netinet_sctp_cc_functions.c.obj
  1520. 117 error [1024/1296] Compiling C object subprojects/usrsctp-4e06feb01cadcd127d119486b98a4bd3d64aa1e7/libusrsctp.a.p/usrsctplib_netinet_sctp_peeloff.c.obj
  1521. 117 error [1025/1296] Compiling C object subprojects/usrsctp-4e06feb01cadcd127d119486b98a4bd3d64aa1e7/libusrsctp.a.p/usrsctplib_user_mbuf.c.obj
  1522. 117 error [1026/1296] Compiling C object subprojects/usrsctp-4e06feb01cadcd127d119486b98a4bd3d64aa1e7/libusrsctp.a.p/usrsctplib_netinet_sctp_ss_functions.c.obj
  1523. 117 error [1027/1296] Compiling C object subprojects/usrsctp-4e06feb01cadcd127d119486b98a4bd3d64aa1e7/libusrsctp.a.p/usrsctplib_netinet_sctp_sha1.c.obj
  1524. 117 error [1028/1296] Compiling C object subprojects/usrsctp-4e06feb01cadcd127d119486b98a4bd3d64aa1e7/libusrsctp.a.p/usrsctplib_netinet_sctp_sysctl.c.obj
  1525. 117 error [1029/1296] Compiling C object subprojects/usrsctp-4e06feb01cadcd127d119486b98a4bd3d64aa1e7/libusrsctp.a.p/usrsctplib_netinet_sctp_crc32.c.obj
  1526. 117 error [1030/1296] Compiling C object subprojects/usrsctp-4e06feb01cadcd127d119486b98a4bd3d64aa1e7/libusrsctp.a.p/usrsctplib_netinet_sctp_timer.c.obj
  1527. 117 error [1031/1296] Compiling C object subprojects/usrsctp-4e06feb01cadcd127d119486b98a4bd3d64aa1e7/libusrsctp.a.p/usrsctplib_netinet_sctp_indata.c.obj
  1528. 117 error [1032/1296] Compiling C++ object subprojects/abseil-cpp-20211102.0/libabsl_base.a.p/absl_base_internal_cycleclock.cc.obj
  1529. 117 error [1033/1296] Compiling C object subprojects/usrsctp-4e06feb01cadcd127d119486b98a4bd3d64aa1e7/libusrsctp.a.p/usrsctplib_netinet_sctp_input.c.obj
  1530. 117 error [1034/1296] Compiling C object subprojects/usrsctp-4e06feb01cadcd127d119486b98a4bd3d64aa1e7/libusrsctp.a.p/usrsctplib_netinet_sctp_output.c.obj
  1531. 117 error [1035/1296] Compiling C object subprojects/usrsctp-4e06feb01cadcd127d119486b98a4bd3d64aa1e7/libusrsctp.a.p/usrsctplib_netinet_sctp_pcb.c.obj
  1532. 117 error [1036/1296] Compiling C object subprojects/usrsctp-4e06feb01cadcd127d119486b98a4bd3d64aa1e7/libusrsctp.a.p/usrsctplib_netinet_sctp_userspace.c.obj
  1533. 117 error [1037/1296] Compiling C object subprojects/usrsctp-4e06feb01cadcd127d119486b98a4bd3d64aa1e7/libusrsctp.a.p/usrsctplib_netinet6_sctp6_usrreq.c.obj
  1534. 117 error [1038/1296] Compiling C object subprojects/usrsctp-4e06feb01cadcd127d119486b98a4bd3d64aa1e7/libusrsctp.a.p/usrsctplib_netinet_sctputil.c.obj
  1535. 117 error [1039/1296] Compiling C++ object subprojects/abseil-cpp-20211102.0/libabsl_base.a.p/absl_base_internal_low_level_alloc.cc.obj
  1536. 117 error [1040/1296] Compiling C++ object subprojects/abseil-cpp-20211102.0/libabsl_base.a.p/absl_base_internal_spinlock_wait.cc.obj
  1537. 117 error [1041/1296] Compiling C++ object subprojects/abseil-cpp-20211102.0/libabsl_base.a.p/absl_base_internal_raw_logging.cc.obj
  1538. 117 error [1042/1296] Compiling C object subprojects/usrsctp-4e06feb01cadcd127d119486b98a4bd3d64aa1e7/libusrsctp.a.p/usrsctplib_netinet_sctp_usrreq.c.obj
  1539. 117 error [1043/1296] Compiling C++ object subprojects/abseil-cpp-20211102.0/libabsl_base.a.p/absl_base_internal_thread_identity.cc.obj
  1540. 117 error [1044/1296] Compiling C++ object subprojects/abseil-cpp-20211102.0/libabsl_base.a.p/absl_base_internal_scoped_set_env.cc.obj
  1541. 117 error [1045/1296] Compiling C++ object subprojects/abseil-cpp-20211102.0/libabsl_base.a.p/absl_base_internal_sysinfo.cc.obj
  1542. 117 error [1046/1296] Linking static target subprojects/usrsctp-4e06feb01cadcd127d119486b98a4bd3d64aa1e7/libusrsctp.a
  1543. 117 error [1047/1296] Compiling C++ object subprojects/abseil-cpp-20211102.0/libabsl_base.a.p/absl_base_internal_throw_delegate.cc.obj
  1544. 117 error [1048/1296] Compiling C++ object subprojects/abseil-cpp-20211102.0/libabsl_base.a.p/absl_base_internal_unscaledcycleclock.cc.obj
  1545. 117 error [1049/1296] Compiling C++ object subprojects/abseil-cpp-20211102.0/libabsl_base.a.p/absl_base_internal_strerror.cc.obj
  1546. 117 error [1050/1296] Compiling C++ object subprojects/abseil-cpp-20211102.0/libabsl_base.a.p/absl_base_internal_spinlock.cc.obj
  1547. 117 error [1051/1296] Linking static target subprojects/abseil-cpp-20211102.0/libabsl_base.a
  1548. 117 error [1052/1296] Compiling C++ object deps/libwebrtc/liblibwebrtc.a.p/libwebrtc_modules_remote_bitrate_estimator_bwe_defines.cc.obj
  1549. 117 error [1053/1296] Compiling C++ object deps/libwebrtc/liblibwebrtc.a.p/libwebrtc_modules_remote_bitrate_estimator_inter_arrival.cc.obj
  1550. 117 error ../../../deps/libwebrtc/libwebrtc/modules/remote_bitrate_estimator/inter_arrival.cc(175): warning C4244: 'initializing': conversion from 'double' to 'int64_t', possible loss of data
  1551. 117 error [1054/1296] Compiling C++ object deps/libwebrtc/liblibwebrtc.a.p/libwebrtc_modules_remote_bitrate_estimator_overuse_detector.cc.obj
  1552. 117 error [1055/1296] Compiling C++ object deps/libwebrtc/liblibwebrtc.a.p/libwebrtc_modules_remote_bitrate_estimator_remote_bitrate_estimator_abs_send_time.cc.obj
  1553. 117 error ..\..\..\include\RTC/RTCP/FeedbackRtpTransport.hpp(279): warning C4146: unary minus operator applied to unsigned type, result still unsigned
  1554. 117 error ..\..\..\deps\libwebrtc\libwebrtc\modules/remote_bitrate_estimator/remote_bitrate_estimator_abs_send_time.h(55): warning C4244: 'return': conversion from 'float' to 'int', possible loss of data
  1555. 117 error ..\..\..\deps\libwebrtc\libwebrtc\modules/remote_bitrate_estimator/remote_bitrate_estimator_abs_send_time.h(61): warning C4244: 'return': conversion from 'float' to 'int', possible loss of data
  1556. 117 error ../../../deps/libwebrtc/libwebrtc/modules/remote_bitrate_estimator/remote_bitrate_estimator_abs_send_time.cc(248): warning C4244: 'initializing': conversion from 'double' to 'int64_t', possible loss of data
  1557. 117 error [1056/1296] Compiling C++ object subprojects/abseil-cpp-20211102.0/libabsl_profiling.a.p/absl_profiling_internal_periodic_sampler.cc.obj
  1558. 117 error [1057/1296] Compiling C++ object deps/libwebrtc/liblibwebrtc.a.p/libwebrtc_modules_remote_bitrate_estimator_aimd_rate_control.cc.obj
  1559. 117 error [1058/1296] Compiling C++ object subprojects/abseil-cpp-20211102.0/libabsl_strings.a.p/absl_strings_escaping.cc.obj
  1560. 117 error [1059/1296] Compiling C++ object deps/libwebrtc/liblibwebrtc.a.p/libwebrtc_modules_remote_bitrate_estimator_overuse_estimator.cc.obj
  1561. 117 error [1060/1296] Compiling C++ object deps/libwebrtc/liblibwebrtc.a.p/libwebrtc_modules_pacing_paced_sender.cc.obj
  1562. 117 error ..\..\..\include\RTC/RTCP/FeedbackRtpTransport.hpp(279): warning C4146: unary minus operator applied to unsigned type, result still unsigned
  1563. 117 error [1061/1296] Compiling C++ object subprojects/abseil-cpp-20211102.0/libabsl_strings.a.p/absl_strings_charconv.cc.obj
  1564. 117 error [1062/1296] Compiling C++ object subprojects/abseil-cpp-20211102.0/libabsl_profiling.a.p/absl_profiling_internal_exponential_biased.cc.obj
  1565. 117 error [1063/1296] Linking static target subprojects/abseil-cpp-20211102.0/libabsl_profiling.a
  1566. 117 error [1064/1296] Compiling C++ object subprojects/abseil-cpp-20211102.0/libabsl_strings.a.p/absl_strings_ascii.cc.obj
  1567. 117 error [1065/1296] Compiling C++ object subprojects/abseil-cpp-20211102.0/libabsl_strings.a.p/absl_strings_internal_charconv_bigint.cc.obj
  1568. 117 error [1066/1296] Compiling C++ object subprojects/abseil-cpp-20211102.0/libabsl_strings.a.p/absl_strings_internal_charconv_parse.cc.obj
  1569. 117 error [1067/1296] Compiling C++ object subprojects/abseil-cpp-20211102.0/libabsl_strings.a.p/absl_strings_internal_cord_rep_consume.cc.obj
  1570. 117 error [1068/1296] Compiling C++ object subprojects/abseil-cpp-20211102.0/libabsl_strings.a.p/absl_strings_internal_cord_internal.cc.obj
  1571. 117 error [1069/1296] Compiling C++ object subprojects/abseil-cpp-20211102.0/libabsl_strings.a.p/absl_strings_internal_cordz_functions.cc.obj
  1572. 117 error [1070/1296] Compiling C++ object subprojects/abseil-cpp-20211102.0/libabsl_strings.a.p/absl_strings_internal_cord_rep_btree_navigator.cc.obj
  1573. 117 error [1071/1296] Compiling C++ object subprojects/abseil-cpp-20211102.0/libabsl_strings.a.p/absl_strings_internal_cord_rep_btree_reader.cc.obj
  1574. 117 error [1072/1296] Compiling C++ object subprojects/abseil-cpp-20211102.0/libabsl_strings.a.p/absl_strings_cord.cc.obj
  1575. 117 error [1073/1296] Compiling C++ object subprojects/abseil-cpp-20211102.0/libabsl_strings.a.p/absl_strings_internal_ostringstream.cc.obj
  1576. 117 error [1074/1296] Compiling C++ object subprojects/abseil-cpp-20211102.0/libabsl_strings.a.p/absl_strings_internal_cord_rep_ring.cc.obj
  1577. 117 error [1075/1296] Compiling C++ object subprojects/abseil-cpp-20211102.0/libabsl_strings.a.p/absl_strings_internal_cord_rep_btree.cc.obj
  1578. 117 error [1076/1296] Compiling C++ object subprojects/abseil-cpp-20211102.0/libabsl_strings.a.p/absl_strings_internal_escaping.cc.obj
  1579. 117 error [1077/1296] Compiling C++ object subprojects/abseil-cpp-20211102.0/libabsl_strings.a.p/absl_strings_internal_memutil.cc.obj
  1580. 117 error [1078/1296] Compiling C++ object subprojects/abseil-cpp-20211102.0/libabsl_strings.a.p/absl_strings_internal_pow10_helper.cc.obj
  1581. 117 error [1079/1296] Compiling C++ object subprojects/abseil-cpp-20211102.0/libabsl_strings.a.p/absl_strings_internal_cordz_handle.cc.obj
  1582. 117 error [1080/1296] Compiling C++ object subprojects/abseil-cpp-20211102.0/libabsl_strings.a.p/absl_strings_internal_utf8.cc.obj
  1583. 117 error [1081/1296] Compiling C++ object subprojects/abseil-cpp-20211102.0/libabsl_strings.a.p/absl_strings_internal_cordz_sample_token.cc.obj
  1584. 117 error [1082/1296] Compiling C++ object subprojects/abseil-cpp-20211102.0/libabsl_strings.a.p/absl_strings_internal_cordz_info.cc.obj
  1585. 117 error [1083/1296] Compiling C++ object subprojects/abseil-cpp-20211102.0/libabsl_strings.a.p/absl_strings_internal_str_format_arg.cc.obj
  1586. 117 error [1084/1296] Compiling C++ object subprojects/abseil-cpp-20211102.0/libabsl_strings.a.p/absl_strings_match.cc.obj
  1587. 117 error [1085/1296] Compiling C++ object subprojects/abseil-cpp-20211102.0/libabsl_strings.a.p/absl_strings_internal_str_format_output.cc.obj
  1588. 117 error [1086/1296] Compiling C++ object subprojects/abseil-cpp-20211102.0/libabsl_strings.a.p/absl_strings_internal_str_format_extension.cc.obj
  1589. 117 error [1087/1296] Compiling C++ object subprojects/abseil-cpp-20211102.0/libabsl_strings.a.p/absl_strings_internal_str_format_parser.cc.obj
  1590. 117 error [1088/1296] Compiling C++ object subprojects/abseil-cpp-20211102.0/libabsl_strings.a.p/absl_strings_internal_str_format_float_conversion.cc.obj
  1591. 117 error [1089/1296] Compiling C++ object subprojects/abseil-cpp-20211102.0/libabsl_strings.a.p/absl_strings_str_replace.cc.obj
  1592. 117 error [1090/1296] Compiling C++ object subprojects/abseil-cpp-20211102.0/libabsl_strings.a.p/absl_strings_internal_str_format_bind.cc.obj
  1593. 117 error [1091/1296] Compiling C++ object subprojects/abseil-cpp-20211102.0/libabsl_strings.a.p/absl_strings_string_view.cc.obj
  1594. 117 error [1092/1296] Compiling C++ object subprojects/abseil-cpp-20211102.0/libabsl_strings.a.p/absl_strings_str_cat.cc.obj
  1595. 117 error [1093/1296] Compiling C++ object subprojects/abseil-cpp-20211102.0/libabsl_strings.a.p/absl_strings_str_split.cc.obj
  1596. 117 error [1094/1296] Compiling C++ object subprojects/abseil-cpp-20211102.0/libabsl_debugging.a.p/absl_debugging_internal_address_is_readable.cc.obj
  1597. 117 error [1095/1296] Compiling C++ object subprojects/abseil-cpp-20211102.0/libabsl_debugging.a.p/absl_debugging_internal_vdso_support.cc.obj
  1598. 117 error [1096/1296] Compiling C++ object subprojects/abseil-cpp-20211102.0/libabsl_strings.a.p/absl_strings_substitute.cc.obj
  1599. 117 error [1097/1296] Compiling C++ object subprojects/abseil-cpp-20211102.0/libabsl_debugging.a.p/absl_debugging_internal_elf_mem_image.cc.obj
  1600. 117 error [1098/1296] Compiling C++ object subprojects/abseil-cpp-20211102.0/libabsl_strings.a.p/absl_strings_numbers.cc.obj
  1601. 117 error [1099/1296] Compiling C++ object subprojects/abseil-cpp-20211102.0/libabsl_debugging.a.p/absl_debugging_internal_stack_consumption.cc.obj
  1602. 117 error [1100/1296] Compiling C++ object subprojects/abseil-cpp-20211102.0/libabsl_debugging.a.p/absl_debugging_internal_demangle.cc.obj
  1603. 117 error [1101/1296] Compiling C++ object subprojects/abseil-cpp-20211102.0/libabsl_debugging.a.p/absl_debugging_leak_check.cc.obj
  1604. 117 error [1102/1296] Linking static target subprojects/abseil-cpp-20211102.0/libabsl_strings.a
  1605. 117 error [1103/1296] Compiling C++ object subprojects/abseil-cpp-20211102.0/libabsl_debugging.a.p/absl_debugging_leak_check_disable.cc.obj
  1606. 117 error [1104/1296] Compiling C++ object subprojects/abseil-cpp-20211102.0/libabsl_debugging.a.p/absl_debugging_internal_examine_stack.cc.obj
  1607. 117 error [1105/1296] Compiling C++ object subprojects/abseil-cpp-20211102.0/libabsl_debugging.a.p/absl_debugging_failure_signal_handler.cc.obj
  1608. 117 error [1106/1296] Compiling C++ object subprojects/abseil-cpp-20211102.0/libabsl_debugging.a.p/absl_debugging_stacktrace.cc.obj
  1609. 117 error [1107/1296] Compiling C++ object subprojects/abseil-cpp-20211102.0/libabsl_time.a.p/absl_time_format.cc.obj
  1610. 117 error [1108/1296] Compiling C++ object subprojects/abseil-cpp-20211102.0/libabsl_time.a.p/absl_time_duration.cc.obj
  1611. 117 error [1109/1296] Compiling C++ object subprojects/abseil-cpp-20211102.0/libabsl_time.a.p/absl_time_civil_time.cc.obj
  1612. 117 error [1110/1296] Compiling C++ object subprojects/abseil-cpp-20211102.0/libabsl_debugging.a.p/absl_debugging_symbolize.cc.obj
  1613. 117 error [1111/1296] Linking static target subprojects/abseil-cpp-20211102.0/libabsl_debugging.a
  1614. 117 error [1112/1296] Compiling C++ object subprojects/abseil-cpp-20211102.0/libabsl_time.a.p/absl_time_clock.cc.obj
  1615. 117 error [1113/1296] Compiling C++ object subprojects/abseil-cpp-20211102.0/libabsl_time.a.p/absl_time_internal_cctz_src_time_zone_libc.cc.obj
  1616. 117 error [1114/1296] Compiling C++ object subprojects/abseil-cpp-20211102.0/libabsl_time.a.p/absl_time_internal_cctz_src_time_zone_lookup.cc.obj
  1617. 117 error [1115/1296] Compiling C++ object subprojects/abseil-cpp-20211102.0/libabsl_time.a.p/absl_time_internal_cctz_src_time_zone_info.cc.obj
  1618. 117 error [1116/1296] Compiling C++ object subprojects/abseil-cpp-20211102.0/libabsl_time.a.p/absl_time_internal_cctz_src_time_zone_fixed.cc.obj
  1619. 117 error [1117/1296] Compiling C++ object subprojects/abseil-cpp-20211102.0/libabsl_time.a.p/absl_time_internal_cctz_src_civil_time_detail.cc.obj
  1620. 117 error [1118/1296] Compiling C++ object subprojects/abseil-cpp-20211102.0/libabsl_time.a.p/absl_time_internal_cctz_src_time_zone_if.cc.obj
  1621. 117 error [1119/1296] Compiling C++ object subprojects/abseil-cpp-20211102.0/libabsl_time.a.p/absl_time_internal_cctz_src_zone_info_source.cc.obj
  1622. 117 error [1120/1296] Compiling C++ object subprojects/abseil-cpp-20211102.0/libabsl_time.a.p/absl_time_internal_cctz_src_time_zone_impl.cc.obj
  1623. 117 error [1121/1296] Compiling C++ object subprojects/abseil-cpp-20211102.0/libabsl_time.a.p/absl_time_internal_cctz_src_time_zone_format.cc.obj
  1624. 117 error [1122/1296] Compiling C++ object subprojects/abseil-cpp-20211102.0/libabsl_types.a.p/absl_types_bad_any_cast.cc.obj
  1625. 117 error [1123/1296] Compiling C++ object subprojects/abseil-cpp-20211102.0/libabsl_types.a.p/absl_types_bad_optional_access.cc.obj
  1626. 117 error [1124/1296] Compiling C++ object subprojects/abseil-cpp-20211102.0/libabsl_types.a.p/absl_types_bad_variant_access.cc.obj
  1627. 117 error [1125/1296] Linking static target subprojects/abseil-cpp-20211102.0/libabsl_types.a
  1628. 117 error [1126/1296] Compiling C++ object subprojects/abseil-cpp-20211102.0/libabsl_time.a.p/absl_time_internal_cctz_src_time_zone_posix.cc.obj
  1629. 117 error [1127/1296] Compiling C++ object subprojects/abseil-cpp-20211102.0/libabsl_time.a.p/absl_time_time.cc.obj
  1630. 117 error [1128/1296] Compiling C++ object subprojects/abseil-cpp-20211102.0/libabsl_synchronization.a.p/absl_synchronization_notification.cc.obj
  1631. 117 error [1129/1296] Linking static target subprojects/abseil-cpp-20211102.0/libabsl_time.a
  1632. 117 error [1130/1296] Compiling C++ object subprojects/abseil-cpp-20211102.0/libabsl_synchronization.a.p/absl_synchronization_internal_waiter.cc.obj
  1633. 117 error [1131/1296] Compiling C++ object subprojects/abseil-cpp-20211102.0/libabsl_synchronization.a.p/absl_synchronization_barrier.cc.obj
  1634. 117 error [1132/1296] Compiling C++ object subprojects/abseil-cpp-20211102.0/libabsl_synchronization.a.p/absl_synchronization_blocking_counter.cc.obj
  1635. 117 error [1133/1296] Compiling C++ object subprojects/abseil-cpp-20211102.0/libabsl_synchronization.a.p/absl_synchronization_mutex.cc.obj
  1636. 117 error [1134/1296] Compiling C++ object subprojects/abseil-cpp-20211102.0/libabsl_synchronization.a.p/absl_synchronization_internal_per_thread_sem.cc.obj
  1637. 117 error [1135/1296] Compiling C++ object subprojects/abseil-cpp-20211102.0/libabsl_synchronization.a.p/absl_synchronization_internal_create_thread_identity.cc.obj
  1638. 117 error [1136/1296] Compiling C++ object subprojects/abseil-cpp-20211102.0/libabsl_synchronization.a.p/absl_synchronization_internal_graphcycles.cc.obj
  1639. 117 error [1137/1296] Linking static target subprojects/abseil-cpp-20211102.0/libabsl_synchronization.a
  1640. 117 error [1138/1296] Compiling C++ object subprojects/abseil-cpp-20211102.0/libabsl_container.a.p/absl_container_internal_raw_hash_set.cc.obj
  1641. 117 error [1139/1296] Compiling C++ object subprojects/abseil-cpp-20211102.0/libabsl_container.a.p/absl_container_internal_hashtablez_sampler.cc.obj
  1642. 117 error [1140/1296] Compiling C++ object subprojects/abseil-cpp-20211102.0/libabsl_container.a.p/absl_container_internal_hashtablez_sampler_force_weak_definition.cc.obj
  1643. 117 error FAILED: subprojects/abseil-cpp-20211102.0/libabsl_container.a.p/absl_container_internal_hashtablez_sampler_force_weak_definition.cc.obj
  1644. 117 error "cl" "-Isubprojects\abseil-cpp-20211102.0\libabsl_container.a.p" "-Isubprojects\abseil-cpp-20211102.0" "-I..\..\..\subprojects\abseil-cpp-20211102.0" "-DNDEBUG" "/MD" "/nologo" "/showIncludes" "/utf-8" "/EHsc" "/std:c++14" "/permissive-" "/O2" "/Gw" "/DNOMINMAX" "/Fdsubprojects\abseil-cpp-20211102.0\libabsl_container.a.p\absl_container_internal_hashtablez_sampler_force_weak_definition.cc.pdb" /Fosubprojects/abseil-cpp-20211102.0/libabsl_container.a.p/absl_container_internal_hashtablez_sampler_force_weak_definition.cc.obj "/c" ../../../subprojects/abseil-cpp-20211102.0/absl/container/internal/hashtablez_sampler_force_weak_definition.cc
  1645. 117 error D:\csFiles\psuFiles\springTerm2022\mediasoup3-record-demo\mediasoup3-record-demo\server\node_modules\mediasoup\worker\subprojects\abseil-cpp-20211102.0\absl\container\internal\hashtablez_sampler_force_weak_definition.cc : fatal error C1083: Cannot open compiler generated file: '': Invalid argument
  1646. 117 error [1141/1296] Compiling C++ object deps/libwebrtc/liblibwebrtc.a.p/libwebrtc_rtc_base_rate_statistics.cc.obj
  1647. 117 error [1142/1296] Compiling C++ object deps/libwebrtc/liblibwebrtc.a.p/libwebrtc_system_wrappers_source_field_trial.cc.obj
  1648. 117 error [1143/1296] Compiling C++ object deps/libwebrtc/liblibwebrtc.a.p/libwebrtc_call_rtp_transport_controller_send.cc.obj
  1649. 117 error ..\..\..\include\RTC/RTCP/FeedbackRtpTransport.hpp(279): warning C4146: unary minus operator applied to unsigned type, result still unsigned
  1650. 117 error ninja: build stopped: subcommand failed.
  1651. 117 error Activating VS 16.11.10
  1652. 117 error make: Leaving directory `/d/csFiles/psuFiles/springTerm2022/mediasoup3-record-demo/mediasoup3-record-demo/server/node_modules/mediasoup/worker'
  1653. 118 error Usage:
  1654. 118 error c:\Users\thund\AppData\Local\Programs\Python\Python310\python.exe -m pip install [options] <requirement specifier> [package-index-options] ...
  1655. 118 error c:\Users\thund\AppData\Local\Programs\Python\Python310\python.exe -m pip install [options] -r <requirements file> [package-index-options] ...
  1656. 118 error c:\Users\thund\AppData\Local\Programs\Python\Python310\python.exe -m pip install [options] [-e] <vcs project url> ...
  1657. 118 error c:\Users\thund\AppData\Local\Programs\Python\Python310\python.exe -m pip install [options] [-e] <local project path> ...
  1658. 118 error c:\Users\thund\AppData\Local\Programs\Python\Python310\python.exe -m pip install [options] <archive url/path> ...
  1659. 118 error
  1660. 118 error no such option: --system
  1661. 118 error Directory does not contain a valid build tree:
  1662. 118 error D:\csFiles\psuFiles\springTerm2022\mediasoup3-record-demo\mediasoup3-record-demo\server\node_modules\mediasoup\worker\out\Release\build
  1663. 118 error /d/csFiles/psuFiles/springTerm2022/mediasoup3-record-demo/mediasoup3-record-demo/server/node_modules/mediasoup/worker/scripts/cpu_cores.sh: line 9: nproc: command not found
  1664. 118 error make: *** [mediasoup-worker] Error 1
  1665. 119 verbose exit 1
  1666. 120 timing npm Completed in 269988ms
  1667. 121 verbose unfinished npm timer reify 1650816650703
  1668. 122 verbose unfinished npm timer reify:build 1650816685076
  1669. 123 verbose unfinished npm timer build 1650816685076
  1670. 124 verbose unfinished npm timer build:deps 1650816685077
  1671. 125 verbose unfinished npm timer build:run:postinstall 1650816685088
  1672. 126 verbose unfinished npm timer build:run:postinstall:node_modules/mediasoup 1650816685088
  1673. 127 verbose code 1
  1674. 128 error A complete log of this run can be found in:
  1675. 128 error C:\Users\thund\AppData\Local\npm-cache\_logs\2022-04-24T16_10_50_580Z-debug-0.log
  1676.  
Advertisement
RAW Paste Data Copied
Advertisement