SHARE
TWEET

Untitled

a guest Dec 15th, 2019 62 Never
Not a member of Pastebin yet? Sign Up, it unlocks many cool features!
  1. [ 64%] Building CXX object plugins/ufw/CMakeFiles/nomad_ufw_plugin.dir/rule.cpp.o
  2. [ 67%] Building CXX object plugins/ufw/CMakeFiles/nomad_ufw_plugin.dir/profile.cpp.o
  3. Scanning dependencies of target org.nxos.firewall
  4. [ 70%] Building CXX object plugins/ufw/CMakeFiles/nomad_ufw_plugin.dir/types.cpp.o
  5. [ 72%] Building CXX object kcm/CMakeFiles/org.nxos.firewall.dir/org.nxos.firewall_autogen/mocs_compilation.cpp.o
  6. In file included from /build/nomad-firewall/src/nomad-firewall/plugins/netstat/conectionsmodel.cpp:1:
  7. /build/nomad-firewall/src/nomad-firewall/plugins/netstat/conectionsmodel.h:29:28: error: ‘virtual QHash<int, QByteArray> ConnectionsModel::roleNames() const’ can be marked override [-Werror=suggest-override]
  8.    29 |     QHash<int, QByteArray> roleNames() const;
  9.       |                            ^~~~~~~~~
  10. In file included from /build/nomad-firewall/src/nomad-firewall/plugins/ufw/blocker.cpp:24:
  11. /build/nomad-firewall/src/nomad-firewall/plugins/ufw/blocker.h:42:10: error: ‘virtual bool UFW::Blocker::eventFilter(QObject*, QEvent*)’ can be marked override [-Werror=suggest-override]
  12.    42 |     bool eventFilter(QObject *object, QEvent *event);
  13.       |          ^~~~~~~~~~~
  14. In file included from /build/nomad-firewall/src/nomad-firewall/plugins/netstat/netstatclient.h:6,
  15.                  from /build/nomad-firewall/src/nomad-firewall/plugins/netstat/netstatclient.cpp:1:
  16. /build/nomad-firewall/src/nomad-firewall/plugins/netstat/conectionsmodel.h:29:28: error: ‘virtual QHash<int, QByteArray> ConnectionsModel::roleNames() const’ can be marked override [-Werror=suggest-override]
  17.    29 |     QHash<int, QByteArray> roleNames() const;
  18.       |                            ^~~~~~~~~
  19. In file included from /build/nomad-firewall/src/build/plugins/netstat/nomad_netstat_plugin_autogen/EWIEGA46WW/moc_conectionsmodel.cpp:10,
  20.                  from /build/nomad-firewall/src/build/plugins/netstat/nomad_netstat_plugin_autogen/mocs_compilation.cpp:2:
  21. /build/nomad-firewall/src/nomad-firewall/plugins/netstat/conectionsmodel.h:29:28: error: ‘virtual QHash<int, QByteArray> ConnectionsModel::roleNames() const’ can be marked override [-Werror=suggest-override]
  22.    29 |     QHash<int, QByteArray> roleNames() const;
  23.       |                            ^~~~~~~~~
  24. In file included from /build/nomad-firewall/src/build/plugins/ufw/nomad_ufw_plugin_autogen/EWIEGA46WW/moc_blocker.cpp:10,
  25.                  from /build/nomad-firewall/src/build/plugins/ufw/nomad_ufw_plugin_autogen/mocs_compilation.cpp:2:
  26. /build/nomad-firewall/src/nomad-firewall/plugins/ufw/blocker.h:42:10: error: ‘virtual bool UFW::Blocker::eventFilter(QObject*, QEvent*)’ can be marked override [-Werror=suggest-override]
  27.    42 |     bool eventFilter(QObject *object, QEvent *event);
  28.       |          ^~~~~~~~~~~
  29. cc1plus: all warnings being treated as errors
  30. make[2]: *** [plugins/ufw/CMakeFiles/nomad_ufw_plugin.dir/build.make:102: plugins/ufw/CMakeFiles/nomad_ufw_plugin.dir/blocker.cpp.o] Error 1
  31. make[2]: *** Waiting for unfinished jobs....
  32. In file included from /build/nomad-firewall/src/build/plugins/netstat/nomad_netstat_plugin_autogen/EWIEGA46WW/moc_netstatplugin.cpp:10,
  33.                  from /build/nomad-firewall/src/build/plugins/netstat/nomad_netstat_plugin_autogen/mocs_compilation.cpp:4:
  34. /build/nomad-firewall/src/nomad-firewall/plugins/netstat/netstatplugin.h:12:22: error: ‘virtual void NetstatPlugin::registerTypes(const char*)’ can be marked override [-Werror=suggest-override]
  35.    12 |         virtual void registerTypes(const char *uri);
  36.       |                      ^~~~~~~~~~~~~
  37. [ 75%] Building CXX object kcm/CMakeFiles/org.nxos.firewall.dir/nomadfirewallkcm.cpp.o
  38. cc1plus: all warnings being treated as errors
  39. make[2]: *** [plugins/netstat/CMakeFiles/nomad_netstat_plugin.dir/build.make:102: plugins/netstat/CMakeFiles/nomad_netstat_plugin.dir/netstatclient.cpp.o] Error 1
  40. make[2]: *** Waiting for unfinished jobs....
  41. In file included from /build/nomad-firewall/src/nomad-firewall/plugins/netstat/netstatplugin.cpp:1:
  42. /build/nomad-firewall/src/nomad-firewall/plugins/netstat/netstatplugin.h:12:22: error: ‘virtual void NetstatPlugin::registerTypes(const char*)’ can be marked override [-Werror=suggest-override]
  43.    12 |         virtual void registerTypes(const char *uri);
  44.       |                      ^~~~~~~~~~~~~
  45. In file included from /build/nomad-firewall/src/nomad-firewall/plugins/ufw/ufwplugin.cpp:1:
  46. /build/nomad-firewall/src/nomad-firewall/plugins/ufw/ufwplugin.h:13:22: error: ‘virtual void UfwPlugin::registerTypes(const char*)’ can be marked override [-Werror=suggest-override]
  47.    13 |         virtual void registerTypes(const char *uri);
  48.       |                      ^~~~~~~~~~~~~
  49. In file included from /build/nomad-firewall/src/build/plugins/ufw/nomad_ufw_plugin_autogen/EWIEGA46WW/moc_ufwplugin.cpp:10,
  50.                  from /build/nomad-firewall/src/build/plugins/ufw/nomad_ufw_plugin_autogen/mocs_compilation.cpp:7:
  51. /build/nomad-firewall/src/nomad-firewall/plugins/ufw/ufwplugin.h:13:22: error: ‘virtual void UfwPlugin::registerTypes(const char*)’ can be marked override [-Werror=suggest-override]
  52.    13 |         virtual void registerTypes(const char *uri);
  53.       |                      ^~~~~~~~~~~~~
  54. cc1plus: all warnings being treated as errors
  55. make[2]: *** [plugins/netstat/CMakeFiles/nomad_netstat_plugin.dir/build.make:63: plugins/netstat/CMakeFiles/nomad_netstat_plugin.dir/nomad_netstat_plugin_autogen/mocs_compilation.cpp.o] Error 1
  56. [ 78%] Linking CXX executable nxos_netstat_helper
  57. [ 78%] Built target nxos_netstat_helper
  58. cc1plus: all warnings being treated as errors
  59. make[2]: *** [plugins/netstat/CMakeFiles/nomad_netstat_plugin.dir/build.make:89: plugins/netstat/CMakeFiles/nomad_netstat_plugin.dir/conectionsmodel.cpp.o] Error 1
  60. [ 81%] Linking CXX executable nomad_ufw_plugin_helper
  61. cc1plus: all warnings being treated as errors
  62. make[2]: *** [plugins/ufw/CMakeFiles/nomad_ufw_plugin.dir/build.make:63: plugins/ufw/CMakeFiles/nomad_ufw_plugin.dir/nomad_ufw_plugin_autogen/mocs_compilation.cpp.o] Error 1
  63. [ 81%] Built target nomad_ufw_plugin_helper
  64. In file included from /build/nomad-firewall/src/nomad-firewall/plugins/netstat/netstatclient.h:6,
  65.                  from /build/nomad-firewall/src/nomad-firewall/plugins/netstat/netstatplugin.cpp:5:
  66. /build/nomad-firewall/src/nomad-firewall/plugins/netstat/conectionsmodel.h:29:28: error: ‘virtual QHash<int, QByteArray> ConnectionsModel::roleNames() const’ can be marked override [-Werror=suggest-override]
  67.    29 |     QHash<int, QByteArray> roleNames() const;
  68.       |                            ^~~~~~~~~
  69. cc1plus: all warnings being treated as errors
  70. make[2]: *** [plugins/netstat/CMakeFiles/nomad_netstat_plugin.dir/build.make:76: plugins/netstat/CMakeFiles/nomad_netstat_plugin.dir/netstatplugin.cpp.o] Error 1
  71. make[1]: *** [CMakeFiles/Makefile2:1348: plugins/netstat/CMakeFiles/nomad_netstat_plugin.dir/all] Error 2
  72. make[1]: *** Waiting for unfinished jobs....
  73. cc1plus: all warnings being treated as errors
  74. make[2]: *** [plugins/ufw/CMakeFiles/nomad_ufw_plugin.dir/build.make:76: plugins/ufw/CMakeFiles/nomad_ufw_plugin.dir/ufwplugin.cpp.o] Error 1
  75. make[1]: *** [CMakeFiles/Makefile2:1213: plugins/ufw/CMakeFiles/nomad_ufw_plugin.dir/all] Error 2
  76. [ 83%] Linking CXX shared module org.nxos.firewall.so
  77. [ 83%] Built target org.nxos.firewall
  78. make: *** [Makefile:130: all] Error 2
RAW Paste Data
We use cookies for various purposes including analytics. By continuing to use Pastebin, you agree to our use of cookies as described in the Cookies Policy. OK, I Understand
 
Top