daily pastebin goal
24%
SHARE
TWEET

Untitled

a guest Dec 13th, 2018 64 Never
Not a member of Pastebin yet? Sign Up, it unlocks many cool features!
  1. ================================================================================
  2.  
  3. Installer.rb: => Doing `make` next from /Depot/Temp/strigi-0.7.5/BUILD.
  4.  
  5. ================================================================================
  6. [ 10%] Built target streams
  7. [ 19%] Built target streamsstatic
  8. [ 20%] Built target testrunner-libstreams-internal
  9. [ 27%] Built target testrunner-streams
  10. [ 43%] Built target streamanalyzerstatic
  11. [ 60%] Built target streamanalyzer
  12. [ 61%] Building CXX object libstreamanalyzer/plugins/endplugins/CMakeFiles/ffmpeg.dir/ffmpegendanalyzer.cpp.o
  13. /Depot/Temp/strigi-0.7.5/libstreamanalyzer/plugins/endplugins/ffmpegendanalyzer.cpp: In member function ‘virtual signed char FFMPEGEndAnalyzer::analyze(Strigi::AnalysisResult&, Strigi::InputStream*)’:
  14. /Depot/Temp/strigi-0.7.5/libstreamanalyzer/plugins/endplugins/ffmpegendanalyzer.cpp:307:17: warning: ‘ByteIOContext’ is deprecated (declared at /usr/include/libavformat/avio.h:218)
  15. /Depot/Temp/strigi-0.7.5/libstreamanalyzer/plugins/endplugins/ffmpegendanalyzer.cpp:308:6: warning: ‘int init_put_byte(AVIOContext*, unsigned char*, int, int, void*, int (*)(void*, uint8_t*, int), int (*)(void*, uint8_t*, int), int64_t (*)(void*, int64_t, int))’ is deprecated (declared at /usr/include/libavformat/avio.h:220)
  16. /Depot/Temp/strigi-0.7.5/libstreamanalyzer/plugins/endplugins/ffmpegendanalyzer.cpp:308:85: warning: ‘int init_put_byte(AVIOContext*, unsigned char*, int, int, void*, int (*)(void*, uint8_t*, int), int (*)(void*, uint8_t*, int), int64_t (*)(void*, int64_t, int))’ is deprecated (declared at /usr/include/libavformat/avio.h:220)
  17. /Depot/Temp/strigi-0.7.5/libstreamanalyzer/plugins/endplugins/ffmpegendanalyzer.cpp:312:13: warning: ‘AVIOContext::is_streamed’ is deprecated (declared at /usr/include/libavformat/avio.h:68)
  18. /Depot/Temp/strigi-0.7.5/libstreamanalyzer/plugins/endplugins/ffmpegendanalyzer.cpp:312:13: warning: ‘AVIOContext::is_streamed’ is deprecated (declared at /usr/include/libavformat/avio.h:68)
  19. /Depot/Temp/strigi-0.7.5/libstreamanalyzer/plugins/endplugins/ffmpegendanalyzer.cpp:327:6: warning: ‘int av_open_input_stream(AVFormatContext**, AVIOContext*, const char*, AVInputFormat*, AVFormatParameters*)’ is deprecated (declared at /usr/include/libavformat/avformat.h:1072)
  20. /Depot/Temp/strigi-0.7.5/libstreamanalyzer/plugins/endplugins/ffmpegendanalyzer.cpp:327:57: warning: ‘int av_open_input_stream(AVFormatContext**, AVIOContext*, const char*, AVInputFormat*, AVFormatParameters*)’ is deprecated (declared at /usr/include/libavformat/avformat.h:1072)
  21. /Depot/Temp/strigi-0.7.5/libstreamanalyzer/plugins/endplugins/ffmpegendanalyzer.cpp:333:3: warning: ‘void dump_format(AVFormatContext*, int, const char*, int)’ is deprecated (declared at /usr/include/libavformat/avformat.h:1532)
  22. /Depot/Temp/strigi-0.7.5/libstreamanalyzer/plugins/endplugins/ffmpegendanalyzer.cpp:333:46: warning: ‘void dump_format(AVFormatContext*, int, const char*, int)’ is deprecated (declared at /usr/include/libavformat/avformat.h:1532)
  23. /Depot/Temp/strigi-0.7.5/libstreamanalyzer/plugins/endplugins/ffmpegendanalyzer.cpp:351:64: error: ‘CODEC_TYPE_AUDIO’ was not declared in this scope
  24. /Depot/Temp/strigi-0.7.5/libstreamanalyzer/plugins/endplugins/ffmpegendanalyzer.cpp:362:29: error: ‘CODEC_TYPE_AUDIO’ was not declared in this scope
  25. /Depot/Temp/strigi-0.7.5/libstreamanalyzer/plugins/endplugins/ffmpegendanalyzer.cpp:362:69: error: ‘CODEC_TYPE_VIDEO’ was not declared in this scope
  26. /Depot/Temp/strigi-0.7.5/libstreamanalyzer/plugins/endplugins/ffmpegendanalyzer.cpp:373:38: error: ‘const struct AVStream’ has no member named ‘language’
  27. /Depot/Temp/strigi-0.7.5/libstreamanalyzer/plugins/endplugins/ffmpegendanalyzer.cpp:374:70: error: ‘const struct AVStream’ has no member named ‘language’
  28. /Depot/Temp/strigi-0.7.5/libstreamanalyzer/plugins/endplugins/ffmpegendanalyzer.cpp:462:32: error: ‘struct AVFormatContext’ has no member named ‘title’
  29. /Depot/Temp/strigi-0.7.5/libstreamanalyzer/plugins/endplugins/ffmpegendanalyzer.cpp:463:52: error: ‘struct AVFormatContext’ has no member named ‘title’
  30. /Depot/Temp/strigi-0.7.5/libstreamanalyzer/plugins/endplugins/ffmpegendanalyzer.cpp:465:32: error: ‘struct AVFormatContext’ has no member named ‘author’
  31. /Depot/Temp/strigi-0.7.5/libstreamanalyzer/plugins/endplugins/ffmpegendanalyzer.cpp:469:64: error: ‘struct AVFormatContext’ has no member named ‘author’
  32. /Depot/Temp/strigi-0.7.5/libstreamanalyzer/plugins/endplugins/ffmpegendanalyzer.cpp:471:32: error: ‘struct AVFormatContext’ has no member named ‘copyright’
  33. /Depot/Temp/strigi-0.7.5/libstreamanalyzer/plugins/endplugins/ffmpegendanalyzer.cpp:472:56: error: ‘struct AVFormatContext’ has no member named ‘copyright’
  34. /Depot/Temp/strigi-0.7.5/libstreamanalyzer/plugins/endplugins/ffmpegendanalyzer.cpp:474:32: error: ‘struct AVFormatContext’ has no member named ‘comment’
  35. /Depot/Temp/strigi-0.7.5/libstreamanalyzer/plugins/endplugins/ffmpegendanalyzer.cpp:475:54: error: ‘struct AVFormatContext’ has no member named ‘comment’
  36. /Depot/Temp/strigi-0.7.5/libstreamanalyzer/plugins/endplugins/ffmpegendanalyzer.cpp:477:32: error: ‘struct AVFormatContext’ has no member named ‘album’
  37. /Depot/Temp/strigi-0.7.5/libstreamanalyzer/plugins/endplugins/ffmpegendanalyzer.cpp:481:56: error: ‘struct AVFormatContext’ has no member named ‘album’
  38. /Depot/Temp/strigi-0.7.5/libstreamanalyzer/plugins/endplugins/ffmpegendanalyzer.cpp:483:32: error: ‘struct AVFormatContext’ has no member named ‘genre’
  39. /Depot/Temp/strigi-0.7.5/libstreamanalyzer/plugins/endplugins/ffmpegendanalyzer.cpp:484:52: error: ‘struct AVFormatContext’ has no member named ‘genre’
  40. /Depot/Temp/strigi-0.7.5/libstreamanalyzer/plugins/endplugins/ffmpegendanalyzer.cpp:486:11: error: ‘struct AVFormatContext’ has no member named ‘track’
  41. /Depot/Temp/strigi-0.7.5/libstreamanalyzer/plugins/endplugins/ffmpegendanalyzer.cpp:487:45: error: ‘struct AVFormatContext’ has no member named ‘track’
  42. /Depot/Temp/strigi-0.7.5/libstreamanalyzer/plugins/endplugins/ffmpegendanalyzer.cpp:489:11: error: ‘struct AVFormatContext’ has no member named ‘year’
  43. /Depot/Temp/strigi-0.7.5/libstreamanalyzer/plugins/endplugins/ffmpegendanalyzer.cpp:490:47: error: ‘struct AVFormatContext’ has no member named ‘year’
  44. make[2]: *** [libstreamanalyzer/plugins/endplugins/CMakeFiles/ffmpeg.dir/ffmpegendanalyzer.cpp.o] Error 1
  45. make[1]: *** [libstreamanalyzer/plugins/endplugins/CMakeFiles/ffmpeg.dir/all] Error 2
  46. make: *** [all] Error 2
RAW Paste Data
We use cookies for various purposes including analytics. By continuing to use Pastebin, you agree to our use of cookies as described in the Cookies Policy. OK, I Understand
 
Top