daily pastebin goal
79%
SHARE
TWEET

libpeas

a guest Nov 13th, 2013 32 Never
Not a member of Pastebin yet? Sign Up, it unlocks many cool features!
  1. + make
  2. make  all-recursive
  3. make[1]: Entering directory `/home/pkgmk/work/libpeas/src/libpeas-1.2.0'
  4. Making all in libpeas
  5. make[2]: Entering directory `/home/pkgmk/work/libpeas/src/libpeas-1.2.0/libpeas'
  6.   GEN    peas-marshal.c
  7.   GEN    peas-marshal.h
  8. make  all-am
  9. make[3]: Entering directory `/home/pkgmk/work/libpeas/src/libpeas-1.2.0/libpeas'
  10.   CC     peas-marshal.lo
  11.   CC     peas-activatable.lo
  12.   CC     peas-debug.lo
  13.   CC     peas-dirs.lo
  14.   CC     peas-engine.lo
  15.   CC     peas-extension.lo
  16.   CC     peas-extension-base.lo
  17.   CC     peas-extension-set.lo
  18.   CC     peas-extension-wrapper.lo
  19.   CC     peas-extension-subclasses.lo
  20.   CC     peas-helpers.lo
  21.   CC     peas-i18n.lo
  22. peas-i18n.c: In function 'peas_gettext':
  23. peas-i18n.c:50:7: warning: statement with no effect [-Wunused-value]
  24. peas-i18n.c:53:7: warning: statement with no effect [-Wunused-value]
  25.   CC     peas-introspection.lo
  26.   CC     peas-object-module.lo
  27.   CC     peas-plugin-info.lo
  28.   CC     peas-plugin-loader.lo
  29.   CCLD   libpeas-1.0.la
  30.   GISCAN Peas-1.0.gir
  31. /home/pkgmk/work/libpeas/src/libpeas-1.2.0/libpeas/tmp-introspectL5vt4F/Peas-1.0.c: In function 'main':
  32. /home/pkgmk/work/libpeas/src/libpeas-1.2.0/libpeas/tmp-introspectL5vt4F/Peas-1.0.c:578:3: warning: 'g_type_init' is deprecated (declared at /usr/include/glib-2.0/gobject/gtype.h:669) [-Wdeprecated-declarations]
  33.   GICOMP Peas-1.0.gir
  34. make[3]: Leaving directory `/home/pkgmk/work/libpeas/src/libpeas-1.2.0/libpeas'
  35. make[2]: Leaving directory `/home/pkgmk/work/libpeas/src/libpeas-1.2.0/libpeas'
  36. Making all in loaders
  37. make[2]: Entering directory `/home/pkgmk/work/libpeas/src/libpeas-1.2.0/loaders'
  38. Making all in c
  39. make[3]: Entering directory `/home/pkgmk/work/libpeas/src/libpeas-1.2.0/loaders/c'
  40.   CC     peas-plugin-loader-c.lo
  41.   CCLD   libcloader.la
  42. make[3]: Leaving directory `/home/pkgmk/work/libpeas/src/libpeas-1.2.0/loaders/c'
  43. make[3]: Entering directory `/home/pkgmk/work/libpeas/src/libpeas-1.2.0/loaders'
  44. make[3]: Nothing to be done for `all-am'.
  45. make[3]: Leaving directory `/home/pkgmk/work/libpeas/src/libpeas-1.2.0/loaders'
  46. make[2]: Leaving directory `/home/pkgmk/work/libpeas/src/libpeas-1.2.0/loaders'
  47. Making all in libpeas-gtk
  48. make[2]: Entering directory `/home/pkgmk/work/libpeas/src/libpeas-1.2.0/libpeas-gtk'
  49.   CC     peas-gtk-configurable.lo
  50.   CC     peas-gtk-disable-plugins-dialog.lo
  51.   CC     peas-gtk-plugin-manager.lo
  52.   CC     peas-gtk-plugin-manager-store.lo
  53.   CC     peas-gtk-plugin-manager-view.lo
  54.   CCLD   libpeas-gtk-1.0.la
  55.   GISCAN PeasGtk-1.0.gir
  56. Couldn't find include 'Gtk-3.0.gir' (search path: ['../libpeas', 'gir-1.0', '/usr/share/gir-1.0', '/usr/share/gir-1.0', '/usr/share/gir-1.0'])
  57. make[2]: *** [PeasGtk-1.0.gir] Error 1
  58. make[2]: Leaving directory `/home/pkgmk/work/libpeas/src/libpeas-1.2.0/libpeas-gtk'
  59. make[1]: *** [all-recursive] Error 1
  60. make[1]: Leaving directory `/home/pkgmk/work/libpeas/src/libpeas-1.2.0'
  61. make: *** [all] Error 2
  62. =======> ERROR: Building '/home/pkgmk/pkg/libpeas#1.2.0-1.pkg.tar.xz' failed.
  63. prt-get: error while install
  64.  
  65. -- Packages where install failed
  66. libpeas
RAW Paste Data
We use cookies for various purposes including analytics. By continuing to use Pastebin, you agree to our use of cookies as described in the Cookies Policy. OK, I Understand
 
Top