SHARE
TWEET

Untitled

a guest Sep 19th, 2019 96 Never
Not a member of Pastebin yet? Sign Up, it unlocks many cool features!
  1. TEST CONTEXT: org.keycloak.testsuite.webauthn.WebAuthnRegisterAndLoginTest
  2.  
  3. Sep 19, 2019 11:40:45 AM org.openqa.selenium.remote.DesiredCapabilities chrome
  4. INFO: Using `new ChromeOptions()` is preferred to `DesiredCapabilities.chrome()`
  5. Sep 19, 2019 11:40:45 AM org.openqa.selenium.remote.DesiredCapabilities chrome
  6. INFO: Using `new ChromeOptions()` is preferred to `DesiredCapabilities.chrome()`
  7. Sep 19, 2019 11:40:46 AM org.arquillian.spacelift.Spacelift$SpaceliftInstance <init>
  8. INFO: Initialized Spacelift from defaults, workspace: /home/mposolda/IdeaProjects/keycloak/testsuite/integration-arquillian/tests/base, cache: /home/mposolda/.spacelift/cache
  9. Drone: downloading chromedriver_linux64.zip from https://chromedriver.storage.googleapis.com/77.0.3865.40/chromedriver_linux64.zip to /home/mposolda/.arquillian/drone/chrome/77.0.3865.40/chromedriver_linux64.zip
  10. .................................
  11. Sep 19, 2019 11:40:50 AM org.jboss.arquillian.drone.webdriver.binary.BinaryFilesUtils extract
  12. INFO: Extracting zip file: /home/mposolda/.arquillian/drone/chrome/77.0.3865.40/chromedriver_linux64.zip to /home/mposolda/IdeaProjects/keycloak/testsuite/integration-arquillian/tests/base/target/drone/b4431816072192a2d36a10fa8cfde344
  13. Sep 19, 2019 11:40:50 AM org.jboss.arquillian.drone.webdriver.binary.handler.AbstractBinaryHandler markAsExecutable
  14. INFO: marking binary file: /home/mposolda/IdeaProjects/keycloak/testsuite/integration-arquillian/tests/base/target/drone/b4431816072192a2d36a10fa8cfde344/chromedriver as executable
  15. Starting ChromeDriver 77.0.3865.40 (f484704e052e0b556f8030b65b953dce96503217-refs/branch-heads/3865@{#442}) on port 23554
  16. Only local connections are allowed.
  17. Please protect ports used by ChromeDriver and related test frameworks to prevent access by malicious code.
  18. Opening in existing browser session.
  19. 11:40:51,022 ERROR [org.keycloak.testsuite.webauthn.WebAuthnRegisterAndLoginTest] [WebAuthnRegisterAndLoginTest] null() FAILED
  20. [ERROR] Tests run: 1, Failures: 0, Errors: 1, Skipped: 0, Time elapsed: 16.851 s <<< FAILURE! - in org.keycloak.testsuite.webauthn.WebAuthnRegisterAndLoginTest
  21. [ERROR] org.keycloak.testsuite.webauthn.WebAuthnRegisterAndLoginTest  Time elapsed: 16.845 s  <<< ERROR!
  22. java.lang.RuntimeException: Could not create statement
  23.     at org.jboss.arquillian.junit.Arquillian.methodBlock(Arquillian.java:313)
  24.     at org.junit.runners.BlockJUnit4ClassRunner.runChild(BlockJUnit4ClassRunner.java:78)
  25.     at org.junit.runners.BlockJUnit4ClassRunner.runChild(BlockJUnit4ClassRunner.java:57)
  26.     at org.junit.runners.ParentRunner$3.run(ParentRunner.java:290)
  27.     at org.junit.runners.ParentRunner$1.schedule(ParentRunner.java:71)
  28.     at org.junit.runners.ParentRunner.runChildren(ParentRunner.java:288)
  29.     at org.junit.runners.ParentRunner.access$000(ParentRunner.java:58)
  30.     at org.junit.runners.ParentRunner$2.evaluate(ParentRunner.java:268)
  31.     at org.jboss.arquillian.junit.Arquillian$2.evaluate(Arquillian.java:166)
  32.     at org.jboss.arquillian.junit.Arquillian.multiExecute(Arquillian.java:350)
  33.     at org.jboss.arquillian.junit.Arquillian.access$200(Arquillian.java:54)
  34.     at org.jboss.arquillian.junit.Arquillian$3.evaluate(Arquillian.java:177)
  35.     at org.junit.runners.ParentRunner.run(ParentRunner.java:363)
  36.     at org.jboss.arquillian.junit.Arquillian.run(Arquillian.java:115)
  37.     at org.apache.maven.surefire.junit4.JUnit4Provider.execute(JUnit4Provider.java:365)
  38.     at org.apache.maven.surefire.junit4.JUnit4Provider.executeWithRerun(JUnit4Provider.java:273)
  39.     at org.apache.maven.surefire.junit4.JUnit4Provider.executeTestSet(JUnit4Provider.java:238)
  40.     at org.apache.maven.surefire.junit4.JUnit4Provider.invoke(JUnit4Provider.java:159)
  41.     at org.apache.maven.surefire.booter.ForkedBooter.invokeProviderInSameClassLoader(ForkedBooter.java:383)
  42.     at org.apache.maven.surefire.booter.ForkedBooter.runSuitesInProcess(ForkedBooter.java:344)
  43.     at org.apache.maven.surefire.booter.ForkedBooter.execute(ForkedBooter.java:125)
  44.     at org.apache.maven.surefire.booter.ForkedBooter.main(ForkedBooter.java:417)
  45. Caused by: org.jboss.arquillian.graphene.enricher.exception.PageObjectInitializationException: Can not instantiate Page Object
  46. class org.keycloak.testsuite.auth.page.AuthServerContextRoot
  47.  declared in:
  48. org.keycloak.testsuite.webauthn.WebAuthnRegisterAndLoginTest
  49.  
  50.     at org.jboss.arquillian.graphene.enricher.PageObjectEnricher.createPage(PageObjectEnricher.java:116)
  51.     at org.jboss.arquillian.graphene.enricher.PageObjectEnricher.enrich(PageObjectEnricher.java:55)
  52.     at org.jboss.arquillian.graphene.enricher.GrapheneEnricher.enrich(GrapheneEnricher.java:55)
  53.     at org.jboss.arquillian.junit.RulesEnricher.enrichInstances(RulesEnricher.java:85)
  54.     at org.jboss.arquillian.junit.RulesEnricher.enrichRulesAndTestInstance(RulesEnricher.java:66)
  55.     at sun.reflect.NativeMethodAccessorImpl.invoke0(Native Method)
  56.     at sun.reflect.NativeMethodAccessorImpl.invoke(NativeMethodAccessorImpl.java:62)
  57.     at sun.reflect.DelegatingMethodAccessorImpl.invoke(DelegatingMethodAccessorImpl.java:43)
  58.     at java.lang.reflect.Method.invoke(Method.java:498)
  59.     at org.jboss.arquillian.core.impl.ObserverImpl.invoke(ObserverImpl.java:86)
  60.     at org.jboss.arquillian.core.impl.EventContextImpl.invokeObservers(EventContextImpl.java:103)
  61.     at org.jboss.arquillian.core.impl.EventContextImpl.proceed(EventContextImpl.java:90)
  62.     at org.jboss.arquillian.container.test.impl.client.ContainerEventController.createContext(ContainerEventController.java:128)
  63.     at org.jboss.arquillian.container.test.impl.client.ContainerEventController.createBeforeContext(ContainerEventController.java:114)
  64.     at sun.reflect.NativeMethodAccessorImpl.invoke0(Native Method)
  65.     at sun.reflect.NativeMethodAccessorImpl.invoke(NativeMethodAccessorImpl.java:62)
  66.     at sun.reflect.DelegatingMethodAccessorImpl.invoke(DelegatingMethodAccessorImpl.java:43)
  67.     at java.lang.reflect.Method.invoke(Method.java:498)
  68.     at org.jboss.arquillian.core.impl.ObserverImpl.invoke(ObserverImpl.java:86)
  69.     at org.jboss.arquillian.core.impl.EventContextImpl.proceed(EventContextImpl.java:95)
  70.     at org.jboss.arquillian.test.impl.TestContextHandler.createTestContext(TestContextHandler.java:116)
  71.     at sun.reflect.NativeMethodAccessorImpl.invoke0(Native Method)
  72.     at sun.reflect.NativeMethodAccessorImpl.invoke(NativeMethodAccessorImpl.java:62)
  73.     at sun.reflect.DelegatingMethodAccessorImpl.invoke(DelegatingMethodAccessorImpl.java:43)
  74.     at java.lang.reflect.Method.invoke(Method.java:498)
  75.     at org.jboss.arquillian.core.impl.ObserverImpl.invoke(ObserverImpl.java:86)
  76.     at org.jboss.arquillian.core.impl.EventContextImpl.proceed(EventContextImpl.java:95)
  77.     at org.jboss.arquillian.test.impl.TestContextHandler.createClassContext(TestContextHandler.java:83)
  78.     at sun.reflect.NativeMethodAccessorImpl.invoke0(Native Method)
  79.     at sun.reflect.NativeMethodAccessorImpl.invoke(NativeMethodAccessorImpl.java:62)
  80.     at sun.reflect.DelegatingMethodAccessorImpl.invoke(DelegatingMethodAccessorImpl.java:43)
  81.     at java.lang.reflect.Method.invoke(Method.java:498)
  82.     at org.jboss.arquillian.core.impl.ObserverImpl.invoke(ObserverImpl.java:86)
  83.     at org.jboss.arquillian.core.impl.EventContextImpl.proceed(EventContextImpl.java:95)
  84.     at org.jboss.arquillian.test.impl.TestContextHandler.createSuiteContext(TestContextHandler.java:69)
  85.     at sun.reflect.NativeMethodAccessorImpl.invoke0(Native Method)
  86.     at sun.reflect.NativeMethodAccessorImpl.invoke(NativeMethodAccessorImpl.java:62)
  87.     at sun.reflect.DelegatingMethodAccessorImpl.invoke(DelegatingMethodAccessorImpl.java:43)
  88.     at java.lang.reflect.Method.invoke(Method.java:498)
  89.     at org.jboss.arquillian.core.impl.ObserverImpl.invoke(ObserverImpl.java:86)
  90.     at org.jboss.arquillian.core.impl.EventContextImpl.proceed(EventContextImpl.java:95)
  91.     at org.jboss.arquillian.core.impl.ManagerImpl.fire(ManagerImpl.java:133)
  92.     at org.jboss.arquillian.core.impl.ManagerImpl.fire(ManagerImpl.java:105)
  93.     at org.jboss.arquillian.test.impl.EventTestRunnerAdaptor.fireCustomLifecycle(EventTestRunnerAdaptor.java:142)
  94.     at org.jboss.arquillian.junit.Arquillian.methodBlock(Arquillian.java:260)
  95.     ... 21 more
  96. Caused by: java.lang.RuntimeException: Unable to instantiate Drone via org.openqa.selenium.chrome.ChromeDriver(Capabilities): org.openqa.selenium.WebDriverException: unknown error: Chrome failed to start: exited normally
  97.   (unknown error: DevToolsActivePort file doesn't exist)
  98.   (The process started from chrome location /usr/bin/google-chrome is no longer running, so ChromeDriver is assuming that Chrome has crashed.)
  99. Build info: version: '3.14.0', revision: 'aacccce0', time: '2018-08-02T20:19:58.91Z'
  100. System info: host: 'mposolda-T580', ip: '192.168.0.101', os.name: 'Linux', os.arch: 'amd64', os.version: '5.0.0-27-generic', java.version: '1.8.0_222'
  101. Driver info: driver.version: ChromeDriver
  102. remote stacktrace: #0 0x559b8652e959 <unknown>
  103.  
  104.     at org.jboss.arquillian.drone.webdriver.factory.SecurityActions.newInstance(SecurityActions.java:166)
  105.     at org.jboss.arquillian.drone.webdriver.factory.ChromeDriverFactory.createInstance(ChromeDriverFactory.java:82)
  106.     at org.jboss.arquillian.drone.webdriver.factory.ChromeDriverFactory.createInstance(ChromeDriverFactory.java:42)
  107.     at org.jboss.arquillian.drone.webdriver.factory.WebDriverFactory.createInstance(WebDriverFactory.java:127)
  108.     at org.jboss.arquillian.drone.webdriver.factory.WebDriverFactory.createInstance(WebDriverFactory.java:38)
  109.     at org.jboss.arquillian.drone.impl.DroneConfigurator$1.createInstance(DroneConfigurator.java:112)
  110.     at org.jboss.arquillian.drone.impl.CachingCallableImpl.call(CachingCallableImpl.java:44)
  111.     at org.jboss.arquillian.core.impl.threading.ThreadedExecutorService$ContextualCallable.call(ThreadedExecutorService.java:88)
  112.     at java.util.concurrent.FutureTask.run(FutureTask.java:266)
  113.     at java.util.concurrent.ThreadPoolExecutor.runWorker(ThreadPoolExecutor.java:1149)
  114.     at java.util.concurrent.ThreadPoolExecutor$Worker.run(ThreadPoolExecutor.java:624)
  115.     at java.lang.Thread.run(Thread.java:748)
  116. Caused by: org.openqa.selenium.WebDriverException: unknown error: Chrome failed to start: exited normally
  117.   (unknown error: DevToolsActivePort file doesn't exist)
  118.   (The process started from chrome location /usr/bin/google-chrome is no longer running, so ChromeDriver is assuming that Chrome has crashed.)
  119. Build info: version: '3.14.0', revision: 'aacccce0', time: '2018-08-02T20:19:58.91Z'
  120. System info: host: 'mposolda-T580', ip: '192.168.0.101', os.name: 'Linux', os.arch: 'amd64', os.version: '5.0.0-27-generic', java.version: '1.8.0_222'
  121. Driver info: driver.version: ChromeDriver
  122. remote stacktrace: #0 0x559b8652e959 <unknown>
  123.  
  124.     at sun.reflect.NativeConstructorAccessorImpl.newInstance0(Native Method)
  125.     at sun.reflect.NativeConstructorAccessorImpl.newInstance(NativeConstructorAccessorImpl.java:62)
  126.     at sun.reflect.DelegatingConstructorAccessorImpl.newInstance(DelegatingConstructorAccessorImpl.java:45)
  127.     at java.lang.reflect.Constructor.newInstance(Constructor.java:423)
  128.     at org.openqa.selenium.remote.W3CHandshakeResponse.lambda$new$0(W3CHandshakeResponse.java:57)
  129.     at org.openqa.selenium.remote.W3CHandshakeResponse.lambda$getResponseFunction$2(W3CHandshakeResponse.java:104)
  130.     at org.openqa.selenium.remote.ProtocolHandshake.lambda$createSession$0(ProtocolHandshake.java:122)
  131.     at java.util.stream.ReferencePipeline$3$1.accept(ReferencePipeline.java:193)
  132.     at java.util.Spliterators$ArraySpliterator.tryAdvance(Spliterators.java:958)
  133.     at java.util.stream.ReferencePipeline.forEachWithCancel(ReferencePipeline.java:126)
  134.     at java.util.stream.AbstractPipeline.copyIntoWithCancel(AbstractPipeline.java:499)
  135.     at java.util.stream.AbstractPipeline.copyInto(AbstractPipeline.java:486)
  136.     at java.util.stream.AbstractPipeline.wrapAndCopyInto(AbstractPipeline.java:472)
  137.     at java.util.stream.FindOps$FindOp.evaluateSequential(FindOps.java:152)
  138.     at java.util.stream.AbstractPipeline.evaluate(AbstractPipeline.java:234)
  139.     at java.util.stream.ReferencePipeline.findFirst(ReferencePipeline.java:531)
  140.     at org.openqa.selenium.remote.ProtocolHandshake.createSession(ProtocolHandshake.java:125)
  141.     at org.openqa.selenium.remote.ProtocolHandshake.createSession(ProtocolHandshake.java:73)
  142.     at org.openqa.selenium.remote.HttpCommandExecutor.execute(HttpCommandExecutor.java:136)
  143.     at org.openqa.selenium.remote.service.DriverCommandExecutor.execute(DriverCommandExecutor.java:83)
  144.     at org.openqa.selenium.remote.RemoteWebDriver.execute(RemoteWebDriver.java:548)
  145.     at org.openqa.selenium.remote.RemoteWebDriver.startSession(RemoteWebDriver.java:212)
  146.     at org.openqa.selenium.remote.RemoteWebDriver.<init>(RemoteWebDriver.java:130)
  147.     at org.openqa.selenium.chrome.ChromeDriver.<init>(ChromeDriver.java:181)
  148.     at org.openqa.selenium.chrome.ChromeDriver.<init>(ChromeDriver.java:147)
  149.     at sun.reflect.NativeConstructorAccessorImpl.newInstance0(Native Method)
  150.     at sun.reflect.NativeConstructorAccessorImpl.newInstance(NativeConstructorAccessorImpl.java:62)
  151.     at sun.reflect.DelegatingConstructorAccessorImpl.newInstance(DelegatingConstructorAccessorImpl.java:45)
  152.     at java.lang.reflect.Constructor.newInstance(Constructor.java:423)
  153.     at org.jboss.arquillian.drone.webdriver.factory.SecurityActions.newInstance(SecurityActions.java:144)
  154.     ... 11 more
  155.  
  156. 11:40:51,028 INFO  [org.keycloak.testsuite.arquillian.undertow.KeycloakOnUndertow] Stopping auth server.
  157. [INFO]
  158. [INFO] Results:
  159. [INFO]
  160. [ERROR] Errors:
  161. [ERROR]   WebAuthnRegisterAndLoginTest.org.keycloak.testsuite.webauthn.WebAuthnRegisterAndLoginTest » Runtime
  162. [INFO]
  163. [ERROR] Tests run: 1, Failures: 0, Errors: 1, Skipped: 0
  164. [INFO]
  165. [INFO] ------------------------------------------------------------------------
  166. [INFO] BUILD FAILURE
  167. [INFO] ------------------------------------------------------------------------
  168. [INFO] Total time: 36.771 s
  169. [INFO] Finished at: 2019-09-19T11:40:51+02:00
  170. [INFO] Final Memory: 130M/1991M
  171. [INFO] ------------------------------------------------------------------------
RAW Paste Data
We use cookies for various purposes including analytics. By continuing to use Pastebin, you agree to our use of cookies as described in the Cookies Policy. OK, I Understand
 
Top