Guest User

error

a guest
Jul 19th, 2014
477
Never
Not a member of Pastebin yet? Sign Up, it unlocks many cool features!
  1. Downloading/unpacking scrapy
  2. Downloading Scrapy-0.24.2-py2-none-any.whl (502kB): 502kB downloaded
  3. Downloading/unpacking pyOpenSSL (from scrapy)
  4. Downloading pyOpenSSL-0.14.tar.gz (128kB): 128kB downloaded
  5. Running setup.py (path:/home/elie/.virtualenvs/stat/build/pyOpenSSL/setup.py) egg_info for package pyOpenSSL
  6.  
  7. warning: no previously-included files matching '*.pyc' found anywhere in distribution
  8. no previously-included directories found matching 'doc/_build'
  9. Requirement already satisfied (use --upgrade to upgrade): six>=1.5.2 in ./.virtualenvs/stat/lib/python2.7/site-packages (from scrapy)
  10. Downloading/unpacking queuelib (from scrapy)
  11. Downloading queuelib-1.1.1.tar.gz
  12. Running setup.py (path:/home/elie/.virtualenvs/stat/build/queuelib/setup.py) egg_info for package queuelib
  13.  
  14. Requirement already satisfied (use --upgrade to upgrade): lxml in ./.virtualenvs/stat/lib/python2.7/site-packages (from scrapy)
  15. Downloading/unpacking w3lib>=1.2 (from scrapy)
  16. Downloading w3lib-1.6.tar.gz
  17. Running setup.py (path:/home/elie/.virtualenvs/stat/build/w3lib/setup.py) egg_info for package w3lib
  18.  
  19. Requirement already satisfied (use --upgrade to upgrade): cssselect>=0.9 in ./.virtualenvs/stat/lib/python2.7/site-packages (from scrapy)
  20. Downloading/unpacking Twisted>=10.0.0 (from scrapy)
  21. Downloading Twisted-14.0.0.tar.bz2 (4.3MB): 4.3MB downloaded
  22. Running setup.py (path:/home/elie/.virtualenvs/stat/build/Twisted/setup.py) egg_info for package Twisted
  23.  
  24. Downloading/unpacking cryptography>=0.2.1 (from pyOpenSSL->scrapy)
  25. Downloading cryptography-0.5.2.tar.gz (319kB): 319kB downloaded
  26. Running setup.py (path:/home/elie/.virtualenvs/stat/build/cryptography/setup.py) egg_info for package cryptography
  27.  
  28. Installed /home/elie/.virtualenvs/stat/build/cryptography/cffi-0.8.6-py2.7-linux-x86_64.egg
  29. Searching for pycparser
  30. Reading https://pypi.python.org/simple/pycparser/
  31. Best match: pycparser 2.10
  32. Downloading https://pypi.python.org/packages/source/p/pycparser/pycparser-2.10.tar.gz#md5=d87aed98c8a9f386aa56d365fe4d515f
  33. Processing pycparser-2.10.tar.gz
  34. Writing /tmp/easy_install-s4tVRv/pycparser-2.10/setup.cfg
  35. Running pycparser-2.10/setup.py -q bdist_egg --dist-dir /tmp/easy_install-s4tVRv/pycparser-2.10/egg-dist-tmp-P_uCK3
  36. zip_safe flag not set; analyzing archive contents...
  37.  
  38. Installed /home/elie/.virtualenvs/stat/build/cryptography/pycparser-2.10-py2.7.egg
  39.  
  40. building '_Cryptography_cffi_684bb40axf342507b' extension
  41. x86_64-linux-gnu-gcc -pthread -fno-strict-aliasing -DNDEBUG -g -fwrapv -O2 -Wall -Wstrict-prototypes -fPIC -I/usr/include/python2.7 -c cryptography/hazmat/primitives/__pycache__/_Cryptography_cffi_684bb40axf342507b.c -o /home/elie/.virtualenvs/stat/build/cryptography/cryptography/hazmat/primitives/__pycache__/cryptography/hazmat/primitives/__pycache__/_Cryptography_cffi_684bb40axf342507b.o
  42. x86_64-linux-gnu-gcc -pthread -shared -Wl,-O1 -Wl,-Bsymbolic-functions -Wl,-Bsymbolic-functions -Wl,-z,relro -fno-strict-aliasing -DNDEBUG -g -fwrapv -O2 -Wall -Wstrict-prototypes -D_FORTIFY_SOURCE=2 -g -fstack-protector --param=ssp-buffer-size=4 -Wformat -Werror=format-security /home/elie/.virtualenvs/stat/build/cryptography/cryptography/hazmat/primitives/__pycache__/cryptography/hazmat/primitives/__pycache__/_Cryptography_cffi_684bb40axf342507b.o -o /home/elie/.virtualenvs/stat/build/cryptography/cryptography/hazmat/primitives/__pycache__/_Cryptography_cffi_684bb40axf342507b.so
  43. building '_Cryptography_cffi_8f86901cxc1767c5a' extension
  44. x86_64-linux-gnu-gcc -pthread -fno-strict-aliasing -DNDEBUG -g -fwrapv -O2 -Wall -Wstrict-prototypes -fPIC -I/usr/include/python2.7 -c cryptography/hazmat/primitives/__pycache__/_Cryptography_cffi_8f86901cxc1767c5a.c -o /home/elie/.virtualenvs/stat/build/cryptography/cryptography/hazmat/primitives/__pycache__/cryptography/hazmat/primitives/__pycache__/_Cryptography_cffi_8f86901cxc1767c5a.o
  45. x86_64-linux-gnu-gcc -pthread -shared -Wl,-O1 -Wl,-Bsymbolic-functions -Wl,-Bsymbolic-functions -Wl,-z,relro -fno-strict-aliasing -DNDEBUG -g -fwrapv -O2 -Wall -Wstrict-prototypes -D_FORTIFY_SOURCE=2 -g -fstack-protector --param=ssp-buffer-size=4 -Wformat -Werror=format-security /home/elie/.virtualenvs/stat/build/cryptography/cryptography/hazmat/primitives/__pycache__/cryptography/hazmat/primitives/__pycache__/_Cryptography_cffi_8f86901cxc1767c5a.o -o /home/elie/.virtualenvs/stat/build/cryptography/cryptography/hazmat/primitives/__pycache__/_Cryptography_cffi_8f86901cxc1767c5a.so
  46. building '_Cryptography_cffi_79a5b0a3x3a8a382' extension
  47. x86_64-linux-gnu-gcc -pthread -fno-strict-aliasing -DNDEBUG -g -fwrapv -O2 -Wall -Wstrict-prototypes -fPIC -I/usr/include/python2.7 -c cryptography/hazmat/bindings/__pycache__/_Cryptography_cffi_79a5b0a3x3a8a382.c -o /home/elie/.virtualenvs/stat/build/cryptography/cryptography/hazmat/bindings/__pycache__/cryptography/hazmat/bindings/__pycache__/_Cryptography_cffi_79a5b0a3x3a8a382.o
  48. cryptography/hazmat/bindings/__pycache__/_Cryptography_cffi_79a5b0a3x3a8a382.c:194:25: fatal error: openssl/aes.h: No such file or directory
  49. #include <openssl/aes.h>
  50. ^
  51. compilation terminated.
  52. Traceback (most recent call last):
  53. File "<string>", line 17, in <module>
  54. File "/home/elie/.virtualenvs/stat/build/cryptography/setup.py", line 174, in <module>
  55. "test": PyTest,
  56. File "/usr/lib/python2.7/distutils/core.py", line 151, in setup
  57. dist.run_commands()
  58. File "/usr/lib/python2.7/distutils/dist.py", line 953, in run_commands
  59. self.run_command(cmd)
  60. File "/usr/lib/python2.7/distutils/dist.py", line 972, in run_command
  61. cmd_obj.run()
  62. File "<string>", line 15, in replacement_run
  63. File "/home/elie/.virtualenvs/stat/local/lib/python2.7/site-packages/setuptools/command/egg_info.py", line 186, in find_sources
  64. mm.run()
  65. File "/home/elie/.virtualenvs/stat/local/lib/python2.7/site-packages/setuptools/command/egg_info.py", line 246, in run
  66. self.add_defaults()
  67. File "/home/elie/.virtualenvs/stat/local/lib/python2.7/site-packages/setuptools/command/egg_info.py", line 282, in add_defaults
  68. sdist.add_defaults(self)
  69. File "/home/elie/.virtualenvs/stat/local/lib/python2.7/site-packages/setuptools/command/sdist.py", line 161, in add_defaults
  70. build_py = self.get_finalized_command('build_py')
  71. File "/usr/lib/python2.7/distutils/cmd.py", line 312, in get_finalized_command
  72. cmd_obj.ensure_finalized()
  73. File "/usr/lib/python2.7/distutils/cmd.py", line 109, in ensure_finalized
  74. self.finalize_options()
  75. File "/home/elie/.virtualenvs/stat/local/lib/python2.7/site-packages/setuptools/command/build_py.py", line 26, in finalize_options
  76. _build_py.finalize_options(self)
  77. File "/usr/lib/python2.7/distutils/command/build_py.py", line 46, in finalize_options
  78. ('force', 'force'))
  79. File "/usr/lib/python2.7/distutils/cmd.py", line 298, in set_undefined_options
  80. src_cmd_obj.ensure_finalized()
  81. File "/usr/lib/python2.7/distutils/cmd.py", line 109, in ensure_finalized
  82. self.finalize_options()
  83. File "/home/elie/.virtualenvs/stat/build/cryptography/setup.py", line 88, in finalize_options
  84. self.distribution.ext_modules = get_ext_modules()
  85. File "/home/elie/.virtualenvs/stat/build/cryptography/setup.py", line 68, in get_ext_modules
  86. OpenSSLBinding().ffi.verifier.get_extension(),
  87. File "cryptography/hazmat/bindings/openssl/binding.py", line 89, in __init__
  88. self._ensure_ffi_initialized()
  89. File "cryptography/hazmat/bindings/openssl/binding.py", line 109, in _ensure_ffi_initialized
  90. libraries=libraries,
  91. File "cryptography/hazmat/bindings/utils.py", line 80, in build_ffi
  92. extra_link_args=extra_link_args,
  93. File "/home/elie/.virtualenvs/stat/build/cryptography/cffi-0.8.6-py2.7-linux-x86_64.egg/cffi/api.py", line 340, in verify
  94. lib = self.verifier.load_library()
  95. File "/home/elie/.virtualenvs/stat/build/cryptography/cffi-0.8.6-py2.7-linux-x86_64.egg/cffi/verifier.py", line 74, in load_library
  96. self._compile_module()
  97. File "/home/elie/.virtualenvs/stat/build/cryptography/cffi-0.8.6-py2.7-linux-x86_64.egg/cffi/verifier.py", line 139, in _compile_module
  98. outputfilename = ffiplatform.compile(tmpdir, self.get_extension())
  99. File "/home/elie/.virtualenvs/stat/build/cryptography/cffi-0.8.6-py2.7-linux-x86_64.egg/cffi/ffiplatform.py", line 25, in compile
  100. outputfilename = _build(tmpdir, ext)
  101. File "/home/elie/.virtualenvs/stat/build/cryptography/cffi-0.8.6-py2.7-linux-x86_64.egg/cffi/ffiplatform.py", line 51, in _build
  102. raise VerificationError('%s: %s' % (e.__class__.__name__, e))
  103. cffi.ffiplatform.VerificationError: CompileError: command 'x86_64-linux-gnu-gcc' failed with exit status 1
  104. Complete output from command python setup.py egg_info:
  105.  
  106.  
  107. Installed /home/elie/.virtualenvs/stat/build/cryptography/cffi-0.8.6-py2.7-linux-x86_64.egg
  108.  
  109. Searching for pycparser
  110.  
  111. Reading https://pypi.python.org/simple/pycparser/
  112.  
  113. Best match: pycparser 2.10
  114.  
  115. Downloading https://pypi.python.org/packages/source/p/pycparser/pycparser-2.10.tar.gz#md5=d87aed98c8a9f386aa56d365fe4d515f
  116.  
  117. Processing pycparser-2.10.tar.gz
  118.  
  119. Writing /tmp/easy_install-s4tVRv/pycparser-2.10/setup.cfg
  120.  
  121. Running pycparser-2.10/setup.py -q bdist_egg --dist-dir /tmp/easy_install-s4tVRv/pycparser-2.10/egg-dist-tmp-P_uCK3
  122.  
  123. zip_safe flag not set; analyzing archive contents...
  124.  
  125.  
  126.  
  127. Installed /home/elie/.virtualenvs/stat/build/cryptography/pycparser-2.10-py2.7.egg
  128.  
  129. running egg_info
  130.  
  131. creating pip-egg-info/cryptography.egg-info
  132.  
  133. writing requirements to pip-egg-info/cryptography.egg-info/requires.txt
  134.  
  135. writing pip-egg-info/cryptography.egg-info/PKG-INFO
  136.  
  137. writing top-level names to pip-egg-info/cryptography.egg-info/top_level.txt
  138.  
  139. writing dependency_links to pip-egg-info/cryptography.egg-info/dependency_links.txt
  140.  
  141. writing manifest file 'pip-egg-info/cryptography.egg-info/SOURCES.txt'
  142.  
  143. warning: manifest_maker: standard file '-c' not found
  144.  
  145.  
  146.  
  147. running build_ext
  148.  
  149. building '_Cryptography_cffi_684bb40axf342507b' extension
  150.  
  151. creating /home/elie/.virtualenvs/stat/build/cryptography/cryptography/hazmat/primitives/__pycache__/cryptography
  152.  
  153. creating /home/elie/.virtualenvs/stat/build/cryptography/cryptography/hazmat/primitives/__pycache__/cryptography/hazmat
  154.  
  155. creating /home/elie/.virtualenvs/stat/build/cryptography/cryptography/hazmat/primitives/__pycache__/cryptography/hazmat/primitives
  156.  
  157. creating /home/elie/.virtualenvs/stat/build/cryptography/cryptography/hazmat/primitives/__pycache__/cryptography/hazmat/primitives/__pycache__
  158.  
  159. x86_64-linux-gnu-gcc -pthread -fno-strict-aliasing -DNDEBUG -g -fwrapv -O2 -Wall -Wstrict-prototypes -fPIC -I/usr/include/python2.7 -c cryptography/hazmat/primitives/__pycache__/_Cryptography_cffi_684bb40axf342507b.c -o /home/elie/.virtualenvs/stat/build/cryptography/cryptography/hazmat/primitives/__pycache__/cryptography/hazmat/primitives/__pycache__/_Cryptography_cffi_684bb40axf342507b.o
  160.  
  161. x86_64-linux-gnu-gcc -pthread -shared -Wl,-O1 -Wl,-Bsymbolic-functions -Wl,-Bsymbolic-functions -Wl,-z,relro -fno-strict-aliasing -DNDEBUG -g -fwrapv -O2 -Wall -Wstrict-prototypes -D_FORTIFY_SOURCE=2 -g -fstack-protector --param=ssp-buffer-size=4 -Wformat -Werror=format-security /home/elie/.virtualenvs/stat/build/cryptography/cryptography/hazmat/primitives/__pycache__/cryptography/hazmat/primitives/__pycache__/_Cryptography_cffi_684bb40axf342507b.o -o /home/elie/.virtualenvs/stat/build/cryptography/cryptography/hazmat/primitives/__pycache__/_Cryptography_cffi_684bb40axf342507b.so
  162.  
  163. running build_ext
  164.  
  165. building '_Cryptography_cffi_8f86901cxc1767c5a' extension
  166.  
  167. x86_64-linux-gnu-gcc -pthread -fno-strict-aliasing -DNDEBUG -g -fwrapv -O2 -Wall -Wstrict-prototypes -fPIC -I/usr/include/python2.7 -c cryptography/hazmat/primitives/__pycache__/_Cryptography_cffi_8f86901cxc1767c5a.c -o /home/elie/.virtualenvs/stat/build/cryptography/cryptography/hazmat/primitives/__pycache__/cryptography/hazmat/primitives/__pycache__/_Cryptography_cffi_8f86901cxc1767c5a.o
  168.  
  169. x86_64-linux-gnu-gcc -pthread -shared -Wl,-O1 -Wl,-Bsymbolic-functions -Wl,-Bsymbolic-functions -Wl,-z,relro -fno-strict-aliasing -DNDEBUG -g -fwrapv -O2 -Wall -Wstrict-prototypes -D_FORTIFY_SOURCE=2 -g -fstack-protector --param=ssp-buffer-size=4 -Wformat -Werror=format-security /home/elie/.virtualenvs/stat/build/cryptography/cryptography/hazmat/primitives/__pycache__/cryptography/hazmat/primitives/__pycache__/_Cryptography_cffi_8f86901cxc1767c5a.o -o /home/elie/.virtualenvs/stat/build/cryptography/cryptography/hazmat/primitives/__pycache__/_Cryptography_cffi_8f86901cxc1767c5a.so
  170.  
  171. running build_ext
  172.  
  173. building '_Cryptography_cffi_79a5b0a3x3a8a382' extension
  174.  
  175. creating /home/elie/.virtualenvs/stat/build/cryptography/cryptography/hazmat/bindings/__pycache__/cryptography
  176.  
  177. creating /home/elie/.virtualenvs/stat/build/cryptography/cryptography/hazmat/bindings/__pycache__/cryptography/hazmat
  178.  
  179. creating /home/elie/.virtualenvs/stat/build/cryptography/cryptography/hazmat/bindings/__pycache__/cryptography/hazmat/bindings
  180.  
  181. creating /home/elie/.virtualenvs/stat/build/cryptography/cryptography/hazmat/bindings/__pycache__/cryptography/hazmat/bindings/__pycache__
  182.  
  183. x86_64-linux-gnu-gcc -pthread -fno-strict-aliasing -DNDEBUG -g -fwrapv -O2 -Wall -Wstrict-prototypes -fPIC -I/usr/include/python2.7 -c cryptography/hazmat/bindings/__pycache__/_Cryptography_cffi_79a5b0a3x3a8a382.c -o /home/elie/.virtualenvs/stat/build/cryptography/cryptography/hazmat/bindings/__pycache__/cryptography/hazmat/bindings/__pycache__/_Cryptography_cffi_79a5b0a3x3a8a382.o
  184.  
  185. cryptography/hazmat/bindings/__pycache__/_Cryptography_cffi_79a5b0a3x3a8a382.c:194:25: fatal error: openssl/aes.h: No such file or directory
  186.  
  187. #include <openssl/aes.h>
  188.  
  189. ^
  190.  
  191. compilation terminated.
  192.  
  193. Traceback (most recent call last):
  194.  
  195. File "<string>", line 17, in <module>
  196.  
  197. File "/home/elie/.virtualenvs/stat/build/cryptography/setup.py", line 174, in <module>
  198.  
  199. "test": PyTest,
  200.  
  201. File "/usr/lib/python2.7/distutils/core.py", line 151, in setup
  202.  
  203. dist.run_commands()
  204.  
  205. File "/usr/lib/python2.7/distutils/dist.py", line 953, in run_commands
  206.  
  207. self.run_command(cmd)
  208.  
  209. File "/usr/lib/python2.7/distutils/dist.py", line 972, in run_command
  210.  
  211. cmd_obj.run()
  212.  
  213. File "<string>", line 15, in replacement_run
  214.  
  215. File "/home/elie/.virtualenvs/stat/local/lib/python2.7/site-packages/setuptools/command/egg_info.py", line 186, in find_sources
  216.  
  217. mm.run()
  218.  
  219. File "/home/elie/.virtualenvs/stat/local/lib/python2.7/site-packages/setuptools/command/egg_info.py", line 246, in run
  220.  
  221. self.add_defaults()
  222.  
  223. File "/home/elie/.virtualenvs/stat/local/lib/python2.7/site-packages/setuptools/command/egg_info.py", line 282, in add_defaults
  224.  
  225. sdist.add_defaults(self)
  226.  
  227. File "/home/elie/.virtualenvs/stat/local/lib/python2.7/site-packages/setuptools/command/sdist.py", line 161, in add_defaults
  228.  
  229. build_py = self.get_finalized_command('build_py')
  230.  
  231. File "/usr/lib/python2.7/distutils/cmd.py", line 312, in get_finalized_command
  232.  
  233. cmd_obj.ensure_finalized()
  234.  
  235. File "/usr/lib/python2.7/distutils/cmd.py", line 109, in ensure_finalized
  236.  
  237. self.finalize_options()
  238.  
  239. File "/home/elie/.virtualenvs/stat/local/lib/python2.7/site-packages/setuptools/command/build_py.py", line 26, in finalize_options
  240.  
  241. _build_py.finalize_options(self)
  242.  
  243. File "/usr/lib/python2.7/distutils/command/build_py.py", line 46, in finalize_options
  244.  
  245. ('force', 'force'))
  246.  
  247. File "/usr/lib/python2.7/distutils/cmd.py", line 298, in set_undefined_options
  248.  
  249. src_cmd_obj.ensure_finalized()
  250.  
  251. File "/usr/lib/python2.7/distutils/cmd.py", line 109, in ensure_finalized
  252.  
  253. self.finalize_options()
  254.  
  255. File "/home/elie/.virtualenvs/stat/build/cryptography/setup.py", line 88, in finalize_options
  256.  
  257. self.distribution.ext_modules = get_ext_modules()
  258.  
  259. File "/home/elie/.virtualenvs/stat/build/cryptography/setup.py", line 68, in get_ext_modules
  260.  
  261. OpenSSLBinding().ffi.verifier.get_extension(),
  262.  
  263. File "cryptography/hazmat/bindings/openssl/binding.py", line 89, in __init__
  264.  
  265. self._ensure_ffi_initialized()
  266.  
  267. File "cryptography/hazmat/bindings/openssl/binding.py", line 109, in _ensure_ffi_initialized
  268.  
  269. libraries=libraries,
  270.  
  271. File "cryptography/hazmat/bindings/utils.py", line 80, in build_ffi
  272.  
  273. extra_link_args=extra_link_args,
  274.  
  275. File "/home/elie/.virtualenvs/stat/build/cryptography/cffi-0.8.6-py2.7-linux-x86_64.egg/cffi/api.py", line 340, in verify
  276.  
  277. lib = self.verifier.load_library()
  278.  
  279. File "/home/elie/.virtualenvs/stat/build/cryptography/cffi-0.8.6-py2.7-linux-x86_64.egg/cffi/verifier.py", line 74, in load_library
  280.  
  281. self._compile_module()
  282.  
  283. File "/home/elie/.virtualenvs/stat/build/cryptography/cffi-0.8.6-py2.7-linux-x86_64.egg/cffi/verifier.py", line 139, in _compile_module
  284.  
  285. outputfilename = ffiplatform.compile(tmpdir, self.get_extension())
  286.  
  287. File "/home/elie/.virtualenvs/stat/build/cryptography/cffi-0.8.6-py2.7-linux-x86_64.egg/cffi/ffiplatform.py", line 25, in compile
  288.  
  289. outputfilename = _build(tmpdir, ext)
  290.  
  291. File "/home/elie/.virtualenvs/stat/build/cryptography/cffi-0.8.6-py2.7-linux-x86_64.egg/cffi/ffiplatform.py", line 51, in _build
  292.  
  293. raise VerificationError('%s: %s' % (e.__class__.__name__, e))
  294.  
  295. cffi.ffiplatform.VerificationError: CompileError: command 'x86_64-linux-gnu-gcc' failed with exit status 1
  296.  
  297. ----------------------------------------
  298. Cleaning up...
  299. Command python setup.py egg_info failed with error code 1 in /home/elie/.virtualenvs/stat/build/cryptography
  300. Storing debug log for failure in /home/elie/.pip/pip.log
RAW Paste Data