SHARE
TWEET

asd

a guest Jun 19th, 2019 67 Never
Not a member of Pastebin yet? Sign Up, it unlocks many cool features!
  1. C:\Users\daniel\.gradle\caches\transforms-1\files-1.1\core-1.0.0.aar\0479f461a14b00e69af710c41d00adca\res\values\values.xml: AAPT: error: resource android:attr/fontVariationSettings not found.
  2.  
  3. C:\Users\daniel\.gradle\caches\transforms-1\files-1.1\core-1.0.0.aar\0479f461a14b00e69af710c41d00adca\res\values\values.xml: AAPT: error: resource android:attr/ttcIndex not found.
  4.  
  5. D:\Infomedia\myindihome37\platforms\android\build\intermediates\incremental\mergeDebugResources\merged.dir\values\values.xml:153: error: resource android:attr/fontVariationSettings not found.
  6. D:\Infomedia\myindihome37\platforms\android\build\intermediates\incremental\mergeDebugResources\merged.dir\values\values.xml:153: error: resource android:attr/ttcIndex not found.
  7. error: failed linking references.
  8.  
  9. Failed to execute aapt
  10. com.android.ide.common.process.ProcessException: Failed to execute aapt
  11.         at com.android.builder.core.AndroidBuilder.processResources(AndroidBuilder.java:796)
  12.         at com.android.build.gradle.tasks.ProcessAndroidResources.invokeAaptForSplit(ProcessAndroidResources.java:551)
  13.         at com.android.build.gradle.tasks.ProcessAndroidResources.doFullTaskAction(ProcessAndroidResources.java:285)
  14.         at com.android.build.gradle.internal.tasks.IncrementalTask.taskAction(IncrementalTask.java:109)
  15.         at sun.reflect.GeneratedMethodAccessor1282.invoke(Unknown Source)
  16.         at sun.reflect.DelegatingMethodAccessorImpl.invoke(DelegatingMethodAccessorImpl.java:43)
  17.         at java.lang.reflect.Method.invoke(Method.java:498)
  18.         at org.gradle.internal.reflect.JavaMethod.invoke(JavaMethod.java:73)
  19.         at org.gradle.api.internal.project.taskfactory.DefaultTaskClassInfoStore$IncrementalTaskAction.doExecute(DefaultTaskClassInfoStore.java:173)
  20.         at org.gradle.api.internal.project.taskfactory.DefaultTaskClassInfoStore$StandardTaskAction.execute(DefaultTaskClassInfoStore.java:134)
  21.         at org.gradle.api.internal.project.taskfactory.DefaultTaskClassInfoStore$StandardTaskAction.execute(DefaultTaskClassInfoStore.java:121)
  22.         at org.gradle.api.internal.tasks.execution.ExecuteActionsTaskExecuter$1.run(ExecuteActionsTaskExecuter.java:122)
  23.         at org.gradle.internal.progress.DefaultBuildOperationExecutor$RunnableBuildOperationWorker.execute(DefaultBuildOperationExecutor.java:336)
  24.         at org.gradle.internal.progress.DefaultBuildOperationExecutor$RunnableBuildOperationWorker.execute(DefaultBuildOperationExecutor.java:328)
  25.         at org.gradle.internal.progress.DefaultBuildOperationExecutor.execute(DefaultBuildOperationExecutor.java:197)
  26.         at org.gradle.internal.progress.DefaultBuildOperationExecutor.run(DefaultBuildOperationExecutor.java:107)
  27.         at org.gradle.api.internal.tasks.execution.ExecuteActionsTaskExecuter.executeAction(ExecuteActionsTaskExecuter.java:111)
  28.         at org.gradle.api.internal.tasks.execution.ExecuteActionsTaskExecuter.executeActions(ExecuteActionsTaskExecuter.java:92)
  29.         at org.gradle.api.internal.tasks.execution.ExecuteActionsTaskExecuter.execute(ExecuteActionsTaskExecuter.java:70)
  30.         at org.gradle.api.internal.tasks.execution.SkipUpToDateTaskExecuter.execute(SkipUpToDateTaskExecuter.java:63)
  31.         at org.gradle.api.internal.tasks.execution.ResolveTaskOutputCachingStateExecuter.execute(ResolveTaskOutputCachingStateExecuter.java:54)
  32.         at org.gradle.api.internal.tasks.execution.ValidatingTaskExecuter.execute(ValidatingTaskExecuter.java:58)
  33.         at org.gradle.api.internal.tasks.execution.SkipEmptySourceFilesTaskExecuter.execute(SkipEmptySourceFilesTaskExecuter.java:88)
  34.         at org.gradle.api.internal.tasks.execution.ResolveTaskArtifactStateTaskExecuter.execute(ResolveTaskArtifactStateTaskExecuter.java:52)
  35.         at org.gradle.api.internal.tasks.execution.SkipTaskWithNoActionsExecuter.execute(SkipTaskWithNoActionsExecuter.java:52)
  36.         at org.gradle.api.internal.tasks.execution.SkipOnlyIfTaskExecuter.execute(SkipOnlyIfTaskExecuter.java:54)
  37.         at org.gradle.api.internal.tasks.execution.ExecuteAtMostOnceTaskExecuter.execute(ExecuteAtMostOnceTaskExecuter.java:43)
  38.         at org.gradle.api.internal.tasks.execution.CatchExceptionTaskExecuter.execute(CatchExceptionTaskExecuter.java:34)
  39.         at org.gradle.execution.taskgraph.DefaultTaskGraphExecuter$EventFiringTaskWorker$1.run(DefaultTaskGraphExecuter.java:248)
  40.         at org.gradle.internal.progress.DefaultBuildOperationExecutor$RunnableBuildOperationWorker.execute(DefaultBuildOperationExecutor.java:336)
  41.         at org.gradle.internal.progress.DefaultBuildOperationExecutor$RunnableBuildOperationWorker.execute(DefaultBuildOperationExecutor.java:328)
  42.         at org.gradle.internal.progress.DefaultBuildOperationExecutor.execute(DefaultBuildOperationExecutor.java:197)
  43.         at org.gradle.internal.progress.DefaultBuildOperationExecutor.run(DefaultBuildOperationExecutor.java:107)
  44.         at org.gradle.execution.taskgraph.DefaultTaskGraphExecuter$EventFiringTaskWorker.execute(DefaultTaskGraphExecuter.java:241)
  45.         at org.gradle.execution.taskgraph.DefaultTaskGraphExecuter$EventFiringTaskWorker.execute(DefaultTaskGraphExecuter.java:230)
  46.         at org.gradle.execution.taskgraph.DefaultTaskPlanExecutor$TaskExecutorWorker.processTask(DefaultTaskPlanExecutor.java:124)
  47.         at org.gradle.execution.taskgraph.DefaultTaskPlanExecutor$TaskExecutorWorker.access$200(DefaultTaskPlanExecutor.java:80)
  48.         at org.gradle.execution.taskgraph.DefaultTaskPlanExecutor$TaskExecutorWorker$1.execute(DefaultTaskPlanExecutor.java:105)
  49.         at org.gradle.execution.taskgraph.DefaultTaskPlanExecutor$TaskExecutorWorker$1.execute(DefaultTaskPlanExecutor.java:99)
  50.         at org.gradle.execution.taskgraph.DefaultTaskExecutionPlan.execute(DefaultTaskExecutionPlan.java:625)
  51.         at org.gradle.execution.taskgraph.DefaultTaskExecutionPlan.executeWithTask(DefaultTaskExecutionPlan.java:580)
  52.         at org.gradle.execution.taskgraph.DefaultTaskPlanExecutor$TaskExecutorWorker.run(DefaultTaskPlanExecutor.java:99)
  53.         at org.gradle.internal.concurrent.ExecutorPolicy$CatchAndRecordFailures.onExecute(ExecutorPolicy.java:63)
  54.         at org.gradle.internal.concurrent.ManagedExecutorImpl$1.run(ManagedExecutorImpl.java:46)
  55.         at java.util.concurrent.ThreadPoolExecutor.runWorker(ThreadPoolExecutor.java:1149)
  56.         at java.util.concurrent.ThreadPoolExecutor$Worker.run(ThreadPoolExecutor.java:624)
  57.         at org.gradle.internal.concurrent.ThreadFactoryImpl$ManagedThreadRunnable.run(ThreadFactoryImpl.java:55)
  58.         at java.lang.Thread.run(Thread.java:748)
  59. Caused by: java.util.concurrent.ExecutionException: java.util.concurrent.ExecutionException: com.android.tools.aapt2.Aapt2Exception: AAPT2 error: check logs for details
  60.         at com.google.common.util.concurrent.AbstractFuture.getDoneValue(AbstractFuture.java:503)
  61.         at com.google.common.util.concurrent.AbstractFuture.get(AbstractFuture.java:482)
  62.         at com.google.common.util.concurrent.AbstractFuture$TrustedFuture.get(AbstractFuture.java:79)
  63.         at com.android.builder.core.AndroidBuilder.processResources(AndroidBuilder.java:794)
  64.         ... 47 more
  65. Caused by: java.util.concurrent.ExecutionException: com.android.tools.aapt2.Aapt2Exception: AAPT2 error: check logs for details
  66.         at com.google.common.util.concurrent.AbstractFuture.getDoneValue(AbstractFuture.java:503)
  67.         at com.google.common.util.concurrent.AbstractFuture.get(AbstractFuture.java:462)
  68.         at com.google.common.util.concurrent.AbstractFuture$TrustedFuture.get(AbstractFuture.java:79)
  69.         at com.android.builder.internal.aapt.v2.QueueableAapt2.lambda$makeValidatedPackage$1(QueueableAapt2.java:179)
  70.         at java.util.concurrent.ThreadPoolExecutor.runWorker(ThreadPoolExecutor.java:1149)
  71.         at java.util.concurrent.ThreadPoolExecutor$Worker.run(ThreadPoolExecutor.java:624)
  72.         ... 1 more
  73. Caused by: com.android.tools.aapt2.Aapt2Exception: AAPT2 error: check logs for details
  74.         at com.android.builder.png.AaptProcess$NotifierProcessOutput.handleOutput(AaptProcess.java:454)
  75.         at com.android.builder.png.AaptProcess$NotifierProcessOutput.err(AaptProcess.java:411)
  76.         at com.android.builder.png.AaptProcess$ProcessOutputFacade.err(AaptProcess.java:332)
  77.         at com.android.utils.GrabProcessOutput$1.run(GrabProcessOutput.java:104)
  78. :processDebugResources FAILED
  79. 28 actionable tasks: 5 executed, 23 up-to-date
  80.  
  81. FAILURE: Build failed with an exception.
  82.  
  83. * What went wrong:
  84. Execution failed for task ':processDebugResources'.
  85. > Failed to execute aapt
  86.  
  87. * Try:
  88. Run with --stacktrace option to get the stack trace. Run with --info or --debug option to get more log output.
  89.  
  90. * Get more help at https://help.gradle.org
  91.  
  92. BUILD FAILED in 15s
  93.  
  94. D:\Infomedia\myindihome37>if "1" == "0" goto mainEnd
  95.  
  96. D:\Infomedia\myindihome37>rem Set variable GRADLE_EXIT_CONSOLE if you need the _script_ return code instead of
  97.  
  98. D:\Infomedia\myindihome37>rem the _cmd.exe /c_ return code!
  99.  
  100. D:\Infomedia\myindihome37>if not "" == "" exit 1
  101.  
  102. D:\Infomedia\myindihome37>exit /b 1
  103. Command finished with error code 1: cmd /s /c "D:\Infomedia\myindihome37\platforms\android\gradlew.bat cdvBuildDebug -b D:\Infomedia\myindihome37\platforms\android\build.gradle -Dorg.gradle.daemon=true -Dorg.gradle.jvmargs=-Xmx2048m -Pandroid.useDeprecatedNdk=true"
  104. cmd: Command failed with exit code 1 Error output:
  105. C:\Users\daniel\.gradle\caches\transforms-1\files-1.1\core-1.0.0.aar\0479f461a14b00e69af710c41d00adca\res\values\values.xml: AAPT: error: resource android:attr/fontVariationSettings not found.
  106.  
  107. C:\Users\daniel\.gradle\caches\transforms-1\files-1.1\core-1.0.0.aar\0479f461a14b00e69af710c41d00adca\res\values\values.xml: AAPT: error: resource android:attr/ttcIndex not found.
  108.  
  109. D:\Infomedia\myindihome37\platforms\android\build\intermediates\incremental\mergeDebugResources\merged.dir\values\values.xml:153: error: resource android:attr/fontVariationSettings not found.
  110. D:\Infomedia\myindihome37\platforms\android\build\intermediates\incremental\mergeDebugResources\merged.dir\values\values.xml:153: error: resource android:attr/ttcIndex not found.
  111. error: failed linking references.
  112.  
  113. Failed to execute aapt
  114. com.android.ide.common.process.ProcessException: Failed to execute aapt
  115.         at com.android.builder.core.AndroidBuilder.processResources(AndroidBuilder.java:796)
  116.         at com.android.build.gradle.tasks.ProcessAndroidResources.invokeAaptForSplit(ProcessAndroidResources.java:551)
  117.         at com.android.build.gradle.tasks.ProcessAndroidResources.doFullTaskAction(ProcessAndroidResources.java:285)
  118.         at com.android.build.gradle.internal.tasks.IncrementalTask.taskAction(IncrementalTask.java:109)
  119.         at sun.reflect.GeneratedMethodAccessor1282.invoke(Unknown Source)
  120.         at sun.reflect.DelegatingMethodAccessorImpl.invoke(DelegatingMethodAccessorImpl.java:43)
  121.         at java.lang.reflect.Method.invoke(Method.java:498)
  122.         at org.gradle.internal.reflect.JavaMethod.invoke(JavaMethod.java:73)
  123.         at org.gradle.api.internal.project.taskfactory.DefaultTaskClassInfoStore$IncrementalTaskAction.doExecute(DefaultTaskClassInfoStore.java:173)
  124.         at org.gradle.api.internal.project.taskfactory.DefaultTaskClassInfoStore$StandardTaskAction.execute(DefaultTaskClassInfoStore.java:134)
  125.         at org.gradle.api.internal.project.taskfactory.DefaultTaskClassInfoStore$StandardTaskAction.execute(DefaultTaskClassInfoStore.java:121)
  126.         at org.gradle.api.internal.tasks.execution.ExecuteActionsTaskExecuter$1.run(ExecuteActionsTaskExecuter.java:122)
  127.         at org.gradle.internal.progress.DefaultBuildOperationExecutor$RunnableBuildOperationWorker.execute(DefaultBuildOperationExecutor.java:336)
  128.         at org.gradle.internal.progress.DefaultBuildOperationExecutor$RunnableBuildOperationWorker.execute(DefaultBuildOperationExecutor.java:328)
  129.         at org.gradle.internal.progress.DefaultBuildOperationExecutor.execute(DefaultBuildOperationExecutor.java:197)
  130.         at org.gradle.internal.progress.DefaultBuildOperationExecutor.run(DefaultBuildOperationExecutor.java:107)
  131.         at org.gradle.api.internal.tasks.execution.ExecuteActionsTaskExecuter.executeAction(ExecuteActionsTaskExecuter.java:111)
  132.         at org.gradle.api.internal.tasks.execution.ExecuteActionsTaskExecuter.executeActions(ExecuteActionsTaskExecuter.java:92)
  133.         at org.gradle.api.internal.tasks.execution.ExecuteActionsTaskExecuter.execute(ExecuteActionsTaskExecuter.java:70)
  134.         at org.gradle.api.internal.tasks.execution.SkipUpToDateTaskExecuter.execute(SkipUpToDateTaskExecuter.java:63)
  135.         at org.gradle.api.internal.tasks.execution.ResolveTaskOutputCachingStateExecuter.execute(ResolveTaskOutputCachingStateExecuter.java:54)
  136.         at org.gradle.api.internal.tasks.execution.ValidatingTaskExecuter.execute(ValidatingTaskExecuter.java:58)
  137.         at org.gradle.api.internal.tasks.execution.SkipEmptySourceFilesTaskExecuter.execute(SkipEmptySourceFilesTaskExecuter.java:88)
  138.         at org.gradle.api.internal.tasks.execution.ResolveTaskArtifactStateTaskExecuter.execute(ResolveTaskArtifactStateTaskExecuter.java:52)
  139.         at org.gradle.api.internal.tasks.execution.SkipTaskWithNoActionsExecuter.execute(SkipTaskWithNoActionsExecuter.java:52)
  140.         at org.gradle.api.internal.tasks.execution.SkipOnlyIfTaskExecuter.execute(SkipOnlyIfTaskExecuter.java:54)
  141.         at org.gradle.api.internal.tasks.execution.ExecuteAtMostOnceTaskExecuter.execute(ExecuteAtMostOnceTaskExecuter.java:43)
  142.         at org.gradle.api.internal.tasks.execution.CatchExceptionTaskExecuter.execute(CatchExceptionTaskExecuter.java:34)
  143.         at org.gradle.execution.taskgraph.DefaultTaskGraphExecuter$EventFiringTaskWorker$1.run(DefaultTaskGraphExecuter.java:248)
  144.         at org.gradle.internal.progress.DefaultBuildOperationExecutor$RunnableBuildOperationWorker.execute(DefaultBuildOperationExecutor.java:336)
  145.         at org.gradle.internal.progress.DefaultBuildOperationExecutor$RunnableBuildOperationWorker.execute(DefaultBuildOperationExecutor.java:328)
  146.         at org.gradle.internal.progress.DefaultBuildOperationExecutor.execute(DefaultBuildOperationExecutor.java:197)
  147.         at org.gradle.internal.progress.DefaultBuildOperationExecutor.run(DefaultBuildOperationExecutor.java:107)
  148.         at org.gradle.execution.taskgraph.DefaultTaskGraphExecuter$EventFiringTaskWorker.execute(DefaultTaskGraphExecuter.java:241)
  149.         at org.gradle.execution.taskgraph.DefaultTaskGraphExecuter$EventFiringTaskWorker.execute(DefaultTaskGraphExecuter.java:230)
  150.         at org.gradle.execution.taskgraph.DefaultTaskPlanExecutor$TaskExecutorWorker.processTask(DefaultTaskPlanExecutor.java:124)
  151.         at org.gradle.execution.taskgraph.DefaultTaskPlanExecutor$TaskExecutorWorker.access$200(DefaultTaskPlanExecutor.java:80)
  152.         at org.gradle.execution.taskgraph.DefaultTaskPlanExecutor$TaskExecutorWorker$1.execute(DefaultTaskPlanExecutor.java:105)
  153.         at org.gradle.execution.taskgraph.DefaultTaskPlanExecutor$TaskExecutorWorker$1.execute(DefaultTaskPlanExecutor.java:99)
  154.         at org.gradle.execution.taskgraph.DefaultTaskExecutionPlan.execute(DefaultTaskExecutionPlan.java:625)
  155.         at org.gradle.execution.taskgraph.DefaultTaskExecutionPlan.executeWithTask(DefaultTaskExecutionPlan.java:580)
  156.         at org.gradle.execution.taskgraph.DefaultTaskPlanExecutor$TaskExecutorWorker.run(DefaultTaskPlanExecutor.java:99)
  157.         at org.gradle.internal.concurrent.ExecutorPolicy$CatchAndRecordFailures.onExecute(ExecutorPolicy.java:63)
  158.         at org.gradle.internal.concurrent.ManagedExecutorImpl$1.run(ManagedExecutorImpl.java:46)
  159.         at java.util.concurrent.ThreadPoolExecutor.runWorker(ThreadPoolExecutor.java:1149)
  160.         at java.util.concurrent.ThreadPoolExecutor$Worker.run(ThreadPoolExecutor.java:624)
  161.         at org.gradle.internal.concurrent.ThreadFactoryImpl$ManagedThreadRunnable.run(ThreadFactoryImpl.java:55)
  162.         at java.lang.Thread.run(Thread.java:748)
  163. Caused by: java.util.concurrent.ExecutionException: java.util.concurrent.ExecutionException: com.android.tools.aapt2.Aapt2Exception: AAPT2 error: check logs for details
  164.         at com.google.common.util.concurrent.AbstractFuture.getDoneValue(AbstractFuture.java:503)
  165.         at com.google.common.util.concurrent.AbstractFuture.get(AbstractFuture.java:482)
  166.         at com.google.common.util.concurrent.AbstractFuture$TrustedFuture.get(AbstractFuture.java:79)
  167.         at com.android.builder.core.AndroidBuilder.processResources(AndroidBuilder.java:794)
  168.         ... 47 more
  169. Caused by: java.util.concurrent.ExecutionException: com.android.tools.aapt2.Aapt2Exception: AAPT2 error: check logs for details
  170.         at com.google.common.util.concurrent.AbstractFuture.getDoneValue(AbstractFuture.java:503)
  171.         at com.google.common.util.concurrent.AbstractFuture.get(AbstractFuture.java:462)
  172.         at com.google.common.util.concurrent.AbstractFuture$TrustedFuture.get(AbstractFuture.java:79)
  173.         at com.android.builder.internal.aapt.v2.QueueableAapt2.lambda$makeValidatedPackage$1(QueueableAapt2.java:179)
  174.         at java.util.concurrent.ThreadPoolExecutor.runWorker(ThreadPoolExecutor.java:1149)
  175.         at java.util.concurrent.ThreadPoolExecutor$Worker.run(ThreadPoolExecutor.java:624)
  176.         ... 1 more
  177. Caused by: com.android.tools.aapt2.Aapt2Exception: AAPT2 error: check logs for details
  178.         at com.android.builder.png.AaptProcess$NotifierProcessOutput.handleOutput(AaptProcess.java:454)
  179.         at com.android.builder.png.AaptProcess$NotifierProcessOutput.err(AaptProcess.java:411)
  180.         at com.android.builder.png.AaptProcess$ProcessOutputFacade.err(AaptProcess.java:332)
  181.         at com.android.utils.GrabProcessOutput$1.run(GrabProcessOutput.java:104)
  182.  
  183. FAILURE: Build failed with an exception.
  184.  
  185. * What went wrong:
  186. Execution failed for task ':processDebugResources'.
  187. > Failed to execute aapt
  188.  
  189. * Try:
  190. Run with --stacktrace option to get the stack trace. Run with --info or --debug option to get more log output.
  191.  
  192. * Get more help at https://help.gradle.org
  193.  
  194. BUILD FAILED in 15s
  195. Picked up _JAVA_OPTIONS: -Xmx512M
  196. Error: cmd: Command failed with exit code 1 Error output:
  197. C:\Users\daniel\.gradle\caches\transforms-1\files-1.1\core-1.0.0.aar\0479f461a14b00e69af710c41d00adca\res\values\values.xml: AAPT: error: resource android:attr/fontVariationSettings not found.
  198.  
  199. C:\Users\daniel\.gradle\caches\transforms-1\files-1.1\core-1.0.0.aar\0479f461a14b00e69af710c41d00adca\res\values\values.xml: AAPT: error: resource android:attr/ttcIndex not found.
  200.  
  201. D:\Infomedia\myindihome37\platforms\android\build\intermediates\incremental\mergeDebugResources\merged.dir\values\values.xml:153: error: resource android:attr/fontVariationSettings not found.
  202. D:\Infomedia\myindihome37\platforms\android\build\intermediates\incremental\mergeDebugResources\merged.dir\values\values.xml:153: error: resource android:attr/ttcIndex not found.
  203. error: failed linking references.
  204.  
  205. Failed to execute aapt
  206. com.android.ide.common.process.ProcessException: Failed to execute aapt
  207.         at com.android.builder.core.AndroidBuilder.processResources(AndroidBuilder.java:796)
  208.         at com.android.build.gradle.tasks.ProcessAndroidResources.invokeAaptForSplit(ProcessAndroidResources.java:551)
  209.         at com.android.build.gradle.tasks.ProcessAndroidResources.doFullTaskAction(ProcessAndroidResources.java:285)
  210.         at com.android.build.gradle.internal.tasks.IncrementalTask.taskAction(IncrementalTask.java:109)
  211.         at sun.reflect.GeneratedMethodAccessor1282.invoke(Unknown Source)
  212.         at sun.reflect.DelegatingMethodAccessorImpl.invoke(DelegatingMethodAccessorImpl.java:43)
  213.         at java.lang.reflect.Method.invoke(Method.java:498)
  214.         at org.gradle.internal.reflect.JavaMethod.invoke(JavaMethod.java:73)
  215.         at org.gradle.api.internal.project.taskfactory.DefaultTaskClassInfoStore$IncrementalTaskAction.doExecute(DefaultTaskClassInfoStore.java:173)
  216.         at org.gradle.api.internal.project.taskfactory.DefaultTaskClassInfoStore$StandardTaskAction.execute(DefaultTaskClassInfoStore.java:134)
  217.         at org.gradle.api.internal.project.taskfactory.DefaultTaskClassInfoStore$StandardTaskAction.execute(DefaultTaskClassInfoStore.java:121)
  218.         at org.gradle.api.internal.tasks.execution.ExecuteActionsTaskExecuter$1.run(ExecuteActionsTaskExecuter.java:122)
  219.         at org.gradle.internal.progress.DefaultBuildOperationExecutor$RunnableBuildOperationWorker.execute(DefaultBuildOperationExecutor.java:336)
  220.         at org.gradle.internal.progress.DefaultBuildOperationExecutor$RunnableBuildOperationWorker.execute(DefaultBuildOperationExecutor.java:328)
  221.         at org.gradle.internal.progress.DefaultBuildOperationExecutor.execute(DefaultBuildOperationExecutor.java:197)
  222.         at org.gradle.internal.progress.DefaultBuildOperationExecutor.run(DefaultBuildOperationExecutor.java:107)
  223.         at org.gradle.api.internal.tasks.execution.ExecuteActionsTaskExecuter.executeAction(ExecuteActionsTaskExecuter.java:111)
  224.         at org.gradle.api.internal.tasks.execution.ExecuteActionsTaskExecuter.executeActions(ExecuteActionsTaskExecuter.java:92)
  225.         at org.gradle.api.internal.tasks.execution.ExecuteActionsTaskExecuter.execute(ExecuteActionsTaskExecuter.java:70)
  226.         at org.gradle.api.internal.tasks.execution.SkipUpToDateTaskExecuter.execute(SkipUpToDateTaskExecuter.java:63)
  227.         at org.gradle.api.internal.tasks.execution.ResolveTaskOutputCachingStateExecuter.execute(ResolveTaskOutputCachingStateExecuter.java:54)
  228.         at org.gradle.api.internal.tasks.execution.ValidatingTaskExecuter.execute(ValidatingTaskExecuter.java:58)
  229.         at org.gradle.api.internal.tasks.execution.SkipEmptySourceFilesTaskExecuter.execute(SkipEmptySourceFilesTaskExecuter.java:88)
  230.         at org.gradle.api.internal.tasks.execution.ResolveTaskArtifactStateTaskExecuter.execute(ResolveTaskArtifactStateTaskExecuter.java:52)
  231.         at org.gradle.api.internal.tasks.execution.SkipTaskWithNoActionsExecuter.execute(SkipTaskWithNoActionsExecuter.java:52)
  232.         at org.gradle.api.internal.tasks.execution.SkipOnlyIfTaskExecuter.execute(SkipOnlyIfTaskExecuter.java:54)
  233.         at org.gradle.api.internal.tasks.execution.ExecuteAtMostOnceTaskExecuter.execute(ExecuteAtMostOnceTaskExecuter.java:43)
  234.         at org.gradle.api.internal.tasks.execution.CatchExceptionTaskExecuter.execute(CatchExceptionTaskExecuter.java:34)
  235.         at org.gradle.execution.taskgraph.DefaultTaskGraphExecuter$EventFiringTaskWorker$1.run(DefaultTaskGraphExecuter.java:248)
  236.         at org.gradle.internal.progress.DefaultBuildOperationExecutor$RunnableBuildOperationWorker.execute(DefaultBuildOperationExecutor.java:336)
  237.         at org.gradle.internal.progress.DefaultBuildOperationExecutor$RunnableBuildOperationWorker.execute(DefaultBuildOperationExecutor.java:328)
  238.         at org.gradle.internal.progress.DefaultBuildOperationExecutor.execute(DefaultBuildOperationExecutor.java:197)
  239.         at org.gradle.internal.progress.DefaultBuildOperationExecutor.run(DefaultBuildOperationExecutor.java:107)
  240.         at org.gradle.execution.taskgraph.DefaultTaskGraphExecuter$EventFiringTaskWorker.execute(DefaultTaskGraphExecuter.java:241)
  241.         at org.gradle.execution.taskgraph.DefaultTaskGraphExecuter$EventFiringTaskWorker.execute(DefaultTaskGraphExecuter.java:230)
  242.         at org.gradle.execution.taskgraph.DefaultTaskPlanExecutor$TaskExecutorWorker.processTask(DefaultTaskPlanExecutor.java:124)
  243.         at org.gradle.execution.taskgraph.DefaultTaskPlanExecutor$TaskExecutorWorker.access$200(DefaultTaskPlanExecutor.java:80)
  244.         at org.gradle.execution.taskgraph.DefaultTaskPlanExecutor$TaskExecutorWorker$1.execute(DefaultTaskPlanExecutor.java:105)
  245.         at org.gradle.execution.taskgraph.DefaultTaskPlanExecutor$TaskExecutorWorker$1.execute(DefaultTaskPlanExecutor.java:99)
  246.         at org.gradle.execution.taskgraph.DefaultTaskExecutionPlan.execute(DefaultTaskExecutionPlan.java:625)
  247.         at org.gradle.execution.taskgraph.DefaultTaskExecutionPlan.executeWithTask(DefaultTaskExecutionPlan.java:580)
  248.         at org.gradle.execution.taskgraph.DefaultTaskPlanExecutor$TaskExecutorWorker.run(DefaultTaskPlanExecutor.java:99)
  249.         at org.gradle.internal.concurrent.ExecutorPolicy$CatchAndRecordFailures.onExecute(ExecutorPolicy.java:63)
  250.         at org.gradle.internal.concurrent.ManagedExecutorImpl$1.run(ManagedExecutorImpl.java:46)
  251.         at java.util.concurrent.ThreadPoolExecutor.runWorker(ThreadPoolExecutor.java:1149)
  252.         at java.util.concurrent.ThreadPoolExecutor$Worker.run(ThreadPoolExecutor.java:624)
  253.         at org.gradle.internal.concurrent.ThreadFactoryImpl$ManagedThreadRunnable.run(ThreadFactoryImpl.java:55)
  254.         at java.lang.Thread.run(Thread.java:748)
  255. Caused by: java.util.concurrent.ExecutionException: java.util.concurrent.ExecutionException: com.android.tools.aapt2.Aapt2Exception: AAPT2 error: check logs for details
  256.         at com.google.common.util.concurrent.AbstractFuture.getDoneValue(AbstractFuture.java:503)
  257.         at com.google.common.util.concurrent.AbstractFuture.get(AbstractFuture.java:482)
  258.         at com.google.common.util.concurrent.AbstractFuture$TrustedFuture.get(AbstractFuture.java:79)
  259.         at com.android.builder.core.AndroidBuilder.processResources(AndroidBuilder.java:794)
  260.         ... 47 more
  261. Caused by: java.util.concurrent.ExecutionException: com.android.tools.aapt2.Aapt2Exception: AAPT2 error: check logs for details
  262.         at com.google.common.util.concurrent.AbstractFuture.getDoneValue(AbstractFuture.java:503)
  263.         at com.google.common.util.concurrent.AbstractFuture.get(AbstractFuture.java:462)
  264.         at com.google.common.util.concurrent.AbstractFuture$TrustedFuture.get(AbstractFuture.java:79)
  265.         at com.android.builder.internal.aapt.v2.QueueableAapt2.lambda$makeValidatedPackage$1(QueueableAapt2.java:179)
  266.         at java.util.concurrent.ThreadPoolExecutor.runWorker(ThreadPoolExecutor.java:1149)
  267.         at java.util.concurrent.ThreadPoolExecutor$Worker.run(ThreadPoolExecutor.java:624)
  268.         ... 1 more
  269. Caused by: com.android.tools.aapt2.Aapt2Exception: AAPT2 error: check logs for details
  270.         at com.android.builder.png.AaptProcess$NotifierProcessOutput.handleOutput(AaptProcess.java:454)
  271.         at com.android.builder.png.AaptProcess$NotifierProcessOutput.err(AaptProcess.java:411)
  272.         at com.android.builder.png.AaptProcess$ProcessOutputFacade.err(AaptProcess.java:332)
  273.         at com.android.utils.GrabProcessOutput$1.run(GrabProcessOutput.java:104)
  274.  
  275. FAILURE: Build failed with an exception.
  276.  
  277. * What went wrong:
  278. Execution failed for task ':processDebugResources'.
  279. > Failed to execute aapt
  280.  
  281. * Try:
  282. Run with --stacktrace option to get the stack trace. Run with --info or --debug option to get more log output.
  283.  
  284. * Get more help at https://help.gradle.org
  285.  
  286. BUILD FAILED in 15s
  287. Picked up _JAVA_OPTIONS: -Xmx512M
  288.     at ChildProcess.whenDone (D:\Infomedia\myindihome37\platforms\android\cordova\node_modules\cordova-common\src\superspawn.js:169:23)
  289.     at ChildProcess.emit (events.js:198:13)
  290.     at maybeClose (internal/child_process.js:982:16)
  291.     at Process.ChildProcess._handle.onexit (internal/child_process.js:259:5)
  292. [ERROR] An error occurred while running subprocess cordova.
  293.  
  294.         cordova.cmd build android --verbose exited with exit code 1.
  295.  
  296.         Re-running this command with the --verbose flag may provide more
  297.         information.
  298.   ionic:utils-process onBeforeExit handler: 'process.exit' received +0ms
  299.   ionic:utils-process onBeforeExit handler: running 2 functions +1ms
  300.   ionic:utils-process error while killing process tree for 8648: { Error: Command failed: taskkill /pid 8648 /T /F
  301.   ionic:utils-process ERROR: The process "8648" not found.
  302.   ionic:utils-process
  303.   ionic:utils-process     at ChildProcess.exithandler (child_process.js:294:12)
  304.   ionic:utils-process     at ChildProcess.emit (events.js:198:13)
  305.   ionic:utils-process     at maybeClose (internal/child_process.js:982:16)
  306.   ionic:utils-process     at Process.ChildProcess._handle.onexit (internal/child_process.js:259:5)
  307.   ionic:utils-process   killed: false,
  308.   ionic:utils-process   code: 128,
  309.   ionic:utils-process   signal: null,
  310.   ionic:utils-process   cmd: 'taskkill /pid 8648 /T /F' } +143ms
  311.   ionic:utils-process onBeforeExit handler: error from function: { Error: Command failed: taskkill /pid 8648 /T /F
  312.   ionic:utils-process ERROR: The process "8648" not found.
  313.   ionic:utils-process
  314.   ionic:utils-process     at ChildProcess.exithandler (child_process.js:294:12)
  315.   ionic:utils-process     at ChildProcess.emit (events.js:198:13)
  316.   ionic:utils-process     at maybeClose (internal/child_process.js:982:16)
  317.   ionic:utils-process     at Process.ChildProcess._handle.onexit (internal/child_process.js:259:5)
  318.   ionic:utils-process   killed: false,
  319.   ionic:utils-process   code: 128,
  320.   ionic:utils-process   signal: null,
  321.   ionic:utils-process   cmd: 'taskkill /pid 8648 /T /F' } +3ms
  322.   ionic:utils-process error while killing process tree for 19644: { Error: Command failed: taskkill /pid 19644 /T /F
  323.   ionic:utils-process ERROR: The process "19644" not found.
  324.   ionic:utils-process
  325.   ionic:utils-process     at ChildProcess.exithandler (child_process.js:294:12)
  326.   ionic:utils-process     at ChildProcess.emit (events.js:198:13)
  327.   ionic:utils-process     at maybeClose (internal/child_process.js:982:16)
  328.   ionic:utils-process     at Socket.stream.socket.on (internal/child_process.js:389:11)
  329.   ionic:utils-process     at Socket.emit (events.js:198:13)
  330.   ionic:utils-process     at Pipe._handle.close (net.js:606:12)
  331.   ionic:utils-process   killed: false,
  332.   ionic:utils-process   code: 128,
  333.   ionic:utils-process   signal: null,
  334.   ionic:utils-process   cmd: 'taskkill /pid 19644 /T /F' } +1ms
  335.   ionic:utils-process onBeforeExit handler: error from function: { Error: Command failed: taskkill /pid 19644 /T /F
  336.   ionic:utils-process ERROR: The process "19644" not found.
  337.   ionic:utils-process
  338.   ionic:utils-process     at ChildProcess.exithandler (child_process.js:294:12)
  339.   ionic:utils-process     at ChildProcess.emit (events.js:198:13)
  340.   ionic:utils-process     at maybeClose (internal/child_process.js:982:16)
  341.   ionic:utils-process     at Socket.stream.socket.on (internal/child_process.js:389:11)
  342.   ionic:utils-process     at Socket.emit (events.js:198:13)
  343.   ionic:utils-process     at Pipe._handle.close (net.js:606:12)
  344.   ionic:utils-process   killed: false,
  345.   ionic:utils-process   code: 128,
  346.   ionic:utils-process   signal: null,
  347.   ionic:utils-process   cmd: 'taskkill /pid 19644 /T /F' } +1ms
  348.   ionic:utils-process processExit: exiting (exit code: 1) +1ms
RAW Paste Data
We use cookies for various purposes including analytics. By continuing to use Pastebin, you agree to our use of cookies as described in the Cookies Policy. OK, I Understand
 
Top