Not a member of Pastebin yet?
Sign Up,
it unlocks many cool features!
- Executing Gradle task: runClient
- Build info: MCreator 2023.3.36712, fabric-1.20.1, 64-bit, 16334 MB, Windows 10, JVM 17.0.7, JAVA_HOME: E:\MCreator\jdk, started on: 2023-12-14-00:32:08
- > Configure project :
- Fabric Loom: 1.2.7
- > Task :compileJava FAILED
- E:\1. Minecraft\My Mods\ProjectOasis\src\main\java\net\projectoasis\procedures\ArtefactPropertyValueProviderProcedure.java:17: error: class, interface, enum, or record expected public ArtefactPropertyValueProviderProcedure() {
- ^
- E:\1. Minecraft\My Mods\ProjectOasis\src\main\java\net\projectoasis\procedures\ArtefactPropertyValueProviderProcedure.java:20: error: class, interface, enum, or record expected dependencies.put("world", level);
- ^
- E:\1. Minecraft\My Mods\ProjectOasis\src\main\java\net\projectoasis\procedures\ArtefactPropertyValueProviderProcedure.java:21: error: class, interface, enum, or record expected dependencies.put("entity", player);
- ^
- E:\1. Minecraft\My Mods\ProjectOasis\src\main\java\net\projectoasis\procedures\ArtefactPropertyValueProviderProcedure.java:22: error: class, interface, enum, or record expected dependencies.put("x", player.getX());
- ^
- E:\1. Minecraft\My Mods\ProjectOasis\src\main\java\net\projectoasis\procedures\ArtefactPropertyValueProviderProcedure.java:23: error: class, interface, enum, or record expected dependencies.put("y", player.getY());
- ^
- E:\1. Minecraft\My Mods\ProjectOasis\src\main\java\net\projectoasis\procedures\ArtefactPropertyValueProviderProcedure.java:24: error: class, interface, enum, or record expected dependencies.put("z", player.getZ());
- ^
- E:\1. Minecraft\My Mods\ProjectOasis\src\main\java\net\projectoasis\procedures\ArtefactPropertyValueProviderProcedure.java:25: error: class, interface, enum, or record expected execute(dependencies);
- ^
- E:\1. Minecraft\My Mods\ProjectOasis\src\main\java\net\projectoasis\procedures\ArtefactPropertyValueProviderProcedure.java:26: error: class, interface, enum, or record expected return InteractionResultHolder.pass(player.getItemInHand(hand));
- ^
- E:\1. Minecraft\My Mods\ProjectOasis\src\main\java\net\projectoasis\procedures\ArtefactPropertyValueProviderProcedure.java:27: error: class, interface, enum, or record expected });
- ^
- E:\1. Minecraft\My Mods\ProjectOasis\src\main\java\net\projectoasis\procedures\ArtefactPropertyValueProviderProcedure.java:28: error: class, interface, enum, or record expected }
- ^
- E:\1. Minecraft\My Mods\ProjectOasis\src\main\java\net\projectoasis\procedures\ArtefactPropertyValueProviderProcedure.java:29: error: class, interface, enum, or record expected public static double execute(
- ^
- E:\1. Minecraft\My Mods\ProjectOasis\src\main\java\net\projectoasis\procedures\ArtefactPropertyValueProviderProcedure.java:33: error: class, interface, enum, or record expected }
- ^
- E:\1. Minecraft\My Mods\ProjectOasis\src\main\java\net\projectoasis\procedures\ArtefactPropertyValueProviderProcedure.java:35: error: class, interface, enum, or record expected @Nullable Event event,
- ^
- E:\1. Minecraft\My Mods\ProjectOasis\src\main\java\net\projectoasis\procedures\ArtefactPropertyValueProviderProcedure.java:41: error: class, interface, enum, or record expected if ((entity instanceof LivingEntity _livEnt ? _livEnt.getMainHandItem():ItemStack.EMPTY).getItem() == ProjectOasisModItems.ARTEFACT) {if (Math.random()<0.5) {return
- ^
- E:\1. Minecraft\My Mods\ProjectOasis\src\main\java\net\projectoasis\procedures\ArtefactPropertyValueProviderProcedure.java:42: error: class, interface, enum, or record expected 1;}else{return
- ^
- E:\1. Minecraft\My Mods\ProjectOasis\src\main\java\net\projectoasis\procedures\ArtefactPropertyValueProviderProcedure.java:43: error: class, interface, enum, or record expected 2;}}return
- ^
- E:\1. Minecraft\My Mods\ProjectOasis\src\main\java\net\projectoasis\procedures\ArtefactPropertyValueProviderProcedure.java:45: error: class, interface, enum, or record expected }
- ^
- 17 errors
- FAILURE: Build failed with an exception.
- * What went wrong:
- Execution failed for task ':compileJava'.
- > Compilation failed; see the compiler error output for details.
- * Try:
- > Run with --info option to get more log output.
- > Run with --scan to get full insights.
- BUILD FAILED in 40s
- 1 actionable task: 1 executed
- BUILD FAILED
- Task completed in 1 minute and 38 seconds
Advertisement
Add Comment
Please, Sign In to add comment