Guest User

Untitled

a guest
Dec 19th, 2015
109
Never
Not a member of Pastebin yet? Sign Up, it unlocks many cool features!
  1. >E:\Downloads\MCreator\forge\build\sources\java\mod\mcreator\mcreator_test.java:254: error: cannot find symbol
  2. > world.setBlockState(new BlockPos(i, j, k), Blocks.chest.getDefaultState(), 3);
  3. > ^
  4. > symbol: class BlockPos
  5. > location: class mcreator_test
  6. >E:\Downloads\MCreator\forge\build\sources\java\mod\mcreator\mcreator_test.java:254: error: cannot find symbol
  7. > world.setBlockState(new BlockPos(i, j, k), Blocks.chest.getDefaultState(), 3);
  8. > ^
  9. > symbol: method getDefaultState()
  10. > location: variable chest of type BlockChest
  11. >E:\Downloads\MCreator\forge\build\sources\java\mod\mcreator\mcreator_test.java:255: error: cannot find symbol
  12. >world.setBlockState(new BlockPos(i, j, k), Blocks.chest.getDefaultState());
  13. > ^
  14. > symbol: class BlockPos
  15. > location: class mcreator_test
  16. >E:\Downloads\MCreator\forge\build\sources\java\mod\mcreator\mcreator_test.java:255: error: cannot find symbol
  17. >world.setBlockState(new BlockPos(i, j, k), Blocks.chest.getDefaultState());
  18. > ^
  19. > symbol: method getDefaultState()
  20. > location: variable chest of type BlockChest
  21. >E:\Downloads\MCreator\forge\build\sources\java\mod\mcreator\mcreator_test.java:256: error: cannot find symbol
  22. >TileEntityChest chest = (TileEntityChest) world.getTileEntity(new BlockPos(i, j, k));
  23. > ^
  24. > symbol: class BlockPos
  25. > location: class mcreator_test
  26. >E:\Downloads\MCreator\forge\build\sources\java\mod\mcreator\mcreator_test.java:257: error: cannot find symbol
  27. >chest.setInventorySlotContents(0, new ItemStack(stone, 64));
  28. > ^
  29. > symbol: variable stone
  30. > location: class mcreator_test
  31. >6 errors
  32. >:compileJava FAILED
  33. >FAILURE: Build failed with an exception.
  34. >* What went wrong:
  35. >Execution failed for task ':compileJava'.
  36. >> Compilation failed; see the compiler error output for details.
  37. >* Try:
  38. >Run with --stacktrace option to get the stack trace. Run with --info or --debug option to get more log output.
RAW Paste Data