SHARE
TWEET

Untitled

a guest Nov 16th, 2019 104 Never
Not a member of Pastebin yet? Sign Up, it unlocks many cool features!
  1. ##[section]Starting: VSBuild
  2. ==============================================================================
  3. Task         : Visual Studio build
  4. Description  : Build with MSBuild and set the Visual Studio version property
  5. Version      : 1.151.2
  6. Author       : Microsoft Corporation
  7. Help         : https://docs.microsoft.com/azure/devops/pipelines/tasks/build/visual-studio-build
  8. ==============================================================================
  9. ##[command]"D:\a\_tasks\VSBuild_71a9a2d3-a98a-4caa-96ab-affca411ecda\1.151.2\ps_modules\MSBuildHelpers\vswhere.exe" -version [16.0,17.0) -latest -format json
  10. ##[command]"C:\Program Files (x86)\Microsoft Visual Studio\2019\Enterprise\MSBuild\Current\Bin\msbuild.exe" "D:\a\1\s\BeeWare.sln" /nologo /nr:false /dl:CentralLogger,"D:\a\_tasks\VSBuild_71a9a2d3-a98a-4caa-96ab-affca411ecda\1.151.2\ps_modules\MSBuildHelpers\Microsoft.TeamFoundation.DistributedTask.MSBuild.Logger.dll";"RootDetailId=6837ea5a-a513-47e7-9720-df68bb2efe7e|SolutionDir=D:\a\1\s"*ForwardingLogger,"D:\a\_tasks\VSBuild_71a9a2d3-a98a-4caa-96ab-affca411ecda\1.151.2\ps_modules\MSBuildHelpers\Microsoft.TeamFoundation.DistributedTask.MSBuild.Logger.dll" /p:AppxBundlePlatforms="x86|x64|ARM" /p:AppxPackageDir="D:\a\1\a\AppxPackages\\" /p:AppxBundle=Always /p:UapAppxPackageBuildMode=StoreUpload /p:platform="x86" /p:configuration="Release" /p:VisualStudioVersion="16.0" /p:_MSDeployUserAgent="VSTS_b60d4a55-1b9d-4e34-844f-92b26a3c6588_build_1_0"
  11. Building the projects in this solution one at a time. To enable parallel build, please add the "-m" switch.
  12. Build started 11/17/2019 2:37:22 AM.
  13. Project "D:\a\1\s\BeeWare.sln" on node 1 (default targets).
  14. ValidateSolutionConfiguration:
  15.   Building solution configuration "Release|x86".
  16. Project "D:\a\1\s\BeeWare.sln" (1) is building "D:\a\1\s\BeeWare\BeeWare.vcxproj" (2) on node 1 (default targets).
  17. PrepareForBuild:
  18.   Creating directory "Release\".
  19.   Creating directory "D:\a\1\s\Release\".
  20.   Creating directory "Release\BeeWare.tlog\".
  21. InitializeBuildStatus:
  22.   Creating "Release\BeeWare.tlog\unsuccessfulbuild" because "AlwaysCreate" was specified.
  23. ClCompile:
  24.   C:\Program Files (x86)\Microsoft Visual Studio\2019\Enterprise\VC\Tools\MSVC\14.23.28105\bin\HostX86\x86\CL.exe /c /Zi /nologo /W3 /WX- /diagnostics:column /sdl /O2 /Oi /Oy- /GL /D _MBCS /Gm- /EHsc /MD /GS /Gy /fp:precise /permissive- /Zc:wchar_t /Zc:forScope /Zc:inline /Fo"Release\\" /Fd"Release\vc142.pdb" /Gd /TP /analyze- /FC /errorReport:queue bhop.cpp MemoryManager.cpp
  25.   bhop.cpp
  26. ##[error]BeeWare\MemoryManager.h(16,25): Error C2039: 'string': is not a member of 'std'
  27. D:\a\1\s\BeeWare\MemoryManager.h(16,25): error C2039: 'string': is not a member of 'std' [D:\a\1\s\BeeWare\BeeWare.vcxproj]
  28. C:\Program Files (x86)\Microsoft Visual Studio\2019\Enterprise\VC\Tools\MSVC\14.23.28105\include\vector(20): message : see declaration of 'std' [D:\a\1\s\BeeWare\BeeWare.vcxproj]
  29. ##[error]BeeWare\MemoryManager.h(16,31): Error C4430: missing type specifier - int assumed. Note: C++ does not support default-int
  30. D:\a\1\s\BeeWare\MemoryManager.h(16,31): error C4430: missing type specifier - int assumed. Note: C++ does not support default-int [D:\a\1\s\BeeWare\BeeWare.vcxproj]
  31. ##[error]BeeWare\MemoryManager.h(16,31): Error C2143: syntax error: missing ',' before '&'
  32. D:\a\1\s\BeeWare\MemoryManager.h(16,31): error C2143: syntax error: missing ',' before '&' [D:\a\1\s\BeeWare\BeeWare.vcxproj]
  33. ##[error]BeeWare\MemoryManager.h(17,29): Error C2039: 'string': is not a member of 'std'
  34. D:\a\1\s\BeeWare\MemoryManager.h(17,29): error C2039: 'string': is not a member of 'std' [D:\a\1\s\BeeWare\BeeWare.vcxproj]
  35. C:\Program Files (x86)\Microsoft Visual Studio\2019\Enterprise\VC\Tools\MSVC\14.23.28105\include\vector(20): message : see declaration of 'std' [D:\a\1\s\BeeWare\BeeWare.vcxproj]
  36. ##[error]BeeWare\MemoryManager.h(17,35): Error C4430: missing type specifier - int assumed. Note: C++ does not support default-int
  37. D:\a\1\s\BeeWare\MemoryManager.h(17,35): error C4430: missing type specifier - int assumed. Note: C++ does not support default-int [D:\a\1\s\BeeWare\BeeWare.vcxproj]
  38. ##[error]BeeWare\MemoryManager.h(17,35): Error C2143: syntax error: missing ',' before '&'
  39. D:\a\1\s\BeeWare\MemoryManager.h(17,35): error C2143: syntax error: missing ',' before '&' [D:\a\1\s\BeeWare\BeeWare.vcxproj]
  40. ##[error]BeeWare\MemoryManager.h(19,27): Error C2039: 'string': is not a member of 'std'
  41. D:\a\1\s\BeeWare\MemoryManager.h(19,27): error C2039: 'string': is not a member of 'std' [D:\a\1\s\BeeWare\BeeWare.vcxproj]
  42. C:\Program Files (x86)\Microsoft Visual Studio\2019\Enterprise\VC\Tools\MSVC\14.23.28105\include\vector(20): message : see declaration of 'std' [D:\a\1\s\BeeWare\BeeWare.vcxproj]
  43. ##[error]BeeWare\MemoryManager.h(19,50): Error C4430: missing type specifier - int assumed. Note: C++ does not support default-int
  44. D:\a\1\s\BeeWare\MemoryManager.h(19,50): error C4430: missing type specifier - int assumed. Note: C++ does not support default-int [D:\a\1\s\BeeWare\BeeWare.vcxproj]
  45. ##[error]BeeWare\MemoryManager.h(19,33): Error C2143: syntax error: missing ',' before '&'
  46. D:\a\1\s\BeeWare\MemoryManager.h(19,33): error C2143: syntax error: missing ',' before '&' [D:\a\1\s\BeeWare\BeeWare.vcxproj]
  47. ##[error]BeeWare\bhop.cpp(14,38): Error C2664: 'MemoryManager::MemoryManager(MemoryManager &&)': cannot convert argument 1 from 'const char [9]' to 'const int'
  48. D:\a\1\s\BeeWare\bhop.cpp(14,38): error C2664: 'MemoryManager::MemoryManager(MemoryManager &&)': cannot convert argument 1 from 'const char [9]' to 'const int' [D:\a\1\s\BeeWare\BeeWare.vcxproj]
  49. D:\a\1\s\BeeWare\bhop.cpp(14,27): message : There is no context in which this conversion is possible [D:\a\1\s\BeeWare\BeeWare.vcxproj]
  50. D:\a\1\s\BeeWare\MemoryManager.h(19,2): message : see declaration of 'MemoryManager::MemoryManager' [D:\a\1\s\BeeWare\BeeWare.vcxproj]
  51. ##[error]BeeWare\bhop.cpp(23,5): Error C2664: 'bool MemoryManager::GrabModule(const int)': cannot convert argument 1 from 'const char [11]' to 'const int'
  52. D:\a\1\s\BeeWare\bhop.cpp(23,5): error C2664: 'bool MemoryManager::GrabModule(const int)': cannot convert argument 1 from 'const char [11]' to 'const int' [D:\a\1\s\BeeWare\BeeWare.vcxproj]
  53. D:\a\1\s\BeeWare\bhop.cpp(23,23): message : There is no context in which this conversion is possible [D:\a\1\s\BeeWare\BeeWare.vcxproj]
  54.   MemoryManager.cpp
  55. D:\a\1\s\BeeWare\MemoryManager.h(17,7): message : see declaration of 'MemoryManager::GrabModule' [D:\a\1\s\BeeWare\BeeWare.vcxproj]
  56. ##[error]BeeWare\MemoryManager.h(16,25): Error C2039: 'string': is not a member of 'std'
  57. D:\a\1\s\BeeWare\MemoryManager.h(16,25): error C2039: 'string': is not a member of 'std' [D:\a\1\s\BeeWare\BeeWare.vcxproj]
  58. C:\Program Files (x86)\Microsoft Visual Studio\2019\Enterprise\VC\Tools\MSVC\14.23.28105\include\vector(20): message : see declaration of 'std' [D:\a\1\s\BeeWare\BeeWare.vcxproj]
  59. ##[error]BeeWare\MemoryManager.h(16,31): Error C4430: missing type specifier - int assumed. Note: C++ does not support default-int
  60. D:\a\1\s\BeeWare\MemoryManager.h(16,31): error C4430: missing type specifier - int assumed. Note: C++ does not support default-int [D:\a\1\s\BeeWare\BeeWare.vcxproj]
  61. ##[error]BeeWare\MemoryManager.h(16,31): Error C2143: syntax error: missing ',' before '&'
  62. D:\a\1\s\BeeWare\MemoryManager.h(16,31): error C2143: syntax error: missing ',' before '&' [D:\a\1\s\BeeWare\BeeWare.vcxproj]
  63. ##[error]BeeWare\MemoryManager.h(17,29): Error C2039: 'string': is not a member of 'std'
  64. D:\a\1\s\BeeWare\MemoryManager.h(17,29): error C2039: 'string': is not a member of 'std' [D:\a\1\s\BeeWare\BeeWare.vcxproj]
  65. C:\Program Files (x86)\Microsoft Visual Studio\2019\Enterprise\VC\Tools\MSVC\14.23.28105\include\vector(20): message : see declaration of 'std' [D:\a\1\s\BeeWare\BeeWare.vcxproj]
  66. ##[error]BeeWare\MemoryManager.h(17,35): Error C4430: missing type specifier - int assumed. Note: C++ does not support default-int
  67. D:\a\1\s\BeeWare\MemoryManager.h(17,35): error C4430: missing type specifier - int assumed. Note: C++ does not support default-int [D:\a\1\s\BeeWare\BeeWare.vcxproj]
  68. ##[error]BeeWare\MemoryManager.h(17,35): Error C2143: syntax error: missing ',' before '&'
  69. D:\a\1\s\BeeWare\MemoryManager.h(17,35): error C2143: syntax error: missing ',' before '&' [D:\a\1\s\BeeWare\BeeWare.vcxproj]
  70. ##[error]BeeWare\MemoryManager.h(19,27): Error C2039: 'string': is not a member of 'std'
  71. D:\a\1\s\BeeWare\MemoryManager.h(19,27): error C2039: 'string': is not a member of 'std' [D:\a\1\s\BeeWare\BeeWare.vcxproj]
  72. C:\Program Files (x86)\Microsoft Visual Studio\2019\Enterprise\VC\Tools\MSVC\14.23.28105\include\vector(20): message : see declaration of 'std' [D:\a\1\s\BeeWare\BeeWare.vcxproj]
  73. ##[error]BeeWare\MemoryManager.h(19,50): Error C4430: missing type specifier - int assumed. Note: C++ does not support default-int
  74. D:\a\1\s\BeeWare\MemoryManager.h(19,50): error C4430: missing type specifier - int assumed. Note: C++ does not support default-int [D:\a\1\s\BeeWare\BeeWare.vcxproj]
  75. ##[error]BeeWare\MemoryManager.h(19,33): Error C2143: syntax error: missing ',' before '&'
  76. D:\a\1\s\BeeWare\MemoryManager.h(19,33): error C2143: syntax error: missing ',' before '&' [D:\a\1\s\BeeWare\BeeWare.vcxproj]
  77. ##[error]BeeWare\MemoryManager.cpp(5,1): Error C2511: 'bool MemoryManager::Attach(const std::string &)': overloaded member function not found in 'MemoryManager'
  78. D:\a\1\s\BeeWare\MemoryManager.cpp(5,1): error C2511: 'bool MemoryManager::Attach(const std::string &)': overloaded member function not found in 'MemoryManager' [D:\a\1\s\BeeWare\BeeWare.vcxproj]
  79. D:\a\1\s\BeeWare\MemoryManager.h(7): message : see declaration of 'MemoryManager' [D:\a\1\s\BeeWare\BeeWare.vcxproj]
  80. ##[error]BeeWare\MemoryManager.cpp(25,80): Error C2597: illegal reference to non-static member 'MemoryManager::m_hProcess'
  81. D:\a\1\s\BeeWare\MemoryManager.cpp(25,80): error C2597: illegal reference to non-static member 'MemoryManager::m_hProcess' [D:\a\1\s\BeeWare\BeeWare.vcxproj]
  82. ##[error]BeeWare\MemoryManager.cpp(28,43): Error C2597: illegal reference to non-static member 'MemoryManager::m_dwProcessId'
  83. D:\a\1\s\BeeWare\MemoryManager.cpp(28,43): error C2597: illegal reference to non-static member 'MemoryManager::m_dwProcessId' [D:\a\1\s\BeeWare\BeeWare.vcxproj]
  84. ##[error]BeeWare\MemoryManager.cpp(49,80): Error C2597: illegal reference to non-static member 'MemoryManager::m_hProcess'
  85. D:\a\1\s\BeeWare\MemoryManager.cpp(49,80): error C2597: illegal reference to non-static member 'MemoryManager::m_hProcess' [D:\a\1\s\BeeWare\BeeWare.vcxproj]
  86. ##[error]BeeWare\MemoryManager.cpp(50,43): Error C2597: illegal reference to non-static member 'MemoryManager::m_dwProcessId'
  87. D:\a\1\s\BeeWare\MemoryManager.cpp(50,43): error C2597: illegal reference to non-static member 'MemoryManager::m_dwProcessId' [D:\a\1\s\BeeWare\BeeWare.vcxproj]
  88. ##[error]BeeWare\MemoryManager.cpp(64,1): Error C2511: 'bool MemoryManager::GrabModule(const std::string &)': overloaded member function not found in 'MemoryManager'
  89. D:\a\1\s\BeeWare\MemoryManager.cpp(64,1): error C2511: 'bool MemoryManager::GrabModule(const std::string &)': overloaded member function not found in 'MemoryManager' [D:\a\1\s\BeeWare\BeeWare.vcxproj]
  90. D:\a\1\s\BeeWare\MemoryManager.h(7): message : see declaration of 'MemoryManager' [D:\a\1\s\BeeWare\BeeWare.vcxproj]
  91. ##[error]BeeWare\MemoryManager.cpp(65,78): Error C2597: illegal reference to non-static member 'MemoryManager::m_dwProcessId'
  92. D:\a\1\s\BeeWare\MemoryManager.cpp(65,78): error C2597: illegal reference to non-static member 'MemoryManager::m_dwProcessId' [D:\a\1\s\BeeWare\BeeWare.vcxproj]
  93. ##[error]BeeWare\MemoryManager.cpp(104,1): Error C2511: 'MemoryManager::MemoryManager(const std::string &)': overloaded member function not found in 'MemoryManager'
  94. D:\a\1\s\BeeWare\MemoryManager.cpp(104,1): error C2511: 'MemoryManager::MemoryManager(const std::string &)': overloaded member function not found in 'MemoryManager' [D:\a\1\s\BeeWare\BeeWare.vcxproj]
  95. D:\a\1\s\BeeWare\MemoryManager.h(7): message : see declaration of 'MemoryManager' [D:\a\1\s\BeeWare\BeeWare.vcxproj]
  96. ##[error]BeeWare\MemoryManager.cpp(105,35): Error C2597: illegal reference to non-static member 'MemoryManager::m_hProcess'
  97. D:\a\1\s\BeeWare\MemoryManager.cpp(105,35): error C2597: illegal reference to non-static member 'MemoryManager::m_hProcess' [D:\a\1\s\BeeWare\BeeWare.vcxproj]
  98. ##[error]BeeWare\MemoryManager.cpp(106,19): Error C2597: illegal reference to non-static member 'MemoryManager::m_dwProcessId'
  99. D:\a\1\s\BeeWare\MemoryManager.cpp(106,19): error C2597: illegal reference to non-static member 'MemoryManager::m_dwProcessId' [D:\a\1\s\BeeWare\BeeWare.vcxproj]
  100. ##[error]BeeWare\MemoryManager.cpp(109,5): Error C2664: 'bool MemoryManager::Attach(const int)': cannot convert argument 1 from 'const std::string' to 'const int'
  101. D:\a\1\s\BeeWare\MemoryManager.cpp(109,5): error C2664: 'bool MemoryManager::Attach(const int)': cannot convert argument 1 from 'const std::string' to 'const int' [D:\a\1\s\BeeWare\BeeWare.vcxproj]
  102. D:\a\1\s\BeeWare\MemoryManager.cpp(109,14): message : No user-defined-conversion operator available that can perform this conversion, or the operator cannot be called [D:\a\1\s\BeeWare\BeeWare.vcxproj]
  103. D:\a\1\s\BeeWare\MemoryManager.h(16,7): message : see declaration of 'MemoryManager::Attach' [D:\a\1\s\BeeWare\BeeWare.vcxproj]
  104. Done Building Project "D:\a\1\s\BeeWare\BeeWare.vcxproj" (default targets) -- FAILED.
  105. Done Building Project "D:\a\1\s\BeeWare.sln" (default targets) -- FAILED.
  106.  
  107. Build FAILED.
  108.  
  109. "D:\a\1\s\BeeWare.sln" (default target) (1) ->
  110. "D:\a\1\s\BeeWare\BeeWare.vcxproj" (default target) (2) ->
  111. (ClCompile target) ->
  112.   D:\a\1\s\BeeWare\MemoryManager.h(16,25): error C2039: 'string': is not a member of 'std' [D:\a\1\s\BeeWare\BeeWare.vcxproj]
  113.   D:\a\1\s\BeeWare\MemoryManager.h(16,31): error C4430: missing type specifier - int assumed. Note: C++ does not support default-int [D:\a\1\s\BeeWare\BeeWare.vcxproj]
  114.   D:\a\1\s\BeeWare\MemoryManager.h(16,31): error C2143: syntax error: missing ',' before '&' [D:\a\1\s\BeeWare\BeeWare.vcxproj]
  115.   D:\a\1\s\BeeWare\MemoryManager.h(17,29): error C2039: 'string': is not a member of 'std' [D:\a\1\s\BeeWare\BeeWare.vcxproj]
  116.   D:\a\1\s\BeeWare\MemoryManager.h(17,35): error C4430: missing type specifier - int assumed. Note: C++ does not support default-int [D:\a\1\s\BeeWare\BeeWare.vcxproj]
  117.   D:\a\1\s\BeeWare\MemoryManager.h(17,35): error C2143: syntax error: missing ',' before '&' [D:\a\1\s\BeeWare\BeeWare.vcxproj]
  118.   D:\a\1\s\BeeWare\MemoryManager.h(19,27): error C2039: 'string': is not a member of 'std' [D:\a\1\s\BeeWare\BeeWare.vcxproj]
  119.   D:\a\1\s\BeeWare\MemoryManager.h(19,50): error C4430: missing type specifier - int assumed. Note: C++ does not support default-int [D:\a\1\s\BeeWare\BeeWare.vcxproj]
  120.   D:\a\1\s\BeeWare\MemoryManager.h(19,33): error C2143: syntax error: missing ',' before '&' [D:\a\1\s\BeeWare\BeeWare.vcxproj]
  121.   D:\a\1\s\BeeWare\bhop.cpp(14,38): error C2664: 'MemoryManager::MemoryManager(MemoryManager &&)': cannot convert argument 1 from 'const char [9]' to 'const int' [D:\a\1\s\BeeWare\BeeWare.vcxproj]
  122.   D:\a\1\s\BeeWare\bhop.cpp(23,5): error C2664: 'bool MemoryManager::GrabModule(const int)': cannot convert argument 1 from 'const char [11]' to 'const int' [D:\a\1\s\BeeWare\BeeWare.vcxproj]
  123.   D:\a\1\s\BeeWare\MemoryManager.h(16,25): error C2039: 'string': is not a member of 'std' [D:\a\1\s\BeeWare\BeeWare.vcxproj]
  124.   D:\a\1\s\BeeWare\MemoryManager.h(16,31): error C4430: missing type specifier - int assumed. Note: C++ does not support default-int [D:\a\1\s\BeeWare\BeeWare.vcxproj]
  125.   D:\a\1\s\BeeWare\MemoryManager.h(16,31): error C2143: syntax error: missing ',' before '&' [D:\a\1\s\BeeWare\BeeWare.vcxproj]
  126.   D:\a\1\s\BeeWare\MemoryManager.h(17,29): error C2039: 'string': is not a member of 'std' [D:\a\1\s\BeeWare\BeeWare.vcxproj]
  127.   D:\a\1\s\BeeWare\MemoryManager.h(17,35): error C4430: missing type specifier - int assumed. Note: C++ does not support default-int [D:\a\1\s\BeeWare\BeeWare.vcxproj]
  128.   D:\a\1\s\BeeWare\MemoryManager.h(17,35): error C2143: syntax error: missing ',' before '&' [D:\a\1\s\BeeWare\BeeWare.vcxproj]
  129.   D:\a\1\s\BeeWare\MemoryManager.h(19,27): error C2039: 'string': is not a member of 'std' [D:\a\1\s\BeeWare\BeeWare.vcxproj]
  130.   D:\a\1\s\BeeWare\MemoryManager.h(19,50): error C4430: missing type specifier - int assumed. Note: C++ does not support default-int [D:\a\1\s\BeeWare\BeeWare.vcxproj]
  131.   D:\a\1\s\BeeWare\MemoryManager.h(19,33): error C2143: syntax error: missing ',' before '&' [D:\a\1\s\BeeWare\BeeWare.vcxproj]
  132.   D:\a\1\s\BeeWare\MemoryManager.cpp(5,1): error C2511: 'bool MemoryManager::Attach(const std::string &)': overloaded member function not found in 'MemoryManager' [D:\a\1\s\BeeWare\BeeWare.vcxproj]
  133.   D:\a\1\s\BeeWare\MemoryManager.cpp(25,80): error C2597: illegal reference to non-static member 'MemoryManager::m_hProcess' [D:\a\1\s\BeeWare\BeeWare.vcxproj]
  134.   D:\a\1\s\BeeWare\MemoryManager.cpp(28,43): error C2597: illegal reference to non-static member 'MemoryManager::m_dwProcessId' [D:\a\1\s\BeeWare\BeeWare.vcxproj]
  135.   D:\a\1\s\BeeWare\MemoryManager.cpp(49,80): error C2597: illegal reference to non-static member 'MemoryManager::m_hProcess' [D:\a\1\s\BeeWare\BeeWare.vcxproj]
  136.   D:\a\1\s\BeeWare\MemoryManager.cpp(50,43): error C2597: illegal reference to non-static member 'MemoryManager::m_dwProcessId' [D:\a\1\s\BeeWare\BeeWare.vcxproj]
  137.   D:\a\1\s\BeeWare\MemoryManager.cpp(64,1): error C2511: 'bool MemoryManager::GrabModule(const std::string &)': overloaded member function not found in 'MemoryManager' [D:\a\1\s\BeeWare\BeeWare.vcxproj]
  138.   D:\a\1\s\BeeWare\MemoryManager.cpp(65,78): error C2597: illegal reference to non-static member 'MemoryManager::m_dwProcessId' [D:\a\1\s\BeeWare\BeeWare.vcxproj]
  139.   D:\a\1\s\BeeWare\MemoryManager.cpp(104,1): error C2511: 'MemoryManager::MemoryManager(const std::string &)': overloaded member function not found in 'MemoryManager' [D:\a\1\s\BeeWare\BeeWare.vcxproj]
  140.   D:\a\1\s\BeeWare\MemoryManager.cpp(105,35): error C2597: illegal reference to non-static member 'MemoryManager::m_hProcess' [D:\a\1\s\BeeWare\BeeWare.vcxproj]
  141.   D:\a\1\s\BeeWare\MemoryManager.cpp(106,19): error C2597: illegal reference to non-static member 'MemoryManager::m_dwProcessId' [D:\a\1\s\BeeWare\BeeWare.vcxproj]
  142.   D:\a\1\s\BeeWare\MemoryManager.cpp(109,5): error C2664: 'bool MemoryManager::Attach(const int)': cannot convert argument 1 from 'const std::string' to 'const int' [D:\a\1\s\BeeWare\BeeWare.vcxproj]
  143.  
  144.     0 Warning(s)
  145.     31 Error(s)
  146.  
  147. Time Elapsed 00:00:08.43
  148. ##[error]Process 'msbuild.exe' exited with code '1'.
  149. ##[section]Finishing: VSBuild
RAW Paste Data
We use cookies for various purposes including analytics. By continuing to use Pastebin, you agree to our use of cookies as described in the Cookies Policy. OK, I Understand
Not a member of Pastebin yet?
Sign Up, it unlocks many cool features!
 
Top