Guest User

AUR pycharm-edu build failure

a guest
Nov 18th, 2019
306
Never
Not a member of Pastebin yet? Sign Up, it unlocks many cool features!
  1. :: Synchronizing package databases...
  2. core is up to date
  3. extra is up to date
  4. community is up to date
  5. :: Starting full system upgrade...
  6. there is nothing to do
  7. ==> Building in chroot for [extra] (x86_64)...
  8. ==> Synchronizing chroot copy [/var/lib/archbuild/extra-x86_64/root] -> [dbd]...done
  9. ==> Making package: pycharm-edu 2019.2.2-1 (Mon Nov 18 15:28:07 2019)
  10. ==> Retrieving sources...
  11. -> Found pycharm-edu-2019.2.2.tar.gz
  12. -> Found pycharm-edu.desktop
  13. ==> Validating source files with sha256sums...
  14. pycharm-edu-2019.2.2.tar.gz ... Passed
  15. pycharm-edu.desktop ... Passed
  16. ==>(B Making package: pycharm-edu 2019.2.2-1 (Mon 18 Nov 2019 03:28:10 PM CET)(B
  17. ==>(B Checking runtime dependencies...(B
  18. ==>(B Installing missing dependencies...(B
  19. :: There are 7 providers available for ttf-font:
  20. :: Repository extra
  21. 1) gnu-free-fonts 2) noto-fonts 3) ttf-bitstream-vera 4) ttf-croscore
  22. 5) ttf-dejavu
  23. :: Repository community
  24. 6) ttf-droid 7) ttf-liberation
  25.  
  26. Enter a number (default=1):
  27. resolving dependencies...
  28. looking for conflicting packages...
  29.  
  30. Packages (13) libx11-1.6.9-3 libxau-1.0.9-1 libxcb-1.13.1-1 libxdmcp-1.1.3-1
  31. libxext-1.3.4-1 libxfixes-5.0.3-2 libxi-1.7.10-1
  32. xcb-proto-1.13-4 xorgproto-2019.2-1 giflib-5.2.1-1
  33. gnu-free-fonts-20120503-7 libxslt-1.1.33-1 libxtst-1.2.3-2
  34.  
  35. Total Installed Size: 27.48 MiB
  36.  
  37. :: Proceed with installation? [Y/n]
  38. ( 0/13) checking keys in keyring [----------------------] 0%
  39. ( 1/13) checking keys in keyring [#---------------------] 7%
  40. ( 2/13) checking keys in keyring [###-------------------] 15%
  41. ( 3/13) checking keys in keyring [#####-----------------] 23%
  42. ( 4/13) checking keys in keyring [######----------------] 30%
  43. ( 5/13) checking keys in keyring [########--------------] 38%
  44. ( 6/13) checking keys in keyring [##########------------] 46%
  45. ( 7/13) checking keys in keyring [###########-----------] 53%
  46. ( 8/13) checking keys in keyring [#############---------] 61%
  47. ( 9/13) checking keys in keyring [###############-------] 69%
  48. (10/13) checking keys in keyring [################------] 76%
  49. (11/13) checking keys in keyring [##################----] 84%
  50. (12/13) checking keys in keyring [####################--] 92%
  51. (13/13) checking keys in keyring [######################] 100%
  52. ( 0/13) checking package integrity [----------------------] 0%
  53. ( 1/13) checking package integrity [----------------------] 0%
  54. ( 2/13) checking package integrity [#########-------------] 42%
  55. ( 3/13) checking package integrity [#########-------------] 44%
  56. ( 4/13) checking package integrity [##########------------] 47%
  57. ( 5/13) checking package integrity [##########------------] 48%
  58. ( 6/13) checking package integrity [##########------------] 48%
  59. ( 7/13) checking package integrity [#############---------] 62%
  60. ( 8/13) checking package integrity [###################---] 90%
  61. ( 9/13) checking package integrity [####################--] 92%
  62. (10/13) checking package integrity [####################--] 94%
  63. (11/13) checking package integrity [####################--] 94%
  64. (12/13) checking package integrity [####################--] 94%
  65. (13/13) checking package integrity [######################] 100%
  66. ( 0/13) loading package files [----------------------] 0%
  67. ( 1/13) loading package files [----------------------] 0%
  68. ( 2/13) loading package files [#########-------------] 42%
  69. ( 3/13) loading package files [#########-------------] 44%
  70. ( 4/13) loading package files [##########------------] 47%
  71. ( 5/13) loading package files [##########------------] 48%
  72. ( 6/13) loading package files [##########------------] 48%
  73. ( 7/13) loading package files [#############---------] 62%
  74. ( 8/13) loading package files [###################---] 90%
  75. ( 9/13) loading package files [####################--] 92%
  76. (10/13) loading package files [####################--] 94%
  77. (11/13) loading package files [####################--] 94%
  78. (12/13) loading package files [####################--] 94%
  79. (13/13) loading package files [######################] 100%
  80. ( 0/13) checking for file conflicts [----------------------] 0%
  81. ( 1/13) checking for file conflicts [#---------------------] 7%
  82. ( 2/13) checking for file conflicts [###-------------------] 15%
  83. ( 3/13) checking for file conflicts [#####-----------------] 23%
  84. ( 4/13) checking for file conflicts [######----------------] 30%
  85. ( 5/13) checking for file conflicts [########--------------] 38%
  86. ( 6/13) checking for file conflicts [##########------------] 46%
  87. ( 7/13) checking for file conflicts [###########-----------] 53%
  88. ( 8/13) checking for file conflicts [#############---------] 61%
  89. ( 9/13) checking for file conflicts [###############-------] 69%
  90. (10/13) checking for file conflicts [################------] 76%
  91. (11/13) checking for file conflicts [##################----] 84%
  92. (12/13) checking for file conflicts [####################--] 92%
  93. (13/13) checking for file conflicts [######################] 100%
  94. :: Processing package changes...
  95. ( 1/13) installing giflib [----------------------] 0%
  96. ( 1/13) installing giflib [######################] 100%
  97. ( 2/13) installing gnu-free-fonts [----------------------] 0%
  98. ( 2/13) installing gnu-free-fonts [----------------------] 0%
  99. ( 2/13) installing gnu-free-fonts [----------------------] 0%
  100. ( 2/13) installing gnu-free-fonts [----------------------] 0%
  101. ( 2/13) installing gnu-free-fonts [----------------------] 0%
  102. ( 2/13) installing gnu-free-fonts [----------------------] 0%
  103. ( 2/13) installing gnu-free-fonts [----------------------] 0%
  104. ( 2/13) installing gnu-free-fonts [----------------------] 0%
  105. ( 2/13) installing gnu-free-fonts [----------------------] 0%
  106. ( 2/13) installing gnu-free-fonts [######################] 100%
  107. ( 3/13) installing xcb-proto [----------------------] 0%
  108. ( 3/13) installing xcb-proto [######################] 100%
  109. ( 4/13) installing xorgproto [----------------------] 0%
  110. ( 4/13) installing xorgproto [######################] 100%
  111. ( 5/13) installing libxdmcp [----------------------] 0%
  112. ( 5/13) installing libxdmcp [######################] 100%
  113. ( 6/13) installing libxau [----------------------] 0%
  114. ( 6/13) installing libxau [######################] 100%
  115. ( 7/13) installing libxcb [----------------------] 0%
  116. ( 7/13) installing libxcb [######################] 100%
  117. ( 8/13) installing libx11 [----------------------] 0%
  118. ( 8/13) installing libx11 [######################] 100%
  119. ( 9/13) installing libxext [----------------------] 0%
  120. ( 9/13) installing libxext [######################] 100%
  121. (10/13) installing libxi [----------------------] 0%
  122. (10/13) installing libxi [######################] 100%
  123. (11/13) installing libxfixes [----------------------] 0%
  124. (11/13) installing libxfixes [######################] 100%
  125. (12/13) installing libxtst [----------------------] 0%
  126. (12/13) installing libxtst [######################] 100%
  127. (13/13) installing libxslt [----------------------] 0%
  128. (13/13) installing libxslt [######################] 100%
  129. :: Running post-transaction hooks...
  130. (1/1) Arming ConditionNeedsUpdate...
  131. ==>(B Checking buildtime dependencies...(B
  132. ==>(B Installing missing dependencies...(B
  133. resolving dependencies...
  134. looking for conflicting packages...
  135.  
  136. Packages (13) libnsl-1.2.0-1 python-3.8.0-1 python-appdirs-1.4.3-5
  137. python-packaging-19.2-5 python-pyparsing-2.4.5-1
  138. python-six-1.13.0-2 python2-2.7.17-1 python2-appdirs-1.4.3-5
  139. python2-packaging-19.2-5 python2-pyparsing-2.4.5-1
  140. python2-six-1.13.0-2 python-setuptools-1:41.2.0-5
  141. python2-setuptools-1:41.2.0-5
  142.  
  143. Total Installed Size: 232.48 MiB
  144.  
  145. :: Proceed with installation? [Y/n]
  146. ( 0/13) checking keys in keyring [----------------------] 0%
  147. ( 1/13) checking keys in keyring [#---------------------] 7%
  148. ( 2/13) checking keys in keyring [###-------------------] 15%
  149. ( 3/13) checking keys in keyring [#####-----------------] 23%
  150. ( 4/13) checking keys in keyring [######----------------] 30%
  151. ( 5/13) checking keys in keyring [########--------------] 38%
  152. ( 6/13) checking keys in keyring [##########------------] 46%
  153. ( 7/13) checking keys in keyring [###########-----------] 53%
  154. ( 8/13) checking keys in keyring [#############---------] 61%
  155. ( 9/13) checking keys in keyring [###############-------] 69%
  156. (10/13) checking keys in keyring [################------] 76%
  157. (11/13) checking keys in keyring [##################----] 84%
  158. (12/13) checking keys in keyring [####################--] 92%
  159. (13/13) checking keys in keyring [######################] 100%
  160. ( 0/13) checking package integrity [----------------------] 0%
  161. ( 1/13) checking package integrity [----------------------] 0%
  162. ( 2/13) checking package integrity [#####-----------------] 23%
  163. ( 3/13) checking package integrity [#####-----------------] 23%
  164. ( 4/13) checking package integrity [#####-----------------] 23%
  165. ( 5/13) checking package integrity [#####-----------------] 23%
  166. ( 6/13) checking package integrity [#####-----------------] 24%
  167. ( 7/13) checking package integrity [#####-----------------] 24%
  168. ( 8/13) checking package integrity [#####################-] 99%
  169. ( 9/13) checking package integrity [#####################-] 99%
  170. (10/13) checking package integrity [#####################-] 99%
  171. (11/13) checking package integrity [#####################-] 99%
  172. (12/13) checking package integrity [#####################-] 99%
  173. (13/13) checking package integrity [######################] 100%
  174. ( 0/13) loading package files [----------------------] 0%
  175. ( 1/13) loading package files [----------------------] 0%
  176. ( 2/13) loading package files [#####-----------------] 23%
  177. ( 3/13) loading package files [#####-----------------] 23%
  178. ( 4/13) loading package files [#####-----------------] 23%
  179. ( 5/13) loading package files [#####-----------------] 23%
  180. ( 6/13) loading package files [#####-----------------] 24%
  181. ( 7/13) loading package files [#####-----------------] 24%
  182. ( 8/13) loading package files [#####################-] 99%
  183. ( 9/13) loading package files [#####################-] 99%
  184. (10/13) loading package files [#####################-] 99%
  185. (11/13) loading package files [#####################-] 99%
  186. (12/13) loading package files [#####################-] 99%
  187. (13/13) loading package files [######################] 100%
  188. ( 0/13) checking for file conflicts [----------------------] 0%
  189. ( 1/13) checking for file conflicts [#---------------------] 7%
  190. ( 2/13) checking for file conflicts [###-------------------] 15%
  191. ( 3/13) checking for file conflicts [#####-----------------] 23%
  192. ( 4/13) checking for file conflicts [######----------------] 30%
  193. ( 5/13) checking for file conflicts [########--------------] 38%
  194. ( 6/13) checking for file conflicts [##########------------] 46%
  195. ( 7/13) checking for file conflicts [###########-----------] 53%
  196. ( 8/13) checking for file conflicts [#############---------] 61%
  197. ( 9/13) checking for file conflicts [###############-------] 69%
  198. (10/13) checking for file conflicts [################------] 76%
  199. (11/13) checking for file conflicts [##################----] 84%
  200. (12/13) checking for file conflicts [####################--] 92%
  201. (13/13) checking for file conflicts [######################] 100%
  202. :: Processing package changes...
  203. ( 1/13) installing libnsl [----------------------] 0%
  204. ( 1/13) installing libnsl [######################] 100%
  205. ( 2/13) installing python2 [----------------------] 0%
  206. ( 2/13) installing python2 [----------------------] 0%
  207. ( 2/13) installing python2 [----------------------] 0%
  208. ( 2/13) installing python2 [####------------------] 22%
  209. ( 2/13) installing python2 [##########------------] 49%
  210. ( 2/13) installing python2 [###############-------] 69%
  211. ( 2/13) installing python2 [##################----] 86%
  212. ( 2/13) installing python2 [######################] 100%
  213. Optional dependencies for python2
  214. tk: for IDLE
  215. python2-setuptools [pending]
  216. python2-pip
  217. ( 3/13) installing python2-appdirs [----------------------] 0%
  218. ( 3/13) installing python2-appdirs [######################] 100%
  219. ( 4/13) installing python2-pyparsing [----------------------] 0%
  220. ( 4/13) installing python2-pyparsing [######################] 100%
  221. ( 5/13) installing python2-six [----------------------] 0%
  222. ( 5/13) installing python2-six [######################] 100%
  223. ( 6/13) installing python2-packaging [----------------------] 0%
  224. ( 6/13) installing python2-packaging [######################] 100%
  225. ( 7/13) installing python2-setuptools [----------------------] 0%
  226. ( 7/13) installing python2-setuptools [######################] 100%
  227. ( 8/13) installing python [----------------------] 0%
  228. ( 8/13) installing python [----------------------] 0%
  229. ( 8/13) installing python [----------------------] 0%
  230. ( 8/13) installing python [#---------------------] 7%
  231. ( 8/13) installing python [#############---------] 62%
  232. ( 8/13) installing python [###############-------] 71%
  233. ( 8/13) installing python [################------] 77%
  234. ( 8/13) installing python [##################----] 83%
  235. ( 8/13) installing python [###################---] 88%
  236. ( 8/13) installing python [####################--] 94%
  237. ( 8/13) installing python [######################] 100%
  238. Optional dependencies for python
  239. python-setuptools [pending]
  240. python-pip
  241. sqlite [installed]
  242. mpdecimal: for decimal
  243. xz: for lzma [installed]
  244. tk: for tkinter
  245. ( 9/13) installing python-appdirs [----------------------] 0%
  246. ( 9/13) installing python-appdirs [######################] 100%
  247. (10/13) installing python-pyparsing [----------------------] 0%
  248. (10/13) installing python-pyparsing [######################] 100%
  249. (11/13) installing python-six [----------------------] 0%
  250. (11/13) installing python-six [######################] 100%
  251. (12/13) installing python-packaging [----------------------] 0%
  252. (12/13) installing python-packaging [######################] 100%
  253. (13/13) installing python-setuptools [----------------------] 0%
  254. (13/13) installing python-setuptools [######################] 100%
  255. :: Running post-transaction hooks...
  256. (1/1) Arming ConditionNeedsUpdate...
  257. ==>(B Retrieving sources...(B
  258.  ->(B Found pycharm-edu-2019.2.2.tar.gz(B
  259.  ->(B Found pycharm-edu.desktop(B
  260. ==> WARNING:(B Skipping all source file integrity checks.(B
  261. ==>(B Extracting sources...(B
  262.  ->(B Extracting pycharm-edu-2019.2.2.tar.gz with bsdtar(B
  263. ==>(B Starting build()...(B
  264. running build_ext
  265. building '_pydevd_bundle_ext.pydevd_cython' extension
  266. creating build
  267. creating build/_pydevd_bundle
  268. gcc -pthread -fno-strict-aliasing -march=x86-64 -mtune=generic -O2 -pipe -fno-plt -DNDEBUG -march=x86-64 -mtune=generic -O2 -pipe -fno-plt -march=x86-64 -mtune=generic -O2 -pipe -fno-plt -D_FORTIFY_SOURCE=2 -fPIC -I/usr/include/python2.7 -c _pydevd_bundle/pydevd_cython.c -o build/_pydevd_bundle/pydevd_cython.o
  269. creating _pydevd_bundle_ext
  270. gcc -pthread -shared -Wl,-O1,--sort-common,--as-needed,-z,relro,-z,now -Wl,-O1,--sort-common,--as-needed,-z,relro,-z,now -march=x86-64 -mtune=generic -O2 -pipe -fno-plt -D_FORTIFY_SOURCE=2 build/_pydevd_bundle/pydevd_cython.o -L/usr/lib -lpython2.7 -o ./_pydevd_bundle_ext/pydevd_cython.so
  271. running build_ext
  272. building '_pydevd_bundle_ext.pydevd_cython' extension
  273. gcc -pthread -Wno-unused-result -Wsign-compare -DNDEBUG -g -fwrapv -O3 -Wall -march=x86-64 -mtune=generic -O3 -pipe -fno-plt -march=x86-64 -mtune=generic -O3 -pipe -fno-plt -march=x86-64 -mtune=generic -O3 -pipe -fno-plt -march=x86-64 -mtune=generic -O2 -pipe -fno-plt -D_FORTIFY_SOURCE=2 -fPIC -I/usr/include/python3.8 -c _pydevd_bundle/pydevd_cython.c -o build/_pydevd_bundle/pydevd_cython.o
  274. _pydevd_bundle/pydevd_cython.c: In function ‘__Pyx_InitCachedConstants’:
  275. /usr/include/python3.8/code.h:72:25: warning: passing argument 6 of ‘PyCode_New’ makes pointer from integer without a cast [-Wint-conversion]
  276. 72 | #define CO_OPTIMIZED 0x0001
  277. | ^
  278. | |
  279. | int
  280. _pydevd_bundle/pydevd_cython.c:331:37: note: in definition of macro ‘__Pyx_PyCode_New’
  281. 331 | PyCode_New(a, 0, k, l, s, f, code, c, n, v, fv, cell, fn, name, fline, lnos)
  282. | ^
  283. _pydevd_bundle/pydevd_cython.c:32251:62: note: in expansion of macro ‘CO_OPTIMIZED’
  284. 32251 | __pyx_codeobj__4 = (PyObject*)__Pyx_PyCode_New(1, 0, 4, 0, CO_OPTIMIZED|CO_NEWLOCALS, __pyx_empty_bytes, __pyx_empty_tuple, __pyx_empty_tuple, __pyx_tuple__3, __pyx_empty_tuple, __pyx_empty_tuple, __pyx_kp_s_pydevd_bundle_pydevd_cython_pyx, __pyx_n_s_get_func_name, 517, __pyx_empty_bytes); if (unlikely(!__pyx_codeobj__4)) __PYX_ERR(0, 517, __pyx_L1_error)
  285. | ^~~~~~~~~~~~
  286. In file included from /usr/include/python3.8/compile.h:5,
  287. from /usr/include/python3.8/Python.h:138,
  288. from _pydevd_bundle/pydevd_cython.c:17:
  289. /usr/include/python3.8/code.h:122:28: note: expected ‘PyObject *’ {aka ‘struct _object *’} but argument is of type ‘int’
  290. 122 | PyAPI_FUNC(PyCodeObject *) PyCode_New(
  291. | ^~~~~~~~~~
  292. _pydevd_bundle/pydevd_cython.c:32251:244: warning: passing argument 14 of ‘PyCode_New’ makes integer from pointer without a cast [-Wint-conversion]
  293. 32251 | __pyx_codeobj__4 = (PyObject*)__Pyx_PyCode_New(1, 0, 4, 0, CO_OPTIMIZED|CO_NEWLOCALS, __pyx_empty_bytes, __pyx_empty_tuple, __pyx_empty_tuple, __pyx_tuple__3, __pyx_empty_tuple, __pyx_empty_tuple, __pyx_kp_s_pydevd_bundle_pydevd_cython_pyx, __pyx_n_s_get_func_name, 517, __pyx_empty_bytes); if (unlikely(!__pyx_codeobj__4)) __PYX_ERR(0, 517, __pyx_L1_error)
  294. | ^~~~~~~~~~~~~~~~~~~~~~~
  295. | |
  296. | PyObject * {aka struct _object *}
  297. _pydevd_bundle/pydevd_cython.c:331:69: note: in definition of macro ‘__Pyx_PyCode_New’
  298. 331 | PyCode_New(a, 0, k, l, s, f, code, c, n, v, fv, cell, fn, name, fline, lnos)
  299. | ^~~~
  300. In file included from /usr/include/python3.8/compile.h:5,
  301. from /usr/include/python3.8/Python.h:138,
  302. from _pydevd_bundle/pydevd_cython.c:17:
  303. /usr/include/python3.8/code.h:122:28: note: expected ‘int’ but argument is of type ‘PyObject *’ {aka ‘struct _object *’}
  304. 122 | PyAPI_FUNC(PyCodeObject *) PyCode_New(
  305. | ^~~~~~~~~~
  306. _pydevd_bundle/pydevd_cython.c:32251:269: warning: passing argument 15 of ‘PyCode_New’ makes pointer from integer without a cast [-Wint-conversion]
  307. 32251 | __pyx_codeobj__4 = (PyObject*)__Pyx_PyCode_New(1, 0, 4, 0, CO_OPTIMIZED|CO_NEWLOCALS, __pyx_empty_bytes, __pyx_empty_tuple, __pyx_empty_tuple, __pyx_tuple__3, __pyx_empty_tuple, __pyx_empty_tuple, __pyx_kp_s_pydevd_bundle_pydevd_cython_pyx, __pyx_n_s_get_func_name, 517, __pyx_empty_bytes); if (unlikely(!__pyx_codeobj__4)) __PYX_ERR(0, 517, __pyx_L1_error)
  308. | ^~~
  309. | |
  310. | int
  311. _pydevd_bundle/pydevd_cython.c:331:75: note: in definition of macro ‘__Pyx_PyCode_New’
  312. 331 | PyCode_New(a, 0, k, l, s, f, code, c, n, v, fv, cell, fn, name, fline, lnos)
  313. | ^~~~~
  314. In file included from /usr/include/python3.8/compile.h:5,
  315. from /usr/include/python3.8/Python.h:138,
  316. from _pydevd_bundle/pydevd_cython.c:17:
  317. /usr/include/python3.8/code.h:122:28: note: expected ‘PyObject *’ {aka ‘struct _object *’} but argument is of type ‘int’
  318. 122 | PyAPI_FUNC(PyCodeObject *) PyCode_New(
  319. | ^~~~~~~~~~
  320. _pydevd_bundle/pydevd_cython.c:331:11: error: too many arguments to function ‘PyCode_New’
  321. 331 | PyCode_New(a, 0, k, l, s, f, code, c, n, v, fv, cell, fn, name, fline, lnos)
  322. | ^~~~~~~~~~
  323. _pydevd_bundle/pydevd_cython.c:32251:33: note: in expansion of macro ‘__Pyx_PyCode_New’
  324. 32251 | __pyx_codeobj__4 = (PyObject*)__Pyx_PyCode_New(1, 0, 4, 0, CO_OPTIMIZED|CO_NEWLOCALS, __pyx_empty_bytes, __pyx_empty_tuple, __pyx_empty_tuple, __pyx_tuple__3, __pyx_empty_tuple, __pyx_empty_tuple, __pyx_kp_s_pydevd_bundle_pydevd_cython_pyx, __pyx_n_s_get_func_name, 517, __pyx_empty_bytes); if (unlikely(!__pyx_codeobj__4)) __PYX_ERR(0, 517, __pyx_L1_error)
  325. | ^~~~~~~~~~~~~~~~
  326. In file included from /usr/include/python3.8/compile.h:5,
  327. from /usr/include/python3.8/Python.h:138,
  328. from _pydevd_bundle/pydevd_cython.c:17:
  329. /usr/include/python3.8/code.h:122:28: note: declared here
  330. 122 | PyAPI_FUNC(PyCodeObject *) PyCode_New(
  331. | ^~~~~~~~~~
  332. /usr/include/python3.8/code.h:72:25: warning: passing argument 6 of ‘PyCode_New’ makes pointer from integer without a cast [-Wint-conversion]
  333. 72 | #define CO_OPTIMIZED 0x0001
  334. | ^
  335. | |
  336. | int
  337. _pydevd_bundle/pydevd_cython.c:331:37: note: in definition of macro ‘__Pyx_PyCode_New’
  338. 331 | PyCode_New(a, 0, k, l, s, f, code, c, n, v, fv, cell, fn, name, fline, lnos)
  339. | ^
  340. _pydevd_bundle/pydevd_cython.c:32307:63: note: in expansion of macro ‘CO_OPTIMIZED’
  341. 32307 | __pyx_codeobj__11 = (PyObject*)__Pyx_PyCode_New(0, 0, 6, 0, CO_OPTIMIZED|CO_NEWLOCALS, __pyx_empty_bytes, __pyx_empty_tuple, __pyx_empty_tuple, __pyx_tuple__10, __pyx_empty_tuple, __pyx_empty_tuple, __pyx_kp_s_pydevd_bundle_pydevd_cython_pyx, __pyx_n_s_current_frames, 31, __pyx_empty_bytes); if (unlikely(!__pyx_codeobj__11)) __PYX_ERR(0, 31, __pyx_L1_error)
  342. | ^~~~~~~~~~~~
  343. In file included from /usr/include/python3.8/compile.h:5,
  344. from /usr/include/python3.8/Python.h:138,
  345. from _pydevd_bundle/pydevd_cython.c:17:
  346. /usr/include/python3.8/code.h:122:28: note: expected ‘PyObject *’ {aka ‘struct _object *’} but argument is of type ‘int’
  347. 122 | PyAPI_FUNC(PyCodeObject *) PyCode_New(
  348. | ^~~~~~~~~~
  349. _pydevd_bundle/pydevd_cython.c:32307:246: warning: passing argument 14 of ‘PyCode_New’ makes integer from pointer without a cast [-Wint-conversion]
  350. 32307 | __pyx_codeobj__11 = (PyObject*)__Pyx_PyCode_New(0, 0, 6, 0, CO_OPTIMIZED|CO_NEWLOCALS, __pyx_empty_bytes, __pyx_empty_tuple, __pyx_empty_tuple, __pyx_tuple__10, __pyx_empty_tuple, __pyx_empty_tuple, __pyx_kp_s_pydevd_bundle_pydevd_cython_pyx, __pyx_n_s_current_frames, 31, __pyx_empty_bytes); if (unlikely(!__pyx_codeobj__11)) __PYX_ERR(0, 31, __pyx_L1_error)
  351. | ^~~~~~~~~~~~~~~~~~~~~~~~
  352. | |
  353. | PyObject * {aka struct _object *}
  354. _pydevd_bundle/pydevd_cython.c:331:69: note: in definition of macro ‘__Pyx_PyCode_New’
  355. 331 | PyCode_New(a, 0, k, l, s, f, code, c, n, v, fv, cell, fn, name, fline, lnos)
  356. | ^~~~
  357. In file included from /usr/include/python3.8/compile.h:5,
  358. from /usr/include/python3.8/Python.h:138,
  359. from _pydevd_bundle/pydevd_cython.c:17:
  360. /usr/include/python3.8/code.h:122:28: note: expected ‘int’ but argument is of type ‘PyObject *’ {aka ‘struct _object *’}
  361. 122 | PyAPI_FUNC(PyCodeObject *) PyCode_New(
  362. | ^~~~~~~~~~
  363. _pydevd_bundle/pydevd_cython.c:32307:272: warning: passing argument 15 of ‘PyCode_New’ makes pointer from integer without a cast [-Wint-conversion]
  364. 32307 | __pyx_codeobj__11 = (PyObject*)__Pyx_PyCode_New(0, 0, 6, 0, CO_OPTIMIZED|CO_NEWLOCALS, __pyx_empty_bytes, __pyx_empty_tuple, __pyx_empty_tuple, __pyx_tuple__10, __pyx_empty_tuple, __pyx_empty_tuple, __pyx_kp_s_pydevd_bundle_pydevd_cython_pyx, __pyx_n_s_current_frames, 31, __pyx_empty_bytes); if (unlikely(!__pyx_codeobj__11)) __PYX_ERR(0, 31, __pyx_L1_error)
  365. | ^~
  366. | |
  367. | int
  368. _pydevd_bundle/pydevd_cython.c:331:75: note: in definition of macro ‘__Pyx_PyCode_New’
  369. 331 | PyCode_New(a, 0, k, l, s, f, code, c, n, v, fv, cell, fn, name, fline, lnos)
  370. | ^~~~~
  371. In file included from /usr/include/python3.8/compile.h:5,
  372. from /usr/include/python3.8/Python.h:138,
  373. from _pydevd_bundle/pydevd_cython.c:17:
  374. /usr/include/python3.8/code.h:122:28: note: expected ‘PyObject *’ {aka ‘struct _object *’} but argument is of type ‘int’
  375. 122 | PyAPI_FUNC(PyCodeObject *) PyCode_New(
  376. | ^~~~~~~~~~
  377. _pydevd_bundle/pydevd_cython.c:331:11: error: too many arguments to function ‘PyCode_New’
  378. 331 | PyCode_New(a, 0, k, l, s, f, code, c, n, v, fv, cell, fn, name, fline, lnos)
  379. | ^~~~~~~~~~
  380. _pydevd_bundle/pydevd_cython.c:32307:34: note: in expansion of macro ‘__Pyx_PyCode_New’
  381. 32307 | __pyx_codeobj__11 = (PyObject*)__Pyx_PyCode_New(0, 0, 6, 0, CO_OPTIMIZED|CO_NEWLOCALS, __pyx_empty_bytes, __pyx_empty_tuple, __pyx_empty_tuple, __pyx_tuple__10, __pyx_empty_tuple, __pyx_empty_tuple, __pyx_kp_s_pydevd_bundle_pydevd_cython_pyx, __pyx_n_s_current_frames, 31, __pyx_empty_bytes); if (unlikely(!__pyx_codeobj__11)) __PYX_ERR(0, 31, __pyx_L1_error)
  382. | ^~~~~~~~~~~~~~~~
  383. In file included from /usr/include/python3.8/compile.h:5,
  384. from /usr/include/python3.8/Python.h:138,
  385. from _pydevd_bundle/pydevd_cython.c:17:
  386. /usr/include/python3.8/code.h:122:28: note: declared here
  387. 122 | PyAPI_FUNC(PyCodeObject *) PyCode_New(
  388. | ^~~~~~~~~~
  389. /usr/include/python3.8/code.h:72:25: warning: passing argument 6 of ‘PyCode_New’ makes pointer from integer without a cast [-Wint-conversion]
  390. 72 | #define CO_OPTIMIZED 0x0001
  391. | ^
  392. | |
  393. | int
  394. _pydevd_bundle/pydevd_cython.c:331:37: note: in definition of macro ‘__Pyx_PyCode_New’
  395. 331 | PyCode_New(a, 0, k, l, s, f, code, c, n, v, fv, cell, fn, name, fline, lnos)
  396. | ^
  397. _pydevd_bundle/pydevd_cython.c:32316:63: note: in expansion of macro ‘CO_OPTIMIZED’
  398. 32316 | __pyx_codeobj__12 = (PyObject*)__Pyx_PyCode_New(0, 0, 0, 0, CO_OPTIMIZED|CO_NEWLOCALS, __pyx_empty_bytes, __pyx_empty_tuple, __pyx_empty_tuple, __pyx_empty_tuple, __pyx_empty_tuple, __pyx_empty_tuple, __pyx_kp_s_pydevd_bundle_pydevd_cython_pyx, __pyx_n_s_current_frames, 53, __pyx_empty_bytes); if (unlikely(!__pyx_codeobj__12)) __PYX_ERR(0, 53, __pyx_L1_error)
  399. | ^~~~~~~~~~~~
  400. In file included from /usr/include/python3.8/compile.h:5,
  401. from /usr/include/python3.8/Python.h:138,
  402. from _pydevd_bundle/pydevd_cython.c:17:
  403. /usr/include/python3.8/code.h:122:28: note: expected ‘PyObject *’ {aka ‘struct _object *’} but argument is of type ‘int’
  404. 122 | PyAPI_FUNC(PyCodeObject *) PyCode_New(
  405. | ^~~~~~~~~~
  406. _pydevd_bundle/pydevd_cython.c:32316:248: warning: passing argument 14 of ‘PyCode_New’ makes integer from pointer without a cast [-Wint-conversion]
  407. 32316 | __pyx_codeobj__12 = (PyObject*)__Pyx_PyCode_New(0, 0, 0, 0, CO_OPTIMIZED|CO_NEWLOCALS, __pyx_empty_bytes, __pyx_empty_tuple, __pyx_empty_tuple, __pyx_empty_tuple, __pyx_empty_tuple, __pyx_empty_tuple, __pyx_kp_s_pydevd_bundle_pydevd_cython_pyx, __pyx_n_s_current_frames, 53, __pyx_empty_bytes); if (unlikely(!__pyx_codeobj__12)) __PYX_ERR(0, 53, __pyx_L1_error)
  408. | ^~~~~~~~~~~~~~~~~~~~~~~~
  409. | |
  410. | PyObject * {aka struct _object *}
  411. _pydevd_bundle/pydevd_cython.c:331:69: note: in definition of macro ‘__Pyx_PyCode_New’
  412. 331 | PyCode_New(a, 0, k, l, s, f, code, c, n, v, fv, cell, fn, name, fline, lnos)
  413. | ^~~~
  414. In file included from /usr/include/python3.8/compile.h:5,
  415. from /usr/include/python3.8/Python.h:138,
  416. from _pydevd_bundle/pydevd_cython.c:17:
  417. /usr/include/python3.8/code.h:122:28: note: expected ‘int’ but argument is of type ‘PyObject *’ {aka ‘struct _object *’}
  418. 122 | PyAPI_FUNC(PyCodeObject *) PyCode_New(
  419. | ^~~~~~~~~~
  420. _pydevd_bundle/pydevd_cython.c:32316:274: warning: passing argument 15 of ‘PyCode_New’ makes pointer from integer without a cast [-Wint-conversion]
  421. 32316 | __pyx_codeobj__12 = (PyObject*)__Pyx_PyCode_New(0, 0, 0, 0, CO_OPTIMIZED|CO_NEWLOCALS, __pyx_empty_bytes, __pyx_empty_tuple, __pyx_empty_tuple, __pyx_empty_tuple, __pyx_empty_tuple, __pyx_empty_tuple, __pyx_kp_s_pydevd_bundle_pydevd_cython_pyx, __pyx_n_s_current_frames, 53, __pyx_empty_bytes); if (unlikely(!__pyx_codeobj__12)) __PYX_ERR(0, 53, __pyx_L1_error)
  422. | ^~
  423. | |
  424. | int
  425. _pydevd_bundle/pydevd_cython.c:331:75: note: in definition of macro ‘__Pyx_PyCode_New’
  426. 331 | PyCode_New(a, 0, k, l, s, f, code, c, n, v, fv, cell, fn, name, fline, lnos)
  427. | ^~~~~
  428. In file included from /usr/include/python3.8/compile.h:5,
  429. from /usr/include/python3.8/Python.h:138,
  430. from _pydevd_bundle/pydevd_cython.c:17:
  431. /usr/include/python3.8/code.h:122:28: note: expected ‘PyObject *’ {aka ‘struct _object *’} but argument is of type ‘int’
  432. 122 | PyAPI_FUNC(PyCodeObject *) PyCode_New(
  433. | ^~~~~~~~~~
  434. _pydevd_bundle/pydevd_cython.c:331:11: error: too many arguments to function ‘PyCode_New’
  435. 331 | PyCode_New(a, 0, k, l, s, f, code, c, n, v, fv, cell, fn, name, fline, lnos)
  436. | ^~~~~~~~~~
  437. _pydevd_bundle/pydevd_cython.c:32316:34: note: in expansion of macro ‘__Pyx_PyCode_New’
  438. 32316 | __pyx_codeobj__12 = (PyObject*)__Pyx_PyCode_New(0, 0, 0, 0, CO_OPTIMIZED|CO_NEWLOCALS, __pyx_empty_bytes, __pyx_empty_tuple, __pyx_empty_tuple, __pyx_empty_tuple, __pyx_empty_tuple, __pyx_empty_tuple, __pyx_kp_s_pydevd_bundle_pydevd_cython_pyx, __pyx_n_s_current_frames, 53, __pyx_empty_bytes); if (unlikely(!__pyx_codeobj__12)) __PYX_ERR(0, 53, __pyx_L1_error)
  439. | ^~~~~~~~~~~~~~~~
  440. In file included from /usr/include/python3.8/compile.h:5,
  441. from /usr/include/python3.8/Python.h:138,
  442. from _pydevd_bundle/pydevd_cython.c:17:
  443. /usr/include/python3.8/code.h:122:28: note: declared here
  444. 122 | PyAPI_FUNC(PyCodeObject *) PyCode_New(
  445. | ^~~~~~~~~~
  446. /usr/include/python3.8/code.h:72:25: warning: passing argument 6 of ‘PyCode_New’ makes pointer from integer without a cast [-Wint-conversion]
  447. 72 | #define CO_OPTIMIZED 0x0001
  448. | ^
  449. | |
  450. | int
  451. _pydevd_bundle/pydevd_cython.c:331:37: note: in definition of macro ‘__Pyx_PyCode_New’
  452. 331 | PyCode_New(a, 0, k, l, s, f, code, c, n, v, fv, cell, fn, name, fline, lnos)
  453. | ^
  454. _pydevd_bundle/pydevd_cython.c:32339:63: note: in expansion of macro ‘CO_OPTIMIZED’
  455. 32339 | __pyx_codeobj__15 = (PyObject*)__Pyx_PyCode_New(1, 0, 2, 0, CO_OPTIMIZED|CO_NEWLOCALS, __pyx_empty_bytes, __pyx_empty_tuple, __pyx_empty_tuple, __pyx_tuple__14, __pyx_empty_tuple, __pyx_empty_tuple, __pyx_kp_s_pydevd_bundle_pydevd_cython_pyx, __pyx_n_s_set_additional_thread_info, 131, __pyx_empty_bytes); if (unlikely(!__pyx_codeobj__15)) __PYX_ERR(0, 131, __pyx_L1_error)
  456. | ^~~~~~~~~~~~
  457. In file included from /usr/include/python3.8/compile.h:5,
  458. from /usr/include/python3.8/Python.h:138,
  459. from _pydevd_bundle/pydevd_cython.c:17:
  460. /usr/include/python3.8/code.h:122:28: note: expected ‘PyObject *’ {aka ‘struct _object *’} but argument is of type ‘int’
  461. 122 | PyAPI_FUNC(PyCodeObject *) PyCode_New(
  462. | ^~~~~~~~~~
  463. _pydevd_bundle/pydevd_cython.c:32339:246: warning: passing argument 14 of ‘PyCode_New’ makes integer from pointer without a cast [-Wint-conversion]
  464. 32339 | __pyx_codeobj__15 = (PyObject*)__Pyx_PyCode_New(1, 0, 2, 0, CO_OPTIMIZED|CO_NEWLOCALS, __pyx_empty_bytes, __pyx_empty_tuple, __pyx_empty_tuple, __pyx_tuple__14, __pyx_empty_tuple, __pyx_empty_tuple, __pyx_kp_s_pydevd_bundle_pydevd_cython_pyx, __pyx_n_s_set_additional_thread_info, 131, __pyx_empty_bytes); if (unlikely(!__pyx_codeobj__15)) __PYX_ERR(0, 131, __pyx_L1_error)
  465. | ^~~~~~~~~~~~~~~~~~~~~~~~~~~~~~~~~~~~
  466. | |
  467. | PyObject * {aka struct _object *}
  468. _pydevd_bundle/pydevd_cython.c:331:69: note: in definition of macro ‘__Pyx_PyCode_New’
  469. 331 | PyCode_New(a, 0, k, l, s, f, code, c, n, v, fv, cell, fn, name, fline, lnos)
  470. | ^~~~
  471. In file included from /usr/include/python3.8/compile.h:5,
  472. from /usr/include/python3.8/Python.h:138,
  473. from _pydevd_bundle/pydevd_cython.c:17:
  474. /usr/include/python3.8/code.h:122:28: note: expected ‘int’ but argument is of type ‘PyObject *’ {aka ‘struct _object *’}
  475. 122 | PyAPI_FUNC(PyCodeObject *) PyCode_New(
  476. | ^~~~~~~~~~
  477. _pydevd_bundle/pydevd_cython.c:32339:284: warning: passing argument 15 of ‘PyCode_New’ makes pointer from integer without a cast [-Wint-conversion]
  478. 32339 | __pyx_codeobj__15 = (PyObject*)__Pyx_PyCode_New(1, 0, 2, 0, CO_OPTIMIZED|CO_NEWLOCALS, __pyx_empty_bytes, __pyx_empty_tuple, __pyx_empty_tuple, __pyx_tuple__14, __pyx_empty_tuple, __pyx_empty_tuple, __pyx_kp_s_pydevd_bundle_pydevd_cython_pyx, __pyx_n_s_set_additional_thread_info, 131, __pyx_empty_bytes); if (unlikely(!__pyx_codeobj__15)) __PYX_ERR(0, 131, __pyx_L1_error)
  479. | ^~~
  480. | |
  481. | int
  482. _pydevd_bundle/pydevd_cython.c:331:75: note: in definition of macro ‘__Pyx_PyCode_New’
  483. 331 | PyCode_New(a, 0, k, l, s, f, code, c, n, v, fv, cell, fn, name, fline, lnos)
  484. | ^~~~~
  485. In file included from /usr/include/python3.8/compile.h:5,
  486. from /usr/include/python3.8/Python.h:138,
  487. from _pydevd_bundle/pydevd_cython.c:17:
  488. /usr/include/python3.8/code.h:122:28: note: expected ‘PyObject *’ {aka ‘struct _object *’} but argument is of type ‘int’
  489. 122 | PyAPI_FUNC(PyCodeObject *) PyCode_New(
  490. | ^~~~~~~~~~
  491. _pydevd_bundle/pydevd_cython.c:331:11: error: too many arguments to function ‘PyCode_New’
  492. 331 | PyCode_New(a, 0, k, l, s, f, code, c, n, v, fv, cell, fn, name, fline, lnos)
  493. | ^~~~~~~~~~
  494. _pydevd_bundle/pydevd_cython.c:32339:34: note: in expansion of macro ‘__Pyx_PyCode_New’
  495. 32339 | __pyx_codeobj__15 = (PyObject*)__Pyx_PyCode_New(1, 0, 2, 0, CO_OPTIMIZED|CO_NEWLOCALS, __pyx_empty_bytes, __pyx_empty_tuple, __pyx_empty_tuple, __pyx_tuple__14, __pyx_empty_tuple, __pyx_empty_tuple, __pyx_kp_s_pydevd_bundle_pydevd_cython_pyx, __pyx_n_s_set_additional_thread_info, 131, __pyx_empty_bytes); if (unlikely(!__pyx_codeobj__15)) __PYX_ERR(0, 131, __pyx_L1_error)
  496. | ^~~~~~~~~~~~~~~~
  497. In file included from /usr/include/python3.8/compile.h:5,
  498. from /usr/include/python3.8/Python.h:138,
  499. from _pydevd_bundle/pydevd_cython.c:17:
  500. /usr/include/python3.8/code.h:122:28: note: declared here
  501. 122 | PyAPI_FUNC(PyCodeObject *) PyCode_New(
  502. | ^~~~~~~~~~
  503. /usr/include/python3.8/code.h:72:25: warning: passing argument 6 of ‘PyCode_New’ makes pointer from integer without a cast [-Wint-conversion]
  504. 72 | #define CO_OPTIMIZED 0x0001
  505. | ^
  506. | |
  507. | int
  508. _pydevd_bundle/pydevd_cython.c:331:37: note: in definition of macro ‘__Pyx_PyCode_New’
  509. 331 | PyCode_New(a, 0, k, l, s, f, code, c, n, v, fv, cell, fn, name, fline, lnos)
  510. | ^
  511. _pydevd_bundle/pydevd_cython.c:32351:63: note: in expansion of macro ‘CO_OPTIMIZED’
  512. 32351 | __pyx_codeobj__17 = (PyObject*)__Pyx_PyCode_New(0, 0, 2, 0, CO_OPTIMIZED|CO_NEWLOCALS|CO_VARARGS|CO_VARKEYWORDS, __pyx_empty_bytes, __pyx_empty_tuple, __pyx_empty_tuple, __pyx_tuple__16, __pyx_empty_tuple, __pyx_empty_tuple, __pyx_kp_s_pydevd_bundle_pydevd_cython_pyx, __pyx_n_s_send_signature_call_trace, 174, __pyx_empty_bytes); if (unlikely(!__pyx_codeobj__17)) __PYX_ERR(0, 174, __pyx_L1_error)
  513. | ^~~~~~~~~~~~
  514. In file included from /usr/include/python3.8/compile.h:5,
  515. from /usr/include/python3.8/Python.h:138,
  516. from _pydevd_bundle/pydevd_cython.c:17:
  517. /usr/include/python3.8/code.h:122:28: note: expected ‘PyObject *’ {aka ‘struct _object *’} but argument is of type ‘int’
  518. 122 | PyAPI_FUNC(PyCodeObject *) PyCode_New(
  519. | ^~~~~~~~~~
  520. _pydevd_bundle/pydevd_cython.c:32351:272: warning: passing argument 14 of ‘PyCode_New’ makes integer from pointer without a cast [-Wint-conversion]
  521. 32351 | __pyx_codeobj__17 = (PyObject*)__Pyx_PyCode_New(0, 0, 2, 0, CO_OPTIMIZED|CO_NEWLOCALS|CO_VARARGS|CO_VARKEYWORDS, __pyx_empty_bytes, __pyx_empty_tuple, __pyx_empty_tuple, __pyx_tuple__16, __pyx_empty_tuple, __pyx_empty_tuple, __pyx_kp_s_pydevd_bundle_pydevd_cython_pyx, __pyx_n_s_send_signature_call_trace, 174, __pyx_empty_bytes); if (unlikely(!__pyx_codeobj__17)) __PYX_ERR(0, 174, __pyx_L1_error)
  522. | ^~~~~~~~~~~~~~~~~~~~~~~~~~~~~~~~~~~
  523. | |
  524. | PyObject * {aka struct _object *}
  525. _pydevd_bundle/pydevd_cython.c:331:69: note: in definition of macro ‘__Pyx_PyCode_New’
  526. 331 | PyCode_New(a, 0, k, l, s, f, code, c, n, v, fv, cell, fn, name, fline, lnos)
  527. | ^~~~
  528. In file included from /usr/include/python3.8/compile.h:5,
  529. from /usr/include/python3.8/Python.h:138,
  530. from _pydevd_bundle/pydevd_cython.c:17:
  531. /usr/include/python3.8/code.h:122:28: note: expected ‘int’ but argument is of type ‘PyObject *’ {aka ‘struct _object *’}
  532. 122 | PyAPI_FUNC(PyCodeObject *) PyCode_New(
  533. | ^~~~~~~~~~
  534. _pydevd_bundle/pydevd_cython.c:32351:309: warning: passing argument 15 of ‘PyCode_New’ makes pointer from integer without a cast [-Wint-conversion]
  535. 32351 | __pyx_codeobj__17 = (PyObject*)__Pyx_PyCode_New(0, 0, 2, 0, CO_OPTIMIZED|CO_NEWLOCALS|CO_VARARGS|CO_VARKEYWORDS, __pyx_empty_bytes, __pyx_empty_tuple, __pyx_empty_tuple, __pyx_tuple__16, __pyx_empty_tuple, __pyx_empty_tuple, __pyx_kp_s_pydevd_bundle_pydevd_cython_pyx, __pyx_n_s_send_signature_call_trace, 174, __pyx_empty_bytes); if (unlikely(!__pyx_codeobj__17)) __PYX_ERR(0, 174, __pyx_L1_error)
  536. | ^~~
  537. | |
  538. | int
  539. _pydevd_bundle/pydevd_cython.c:331:75: note: in definition of macro ‘__Pyx_PyCode_New’
  540. 331 | PyCode_New(a, 0, k, l, s, f, code, c, n, v, fv, cell, fn, name, fline, lnos)
  541. | ^~~~~
  542. In file included from /usr/include/python3.8/compile.h:5,
  543. from /usr/include/python3.8/Python.h:138,
  544. from _pydevd_bundle/pydevd_cython.c:17:
  545. /usr/include/python3.8/code.h:122:28: note: expected ‘PyObject *’ {aka ‘struct _object *’} but argument is of type ‘int’
  546. 122 | PyAPI_FUNC(PyCodeObject *) PyCode_New(
  547. | ^~~~~~~~~~
  548. _pydevd_bundle/pydevd_cython.c:331:11: error: too many arguments to function ‘PyCode_New’
  549. 331 | PyCode_New(a, 0, k, l, s, f, code, c, n, v, fv, cell, fn, name, fline, lnos)
  550. | ^~~~~~~~~~
  551. _pydevd_bundle/pydevd_cython.c:32351:34: note: in expansion of macro ‘__Pyx_PyCode_New’
  552. 32351 | __pyx_codeobj__17 = (PyObject*)__Pyx_PyCode_New(0, 0, 2, 0, CO_OPTIMIZED|CO_NEWLOCALS|CO_VARARGS|CO_VARKEYWORDS, __pyx_empty_bytes, __pyx_empty_tuple, __pyx_empty_tuple, __pyx_tuple__16, __pyx_empty_tuple, __pyx_empty_tuple, __pyx_kp_s_pydevd_bundle_pydevd_cython_pyx, __pyx_n_s_send_signature_call_trace, 174, __pyx_empty_bytes); if (unlikely(!__pyx_codeobj__17)) __PYX_ERR(0, 174, __pyx_L1_error)
  553. | ^~~~~~~~~~~~~~~~
  554. In file included from /usr/include/python3.8/compile.h:5,
  555. from /usr/include/python3.8/Python.h:138,
  556. from _pydevd_bundle/pydevd_cython.c:17:
  557. /usr/include/python3.8/code.h:122:28: note: declared here
  558. 122 | PyAPI_FUNC(PyCodeObject *) PyCode_New(
  559. | ^~~~~~~~~~
  560. /usr/include/python3.8/code.h:72:25: warning: passing argument 6 of ‘PyCode_New’ makes pointer from integer without a cast [-Wint-conversion]
  561. 72 | #define CO_OPTIMIZED 0x0001
  562. | ^
  563. | |
  564. | int
  565. _pydevd_bundle/pydevd_cython.c:331:37: note: in definition of macro ‘__Pyx_PyCode_New’
  566. 331 | PyCode_New(a, 0, k, l, s, f, code, c, n, v, fv, cell, fn, name, fline, lnos)
  567. | ^
  568. _pydevd_bundle/pydevd_cython.c:32396:64: note: in expansion of macro ‘CO_OPTIMIZED’
  569. 32396 | __pyx_codeobj__22 = (PyObject*)__Pyx_PyCode_New(4, 0, 11, 0, CO_OPTIMIZED|CO_NEWLOCALS, __pyx_empty_bytes, __pyx_empty_tuple, __pyx_empty_tuple, __pyx_tuple__21, __pyx_empty_tuple, __pyx_empty_tuple, __pyx_kp_s_pydevd_bundle_pydevd_cython_pyx, __pyx_n_s_handle_breakpoint_condition, 186, __pyx_empty_bytes); if (unlikely(!__pyx_codeobj__22)) __PYX_ERR(0, 186, __pyx_L1_error)
  570. | ^~~~~~~~~~~~
  571. In file included from /usr/include/python3.8/compile.h:5,
  572. from /usr/include/python3.8/Python.h:138,
  573. from _pydevd_bundle/pydevd_cython.c:17:
  574. /usr/include/python3.8/code.h:122:28: note: expected ‘PyObject *’ {aka ‘struct _object *’} but argument is of type ‘int’
  575. 122 | PyAPI_FUNC(PyCodeObject *) PyCode_New(
  576. | ^~~~~~~~~~
  577. _pydevd_bundle/pydevd_cython.c:32396:247: warning: passing argument 14 of ‘PyCode_New’ makes integer from pointer without a cast [-Wint-conversion]
  578. 32396 | __pyx_codeobj__22 = (PyObject*)__Pyx_PyCode_New(4, 0, 11, 0, CO_OPTIMIZED|CO_NEWLOCALS, __pyx_empty_bytes, __pyx_empty_tuple, __pyx_empty_tuple, __pyx_tuple__21, __pyx_empty_tuple, __pyx_empty_tuple, __pyx_kp_s_pydevd_bundle_pydevd_cython_pyx, __pyx_n_s_handle_breakpoint_condition, 186, __pyx_empty_bytes); if (unlikely(!__pyx_codeobj__22)) __PYX_ERR(0, 186, __pyx_L1_error)
  579. | ^~~~~~~~~~~~~~~~~~~~~~~~~~~~~~~~~~~~~
  580. | |
  581. | PyObject * {aka struct _object *}
  582. _pydevd_bundle/pydevd_cython.c:331:69: note: in definition of macro ‘__Pyx_PyCode_New’
  583. 331 | PyCode_New(a, 0, k, l, s, f, code, c, n, v, fv, cell, fn, name, fline, lnos)
  584. | ^~~~
  585. In file included from /usr/include/python3.8/compile.h:5,
  586. from /usr/include/python3.8/Python.h:138,
  587. from _pydevd_bundle/pydevd_cython.c:17:
  588. /usr/include/python3.8/code.h:122:28: note: expected ‘int’ but argument is of type ‘PyObject *’ {aka ‘struct _object *’}
  589. 122 | PyAPI_FUNC(PyCodeObject *) PyCode_New(
  590. | ^~~~~~~~~~
  591. _pydevd_bundle/pydevd_cython.c:32396:286: warning: passing argument 15 of ‘PyCode_New’ makes pointer from integer without a cast [-Wint-conversion]
  592. 32396 | __pyx_codeobj__22 = (PyObject*)__Pyx_PyCode_New(4, 0, 11, 0, CO_OPTIMIZED|CO_NEWLOCALS, __pyx_empty_bytes, __pyx_empty_tuple, __pyx_empty_tuple, __pyx_tuple__21, __pyx_empty_tuple, __pyx_empty_tuple, __pyx_kp_s_pydevd_bundle_pydevd_cython_pyx, __pyx_n_s_handle_breakpoint_condition, 186, __pyx_empty_bytes); if (unlikely(!__pyx_codeobj__22)) __PYX_ERR(0, 186, __pyx_L1_error)
  593. | ^~~
  594. | |
  595. | int
  596. _pydevd_bundle/pydevd_cython.c:331:75: note: in definition of macro ‘__Pyx_PyCode_New’
  597. 331 | PyCode_New(a, 0, k, l, s, f, code, c, n, v, fv, cell, fn, name, fline, lnos)
  598. | ^~~~~
  599. In file included from /usr/include/python3.8/compile.h:5,
  600. from /usr/include/python3.8/Python.h:138,
  601. from _pydevd_bundle/pydevd_cython.c:17:
  602. /usr/include/python3.8/code.h:122:28: note: expected ‘PyObject *’ {aka ‘struct _object *’} but argument is of type ‘int’
  603. 122 | PyAPI_FUNC(PyCodeObject *) PyCode_New(
  604. | ^~~~~~~~~~
  605. _pydevd_bundle/pydevd_cython.c:331:11: error: too many arguments to function ‘PyCode_New’
  606. 331 | PyCode_New(a, 0, k, l, s, f, code, c, n, v, fv, cell, fn, name, fline, lnos)
  607. | ^~~~~~~~~~
  608. _pydevd_bundle/pydevd_cython.c:32396:34: note: in expansion of macro ‘__Pyx_PyCode_New’
  609. 32396 | __pyx_codeobj__22 = (PyObject*)__Pyx_PyCode_New(4, 0, 11, 0, CO_OPTIMIZED|CO_NEWLOCALS, __pyx_empty_bytes, __pyx_empty_tuple, __pyx_empty_tuple, __pyx_tuple__21, __pyx_empty_tuple, __pyx_empty_tuple, __pyx_kp_s_pydevd_bundle_pydevd_cython_pyx, __pyx_n_s_handle_breakpoint_condition, 186, __pyx_empty_bytes); if (unlikely(!__pyx_codeobj__22)) __PYX_ERR(0, 186, __pyx_L1_error)
  610. | ^~~~~~~~~~~~~~~~
  611. In file included from /usr/include/python3.8/compile.h:5,
  612. from /usr/include/python3.8/Python.h:138,
  613. from _pydevd_bundle/pydevd_cython.c:17:
  614. /usr/include/python3.8/code.h:122:28: note: declared here
  615. 122 | PyAPI_FUNC(PyCodeObject *) PyCode_New(
  616. | ^~~~~~~~~~
  617. /usr/include/python3.8/code.h:72:25: warning: passing argument 6 of ‘PyCode_New’ makes pointer from integer without a cast [-Wint-conversion]
  618. 72 | #define CO_OPTIMIZED 0x0001
  619. | ^
  620. | |
  621. | int
  622. _pydevd_bundle/pydevd_cython.c:331:37: note: in definition of macro ‘__Pyx_PyCode_New’
  623. 331 | PyCode_New(a, 0, k, l, s, f, code, c, n, v, fv, cell, fn, name, fline, lnos)
  624. | ^
  625. _pydevd_bundle/pydevd_cython.c:32408:63: note: in expansion of macro ‘CO_OPTIMIZED’
  626. 32408 | __pyx_codeobj__24 = (PyObject*)__Pyx_PyCode_New(3, 0, 4, 0, CO_OPTIMIZED|CO_NEWLOCALS, __pyx_empty_bytes, __pyx_empty_tuple, __pyx_empty_tuple, __pyx_tuple__23, __pyx_empty_tuple, __pyx_empty_tuple, __pyx_kp_s_pydevd_bundle_pydevd_cython_pyx, __pyx_n_s_handle_breakpoint_expression, 229, __pyx_empty_bytes); if (unlikely(!__pyx_codeobj__24)) __PYX_ERR(0, 229, __pyx_L1_error)
  627. | ^~~~~~~~~~~~
  628. In file included from /usr/include/python3.8/compile.h:5,
  629. from /usr/include/python3.8/Python.h:138,
  630. from _pydevd_bundle/pydevd_cython.c:17:
  631. /usr/include/python3.8/code.h:122:28: note: expected ‘PyObject *’ {aka ‘struct _object *’} but argument is of type ‘int’
  632. 122 | PyAPI_FUNC(PyCodeObject *) PyCode_New(
  633. | ^~~~~~~~~~
  634. _pydevd_bundle/pydevd_cython.c:32408:246: warning: passing argument 14 of ‘PyCode_New’ makes integer from pointer without a cast [-Wint-conversion]
  635. 32408 | __pyx_codeobj__24 = (PyObject*)__Pyx_PyCode_New(3, 0, 4, 0, CO_OPTIMIZED|CO_NEWLOCALS, __pyx_empty_bytes, __pyx_empty_tuple, __pyx_empty_tuple, __pyx_tuple__23, __pyx_empty_tuple, __pyx_empty_tuple, __pyx_kp_s_pydevd_bundle_pydevd_cython_pyx, __pyx_n_s_handle_breakpoint_expression, 229, __pyx_empty_bytes); if (unlikely(!__pyx_codeobj__24)) __PYX_ERR(0, 229, __pyx_L1_error)
  636. | ^~~~~~~~~~~~~~~~~~~~~~~~~~~~~~~~~~~~~~
  637. | |
  638. | PyObject * {aka struct _object *}
  639. _pydevd_bundle/pydevd_cython.c:331:69: note: in definition of macro ‘__Pyx_PyCode_New’
  640. 331 | PyCode_New(a, 0, k, l, s, f, code, c, n, v, fv, cell, fn, name, fline, lnos)
  641. | ^~~~
  642. In file included from /usr/include/python3.8/compile.h:5,
  643. from /usr/include/python3.8/Python.h:138,
  644. from _pydevd_bundle/pydevd_cython.c:17:
  645. /usr/include/python3.8/code.h:122:28: note: expected ‘int’ but argument is of type ‘PyObject *’ {aka ‘struct _object *’}
  646. 122 | PyAPI_FUNC(PyCodeObject *) PyCode_New(
  647. | ^~~~~~~~~~
  648. _pydevd_bundle/pydevd_cython.c:32408:286: warning: passing argument 15 of ‘PyCode_New’ makes pointer from integer without a cast [-Wint-conversion]
  649. 32408 | __pyx_codeobj__24 = (PyObject*)__Pyx_PyCode_New(3, 0, 4, 0, CO_OPTIMIZED|CO_NEWLOCALS, __pyx_empty_bytes, __pyx_empty_tuple, __pyx_empty_tuple, __pyx_tuple__23, __pyx_empty_tuple, __pyx_empty_tuple, __pyx_kp_s_pydevd_bundle_pydevd_cython_pyx, __pyx_n_s_handle_breakpoint_expression, 229, __pyx_empty_bytes); if (unlikely(!__pyx_codeobj__24)) __PYX_ERR(0, 229, __pyx_L1_error)
  650. | ^~~
  651. | |
  652. | int
  653. _pydevd_bundle/pydevd_cython.c:331:75: note: in definition of macro ‘__Pyx_PyCode_New’
  654. 331 | PyCode_New(a, 0, k, l, s, f, code, c, n, v, fv, cell, fn, name, fline, lnos)
  655. | ^~~~~
  656. In file included from /usr/include/python3.8/compile.h:5,
  657. from /usr/include/python3.8/Python.h:138,
  658. from _pydevd_bundle/pydevd_cython.c:17:
  659. /usr/include/python3.8/code.h:122:28: note: expected ‘PyObject *’ {aka ‘struct _object *’} but argument is of type ‘int’
  660. 122 | PyAPI_FUNC(PyCodeObject *) PyCode_New(
  661. | ^~~~~~~~~~
  662. _pydevd_bundle/pydevd_cython.c:331:11: error: too many arguments to function ‘PyCode_New’
  663. 331 | PyCode_New(a, 0, k, l, s, f, code, c, n, v, fv, cell, fn, name, fline, lnos)
  664. | ^~~~~~~~~~
  665. _pydevd_bundle/pydevd_cython.c:32408:34: note: in expansion of macro ‘__Pyx_PyCode_New’
  666. 32408 | __pyx_codeobj__24 = (PyObject*)__Pyx_PyCode_New(3, 0, 4, 0, CO_OPTIMIZED|CO_NEWLOCALS, __pyx_empty_bytes, __pyx_empty_tuple, __pyx_empty_tuple, __pyx_tuple__23, __pyx_empty_tuple, __pyx_empty_tuple, __pyx_kp_s_pydevd_bundle_pydevd_cython_pyx, __pyx_n_s_handle_breakpoint_expression, 229, __pyx_empty_bytes); if (unlikely(!__pyx_codeobj__24)) __PYX_ERR(0, 229, __pyx_L1_error)
  667. | ^~~~~~~~~~~~~~~~
  668. In file included from /usr/include/python3.8/compile.h:5,
  669. from /usr/include/python3.8/Python.h:138,
  670. from _pydevd_bundle/pydevd_cython.c:17:
  671. /usr/include/python3.8/code.h:122:28: note: declared here
  672. 122 | PyAPI_FUNC(PyCodeObject *) PyCode_New(
  673. | ^~~~~~~~~~
  674. /usr/include/python3.8/code.h:72:25: warning: passing argument 6 of ‘PyCode_New’ makes pointer from integer without a cast [-Wint-conversion]
  675. 72 | #define CO_OPTIMIZED 0x0001
  676. | ^
  677. | |
  678. | int
  679. _pydevd_bundle/pydevd_cython.c:331:37: note: in definition of macro ‘__Pyx_PyCode_New’
  680. 331 | PyCode_New(a, 0, k, l, s, f, code, c, n, v, fv, cell, fn, name, fline, lnos)
  681. | ^
  682. _pydevd_bundle/pydevd_cython.c:32420:64: note: in expansion of macro ‘CO_OPTIMIZED’
  683. 32420 | __pyx_codeobj__26 = (PyObject*)__Pyx_PyCode_New(2, 0, 13, 0, CO_OPTIMIZED|CO_NEWLOCALS, __pyx_empty_bytes, __pyx_empty_tuple, __pyx_empty_tuple, __pyx_tuple__25, __pyx_empty_tuple, __pyx_empty_tuple, __pyx_kp_s_pydevd_bundle_pydevd_cython_pyx, __pyx_n_s_fix_top_level_trace_and_get_trac, 1036, __pyx_empty_bytes); if (unlikely(!__pyx_codeobj__26)) __PYX_ERR(0, 1036, __pyx_L1_error)
  684. | ^~~~~~~~~~~~
  685. In file included from /usr/include/python3.8/compile.h:5,
  686. from /usr/include/python3.8/Python.h:138,
  687. from _pydevd_bundle/pydevd_cython.c:17:
  688. /usr/include/python3.8/code.h:122:28: note: expected ‘PyObject *’ {aka ‘struct _object *’} but argument is of type ‘int’
  689. 122 | PyAPI_FUNC(PyCodeObject *) PyCode_New(
  690. | ^~~~~~~~~~
  691. _pydevd_bundle/pydevd_cython.c:32420:247: warning: passing argument 14 of ‘PyCode_New’ makes integer from pointer without a cast [-Wint-conversion]
  692. 32420 | __pyx_codeobj__26 = (PyObject*)__Pyx_PyCode_New(2, 0, 13, 0, CO_OPTIMIZED|CO_NEWLOCALS, __pyx_empty_bytes, __pyx_empty_tuple, __pyx_empty_tuple, __pyx_tuple__25, __pyx_empty_tuple, __pyx_empty_tuple, __pyx_kp_s_pydevd_bundle_pydevd_cython_pyx, __pyx_n_s_fix_top_level_trace_and_get_trac, 1036, __pyx_empty_bytes); if (unlikely(!__pyx_codeobj__26)) __PYX_ERR(0, 1036, __pyx_L1_error)
  693. | ^~~~~~~~~~~~~~~~~~~~~~~~~~~~~~~~~~~~~~~~~~
  694. | |
  695. | PyObject * {aka struct _object *}
  696. _pydevd_bundle/pydevd_cython.c:331:69: note: in definition of macro ‘__Pyx_PyCode_New’
  697. 331 | PyCode_New(a, 0, k, l, s, f, code, c, n, v, fv, cell, fn, name, fline, lnos)
  698. | ^~~~
  699. In file included from /usr/include/python3.8/compile.h:5,
  700. from /usr/include/python3.8/Python.h:138,
  701. from _pydevd_bundle/pydevd_cython.c:17:
  702. /usr/include/python3.8/code.h:122:28: note: expected ‘int’ but argument is of type ‘PyObject *’ {aka ‘struct _object *’}
  703. 122 | PyAPI_FUNC(PyCodeObject *) PyCode_New(
  704. | ^~~~~~~~~~
  705. _pydevd_bundle/pydevd_cython.c:32420:291: warning: passing argument 15 of ‘PyCode_New’ makes pointer from integer without a cast [-Wint-conversion]
  706. 32420 | __pyx_codeobj__26 = (PyObject*)__Pyx_PyCode_New(2, 0, 13, 0, CO_OPTIMIZED|CO_NEWLOCALS, __pyx_empty_bytes, __pyx_empty_tuple, __pyx_empty_tuple, __pyx_tuple__25, __pyx_empty_tuple, __pyx_empty_tuple, __pyx_kp_s_pydevd_bundle_pydevd_cython_pyx, __pyx_n_s_fix_top_level_trace_and_get_trac, 1036, __pyx_empty_bytes); if (unlikely(!__pyx_codeobj__26)) __PYX_ERR(0, 1036, __pyx_L1_error)
  707. | ^~~~
  708. | |
  709. | int
  710. _pydevd_bundle/pydevd_cython.c:331:75: note: in definition of macro ‘__Pyx_PyCode_New’
  711. 331 | PyCode_New(a, 0, k, l, s, f, code, c, n, v, fv, cell, fn, name, fline, lnos)
  712. | ^~~~~
  713. In file included from /usr/include/python3.8/compile.h:5,
  714. from /usr/include/python3.8/Python.h:138,
  715. from _pydevd_bundle/pydevd_cython.c:17:
  716. /usr/include/python3.8/code.h:122:28: note: expected ‘PyObject *’ {aka ‘struct _object *’} but argument is of type ‘int’
  717. 122 | PyAPI_FUNC(PyCodeObject *) PyCode_New(
  718. | ^~~~~~~~~~
  719. _pydevd_bundle/pydevd_cython.c:331:11: error: too many arguments to function ‘PyCode_New’
  720. 331 | PyCode_New(a, 0, k, l, s, f, code, c, n, v, fv, cell, fn, name, fline, lnos)
  721. | ^~~~~~~~~~
  722. _pydevd_bundle/pydevd_cython.c:32420:34: note: in expansion of macro ‘__Pyx_PyCode_New’
  723. 32420 | __pyx_codeobj__26 = (PyObject*)__Pyx_PyCode_New(2, 0, 13, 0, CO_OPTIMIZED|CO_NEWLOCALS, __pyx_empty_bytes, __pyx_empty_tuple, __pyx_empty_tuple, __pyx_tuple__25, __pyx_empty_tuple, __pyx_empty_tuple, __pyx_kp_s_pydevd_bundle_pydevd_cython_pyx, __pyx_n_s_fix_top_level_trace_and_get_trac, 1036, __pyx_empty_bytes); if (unlikely(!__pyx_codeobj__26)) __PYX_ERR(0, 1036, __pyx_L1_error)
  724. | ^~~~~~~~~~~~~~~~
  725. In file included from /usr/include/python3.8/compile.h:5,
  726. from /usr/include/python3.8/Python.h:138,
  727. from _pydevd_bundle/pydevd_cython.c:17:
  728. /usr/include/python3.8/code.h:122:28: note: declared here
  729. 122 | PyAPI_FUNC(PyCodeObject *) PyCode_New(
  730. | ^~~~~~~~~~
  731. /usr/include/python3.8/code.h:72:25: warning: passing argument 6 of ‘PyCode_New’ makes pointer from integer without a cast [-Wint-conversion]
  732. 72 | #define CO_OPTIMIZED 0x0001
  733. | ^
  734. | |
  735. | int
  736. _pydevd_bundle/pydevd_cython.c:331:37: note: in definition of macro ‘__Pyx_PyCode_New’
  737. 331 | PyCode_New(a, 0, k, l, s, f, code, c, n, v, fv, cell, fn, name, fline, lnos)
  738. | ^
  739. _pydevd_bundle/pydevd_cython.c:32432:63: note: in expansion of macro ‘CO_OPTIMIZED’
  740. 32432 | __pyx_codeobj__28 = (PyObject*)__Pyx_PyCode_New(4, 0, 6, 0, CO_OPTIMIZED|CO_NEWLOCALS, __pyx_empty_bytes, __pyx_empty_tuple, __pyx_empty_tuple, __pyx_tuple__27, __pyx_empty_tuple, __pyx_empty_tuple, __pyx_kp_s_pydevd_bundle_pydevd_cython_pyx, __pyx_n_s_trace_dispatch, 1150, __pyx_empty_bytes); if (unlikely(!__pyx_codeobj__28)) __PYX_ERR(0, 1150, __pyx_L1_error)
  741. | ^~~~~~~~~~~~
  742. In file included from /usr/include/python3.8/compile.h:5,
  743. from /usr/include/python3.8/Python.h:138,
  744. from _pydevd_bundle/pydevd_cython.c:17:
  745. /usr/include/python3.8/code.h:122:28: note: expected ‘PyObject *’ {aka ‘struct _object *’} but argument is of type ‘int’
  746. 122 | PyAPI_FUNC(PyCodeObject *) PyCode_New(
  747. | ^~~~~~~~~~
  748. _pydevd_bundle/pydevd_cython.c:32432:246: warning: passing argument 14 of ‘PyCode_New’ makes integer from pointer without a cast [-Wint-conversion]
  749. 32432 | __pyx_codeobj__28 = (PyObject*)__Pyx_PyCode_New(4, 0, 6, 0, CO_OPTIMIZED|CO_NEWLOCALS, __pyx_empty_bytes, __pyx_empty_tuple, __pyx_empty_tuple, __pyx_tuple__27, __pyx_empty_tuple, __pyx_empty_tuple, __pyx_kp_s_pydevd_bundle_pydevd_cython_pyx, __pyx_n_s_trace_dispatch, 1150, __pyx_empty_bytes); if (unlikely(!__pyx_codeobj__28)) __PYX_ERR(0, 1150, __pyx_L1_error)
  750. | ^~~~~~~~~~~~~~~~~~~~~~~~
  751. | |
  752. | PyObject * {aka struct _object *}
  753. _pydevd_bundle/pydevd_cython.c:331:69: note: in definition of macro ‘__Pyx_PyCode_New’
  754. 331 | PyCode_New(a, 0, k, l, s, f, code, c, n, v, fv, cell, fn, name, fline, lnos)
  755. | ^~~~
  756. In file included from /usr/include/python3.8/compile.h:5,
  757. from /usr/include/python3.8/Python.h:138,
  758. from _pydevd_bundle/pydevd_cython.c:17:
  759. /usr/include/python3.8/code.h:122:28: note: expected ‘int’ but argument is of type ‘PyObject *’ {aka ‘struct _object *’}
  760. 122 | PyAPI_FUNC(PyCodeObject *) PyCode_New(
  761. | ^~~~~~~~~~
  762. _pydevd_bundle/pydevd_cython.c:32432:272: warning: passing argument 15 of ‘PyCode_New’ makes pointer from integer without a cast [-Wint-conversion]
  763. 32432 | __pyx_codeobj__28 = (PyObject*)__Pyx_PyCode_New(4, 0, 6, 0, CO_OPTIMIZED|CO_NEWLOCALS, __pyx_empty_bytes, __pyx_empty_tuple, __pyx_empty_tuple, __pyx_tuple__27, __pyx_empty_tuple, __pyx_empty_tuple, __pyx_kp_s_pydevd_bundle_pydevd_cython_pyx, __pyx_n_s_trace_dispatch, 1150, __pyx_empty_bytes); if (unlikely(!__pyx_codeobj__28)) __PYX_ERR(0, 1150, __pyx_L1_error)
  764. | ^~~~
  765. | |
  766. | int
  767. _pydevd_bundle/pydevd_cython.c:331:75: note: in definition of macro ‘__Pyx_PyCode_New’
  768. 331 | PyCode_New(a, 0, k, l, s, f, code, c, n, v, fv, cell, fn, name, fline, lnos)
  769. | ^~~~~
  770. In file included from /usr/include/python3.8/compile.h:5,
  771. from /usr/include/python3.8/Python.h:138,
  772. from _pydevd_bundle/pydevd_cython.c:17:
  773. /usr/include/python3.8/code.h:122:28: note: expected ‘PyObject *’ {aka ‘struct _object *’} but argument is of type ‘int’
  774. 122 | PyAPI_FUNC(PyCodeObject *) PyCode_New(
  775. | ^~~~~~~~~~
  776. _pydevd_bundle/pydevd_cython.c:331:11: error: too many arguments to function ‘PyCode_New’
  777. 331 | PyCode_New(a, 0, k, l, s, f, code, c, n, v, fv, cell, fn, name, fline, lnos)
  778. | ^~~~~~~~~~
  779. _pydevd_bundle/pydevd_cython.c:32432:34: note: in expansion of macro ‘__Pyx_PyCode_New’
  780. 32432 | __pyx_codeobj__28 = (PyObject*)__Pyx_PyCode_New(4, 0, 6, 0, CO_OPTIMIZED|CO_NEWLOCALS, __pyx_empty_bytes, __pyx_empty_tuple, __pyx_empty_tuple, __pyx_tuple__27, __pyx_empty_tuple, __pyx_empty_tuple, __pyx_kp_s_pydevd_bundle_pydevd_cython_pyx, __pyx_n_s_trace_dispatch, 1150, __pyx_empty_bytes); if (unlikely(!__pyx_codeobj__28)) __PYX_ERR(0, 1150, __pyx_L1_error)
  781. | ^~~~~~~~~~~~~~~~
  782. In file included from /usr/include/python3.8/compile.h:5,
  783. from /usr/include/python3.8/Python.h:138,
  784. from _pydevd_bundle/pydevd_cython.c:17:
  785. /usr/include/python3.8/code.h:122:28: note: declared here
  786. 122 | PyAPI_FUNC(PyCodeObject *) PyCode_New(
  787. | ^~~~~~~~~~
  788. /usr/include/python3.8/code.h:72:25: warning: passing argument 6 of ‘PyCode_New’ makes pointer from integer without a cast [-Wint-conversion]
  789. 72 | #define CO_OPTIMIZED 0x0001
  790. | ^
  791. | |
  792. | int
  793. _pydevd_bundle/pydevd_cython.c:331:37: note: in definition of macro ‘__Pyx_PyCode_New’
  794. 331 | PyCode_New(a, 0, k, l, s, f, code, c, n, v, fv, cell, fn, name, fline, lnos)
  795. | ^
  796. _pydevd_bundle/pydevd_cython.c:32444:63: note: in expansion of macro ‘CO_OPTIMIZED’
  797. 32444 | __pyx_codeobj__30 = (PyObject*)__Pyx_PyCode_New(4, 0, 4, 0, CO_OPTIMIZED|CO_NEWLOCALS, __pyx_empty_bytes, __pyx_empty_tuple, __pyx_empty_tuple, __pyx_tuple__29, __pyx_empty_tuple, __pyx_empty_tuple, __pyx_kp_s_pydevd_bundle_pydevd_cython_pyx, __pyx_n_s_call_2, 1484, __pyx_empty_bytes); if (unlikely(!__pyx_codeobj__30)) __PYX_ERR(0, 1484, __pyx_L1_error)
  798. | ^~~~~~~~~~~~
  799. In file included from /usr/include/python3.8/compile.h:5,
  800. from /usr/include/python3.8/Python.h:138,
  801. from _pydevd_bundle/pydevd_cython.c:17:
  802. /usr/include/python3.8/code.h:122:28: note: expected ‘PyObject *’ {aka ‘struct _object *’} but argument is of type ‘int’
  803. 122 | PyAPI_FUNC(PyCodeObject *) PyCode_New(
  804. | ^~~~~~~~~~
  805. _pydevd_bundle/pydevd_cython.c:32444:246: warning: passing argument 14 of ‘PyCode_New’ makes integer from pointer without a cast [-Wint-conversion]
  806. 32444 | __pyx_codeobj__30 = (PyObject*)__Pyx_PyCode_New(4, 0, 4, 0, CO_OPTIMIZED|CO_NEWLOCALS, __pyx_empty_bytes, __pyx_empty_tuple, __pyx_empty_tuple, __pyx_tuple__29, __pyx_empty_tuple, __pyx_empty_tuple, __pyx_kp_s_pydevd_bundle_pydevd_cython_pyx, __pyx_n_s_call_2, 1484, __pyx_empty_bytes); if (unlikely(!__pyx_codeobj__30)) __PYX_ERR(0, 1484, __pyx_L1_error)
  807. | ^~~~~~~~~~~~~~~~
  808. | |
  809. | PyObject * {aka struct _object *}
  810. _pydevd_bundle/pydevd_cython.c:331:69: note: in definition of macro ‘__Pyx_PyCode_New’
  811. 331 | PyCode_New(a, 0, k, l, s, f, code, c, n, v, fv, cell, fn, name, fline, lnos)
  812. | ^~~~
  813. In file included from /usr/include/python3.8/compile.h:5,
  814. from /usr/include/python3.8/Python.h:138,
  815. from _pydevd_bundle/pydevd_cython.c:17:
  816. /usr/include/python3.8/code.h:122:28: note: expected ‘int’ but argument is of type ‘PyObject *’ {aka ‘struct _object *’}
  817. 122 | PyAPI_FUNC(PyCodeObject *) PyCode_New(
  818. | ^~~~~~~~~~
  819. _pydevd_bundle/pydevd_cython.c:32444:264: warning: passing argument 15 of ‘PyCode_New’ makes pointer from integer without a cast [-Wint-conversion]
  820. 32444 | __pyx_codeobj__30 = (PyObject*)__Pyx_PyCode_New(4, 0, 4, 0, CO_OPTIMIZED|CO_NEWLOCALS, __pyx_empty_bytes, __pyx_empty_tuple, __pyx_empty_tuple, __pyx_tuple__29, __pyx_empty_tuple, __pyx_empty_tuple, __pyx_kp_s_pydevd_bundle_pydevd_cython_pyx, __pyx_n_s_call_2, 1484, __pyx_empty_bytes); if (unlikely(!__pyx_codeobj__30)) __PYX_ERR(0, 1484, __pyx_L1_error)
  821. | ^~~~
  822. | |
  823. | int
  824. _pydevd_bundle/pydevd_cython.c:331:75: note: in definition of macro ‘__Pyx_PyCode_New’
  825. 331 | PyCode_New(a, 0, k, l, s, f, code, c, n, v, fv, cell, fn, name, fline, lnos)
  826. | ^~~~~
  827. In file included from /usr/include/python3.8/compile.h:5,
  828. from /usr/include/python3.8/Python.h:138,
  829. from _pydevd_bundle/pydevd_cython.c:17:
  830. /usr/include/python3.8/code.h:122:28: note: expected ‘PyObject *’ {aka ‘struct _object *’} but argument is of type ‘int’
  831. 122 | PyAPI_FUNC(PyCodeObject *) PyCode_New(
  832. | ^~~~~~~~~~
  833. _pydevd_bundle/pydevd_cython.c:331:11: error: too many arguments to function ‘PyCode_New’
  834. 331 | PyCode_New(a, 0, k, l, s, f, code, c, n, v, fv, cell, fn, name, fline, lnos)
  835. | ^~~~~~~~~~
  836. _pydevd_bundle/pydevd_cython.c:32444:34: note: in expansion of macro ‘__Pyx_PyCode_New’
  837. 32444 | __pyx_codeobj__30 = (PyObject*)__Pyx_PyCode_New(4, 0, 4, 0, CO_OPTIMIZED|CO_NEWLOCALS, __pyx_empty_bytes, __pyx_empty_tuple, __pyx_empty_tuple, __pyx_tuple__29, __pyx_empty_tuple, __pyx_empty_tuple, __pyx_kp_s_pydevd_bundle_pydevd_cython_pyx, __pyx_n_s_call_2, 1484, __pyx_empty_bytes); if (unlikely(!__pyx_codeobj__30)) __PYX_ERR(0, 1484, __pyx_L1_error)
  838. | ^~~~~~~~~~~~~~~~
  839. In file included from /usr/include/python3.8/compile.h:5,
  840. from /usr/include/python3.8/Python.h:138,
  841. from _pydevd_bundle/pydevd_cython.c:17:
  842. /usr/include/python3.8/code.h:122:28: note: declared here
  843. 122 | PyAPI_FUNC(PyCodeObject *) PyCode_New(
  844. | ^~~~~~~~~~
  845. /usr/include/python3.8/code.h:72:25: warning: passing argument 6 of ‘PyCode_New’ makes pointer from integer without a cast [-Wint-conversion]
  846. 72 | #define CO_OPTIMIZED 0x0001
  847. | ^
  848. | |
  849. | int
  850. _pydevd_bundle/pydevd_cython.c:331:37: note: in definition of macro ‘__Pyx_PyCode_New’
  851. 331 | PyCode_New(a, 0, k, l, s, f, code, c, n, v, fv, cell, fn, name, fline, lnos)
  852. | ^
  853. _pydevd_bundle/pydevd_cython.c:32454:63: note: in expansion of macro ‘CO_OPTIMIZED’
  854. 32454 | __pyx_codeobj__32 = (PyObject*)__Pyx_PyCode_New(3, 0, 5, 0, CO_OPTIMIZED|CO_NEWLOCALS, __pyx_empty_bytes, __pyx_empty_tuple, __pyx_empty_tuple, __pyx_tuple__31, __pyx_empty_tuple, __pyx_empty_tuple, __pyx_kp_s_stringsource, __pyx_n_s_pyx_unpickle_PyDBAdditionalThr, 1, __pyx_empty_bytes); if (unlikely(!__pyx_codeobj__32)) __PYX_ERR(2, 1, __pyx_L1_error)
  855. | ^~~~~~~~~~~~
  856. In file included from /usr/include/python3.8/compile.h:5,
  857. from /usr/include/python3.8/Python.h:138,
  858. from _pydevd_bundle/pydevd_cython.c:17:
  859. /usr/include/python3.8/code.h:122:28: note: expected ‘PyObject *’ {aka ‘struct _object *’} but argument is of type ‘int’
  860. 122 | PyAPI_FUNC(PyCodeObject *) PyCode_New(
  861. | ^~~~~~~~~~
  862. _pydevd_bundle/pydevd_cython.c:32454:227: warning: passing argument 14 of ‘PyCode_New’ makes integer from pointer without a cast [-Wint-conversion]
  863. 32454 | __pyx_codeobj__32 = (PyObject*)__Pyx_PyCode_New(3, 0, 5, 0, CO_OPTIMIZED|CO_NEWLOCALS, __pyx_empty_bytes, __pyx_empty_tuple, __pyx_empty_tuple, __pyx_tuple__31, __pyx_empty_tuple, __pyx_empty_tuple, __pyx_kp_s_stringsource, __pyx_n_s_pyx_unpickle_PyDBAdditionalThr, 1, __pyx_empty_bytes); if (unlikely(!__pyx_codeobj__32)) __PYX_ERR(2, 1, __pyx_L1_error)
  864. | ^~~~~~~~~~~~~~~~~~~~~~~~~~~~~~~~~~~~~~~~
  865. | |
  866. | PyObject * {aka struct _object *}
  867. _pydevd_bundle/pydevd_cython.c:331:69: note: in definition of macro ‘__Pyx_PyCode_New’
  868. 331 | PyCode_New(a, 0, k, l, s, f, code, c, n, v, fv, cell, fn, name, fline, lnos)
  869. | ^~~~
  870. In file included from /usr/include/python3.8/compile.h:5,
  871. from /usr/include/python3.8/Python.h:138,
  872. from _pydevd_bundle/pydevd_cython.c:17:
  873. /usr/include/python3.8/code.h:122:28: note: expected ‘int’ but argument is of type ‘PyObject *’ {aka ‘struct _object *’}
  874. 122 | PyAPI_FUNC(PyCodeObject *) PyCode_New(
  875. | ^~~~~~~~~~
  876. _pydevd_bundle/pydevd_cython.c:32454:269: warning: passing argument 15 of ‘PyCode_New’ makes pointer from integer without a cast [-Wint-conversion]
  877. 32454 | __pyx_codeobj__32 = (PyObject*)__Pyx_PyCode_New(3, 0, 5, 0, CO_OPTIMIZED|CO_NEWLOCALS, __pyx_empty_bytes, __pyx_empty_tuple, __pyx_empty_tuple, __pyx_tuple__31, __pyx_empty_tuple, __pyx_empty_tuple, __pyx_kp_s_stringsource, __pyx_n_s_pyx_unpickle_PyDBAdditionalThr, 1, __pyx_empty_bytes); if (unlikely(!__pyx_codeobj__32)) __PYX_ERR(2, 1, __pyx_L1_error)
  878. | ^
  879. | |
  880. | int
  881. _pydevd_bundle/pydevd_cython.c:331:75: note: in definition of macro ‘__Pyx_PyCode_New’
  882. 331 | PyCode_New(a, 0, k, l, s, f, code, c, n, v, fv, cell, fn, name, fline, lnos)
  883. | ^~~~~
  884. In file included from /usr/include/python3.8/compile.h:5,
  885. from /usr/include/python3.8/Python.h:138,
  886. from _pydevd_bundle/pydevd_cython.c:17:
  887. /usr/include/python3.8/code.h:122:28: note: expected ‘PyObject *’ {aka ‘struct _object *’} but argument is of type ‘int’
  888. 122 | PyAPI_FUNC(PyCodeObject *) PyCode_New(
  889. | ^~~~~~~~~~
  890. _pydevd_bundle/pydevd_cython.c:331:11: error: too many arguments to function ‘PyCode_New’
  891. 331 | PyCode_New(a, 0, k, l, s, f, code, c, n, v, fv, cell, fn, name, fline, lnos)
  892. | ^~~~~~~~~~
  893. _pydevd_bundle/pydevd_cython.c:32454:34: note: in expansion of macro ‘__Pyx_PyCode_New’
  894. 32454 | __pyx_codeobj__32 = (PyObject*)__Pyx_PyCode_New(3, 0, 5, 0, CO_OPTIMIZED|CO_NEWLOCALS, __pyx_empty_bytes, __pyx_empty_tuple, __pyx_empty_tuple, __pyx_tuple__31, __pyx_empty_tuple, __pyx_empty_tuple, __pyx_kp_s_stringsource, __pyx_n_s_pyx_unpickle_PyDBAdditionalThr, 1, __pyx_empty_bytes); if (unlikely(!__pyx_codeobj__32)) __PYX_ERR(2, 1, __pyx_L1_error)
  895. | ^~~~~~~~~~~~~~~~
  896. In file included from /usr/include/python3.8/compile.h:5,
  897. from /usr/include/python3.8/Python.h:138,
  898. from _pydevd_bundle/pydevd_cython.c:17:
  899. /usr/include/python3.8/code.h:122:28: note: declared here
  900. 122 | PyAPI_FUNC(PyCodeObject *) PyCode_New(
  901. | ^~~~~~~~~~
  902. /usr/include/python3.8/code.h:72:25: warning: passing argument 6 of ‘PyCode_New’ makes pointer from integer without a cast [-Wint-conversion]
  903. 72 | #define CO_OPTIMIZED 0x0001
  904. | ^
  905. | |
  906. | int
  907. _pydevd_bundle/pydevd_cython.c:331:37: note: in definition of macro ‘__Pyx_PyCode_New’
  908. 331 | PyCode_New(a, 0, k, l, s, f, code, c, n, v, fv, cell, fn, name, fline, lnos)
  909. | ^
  910. _pydevd_bundle/pydevd_cython.c:32458:63: note: in expansion of macro ‘CO_OPTIMIZED’
  911. 32458 | __pyx_codeobj__34 = (PyObject*)__Pyx_PyCode_New(3, 0, 5, 0, CO_OPTIMIZED|CO_NEWLOCALS, __pyx_empty_bytes, __pyx_empty_tuple, __pyx_empty_tuple, __pyx_tuple__33, __pyx_empty_tuple, __pyx_empty_tuple, __pyx_kp_s_stringsource, __pyx_n_s_pyx_unpickle_PyDBFrame, 1, __pyx_empty_bytes); if (unlikely(!__pyx_codeobj__34)) __PYX_ERR(2, 1, __pyx_L1_error)
  912. | ^~~~~~~~~~~~
  913. In file included from /usr/include/python3.8/compile.h:5,
  914. from /usr/include/python3.8/Python.h:138,
  915. from _pydevd_bundle/pydevd_cython.c:17:
  916. /usr/include/python3.8/code.h:122:28: note: expected ‘PyObject *’ {aka ‘struct _object *’} but argument is of type ‘int’
  917. 122 | PyAPI_FUNC(PyCodeObject *) PyCode_New(
  918. | ^~~~~~~~~~
  919. _pydevd_bundle/pydevd_cython.c:32458:227: warning: passing argument 14 of ‘PyCode_New’ makes integer from pointer without a cast [-Wint-conversion]
  920. 32458 | __pyx_codeobj__34 = (PyObject*)__Pyx_PyCode_New(3, 0, 5, 0, CO_OPTIMIZED|CO_NEWLOCALS, __pyx_empty_bytes, __pyx_empty_tuple, __pyx_empty_tuple, __pyx_tuple__33, __pyx_empty_tuple, __pyx_empty_tuple, __pyx_kp_s_stringsource, __pyx_n_s_pyx_unpickle_PyDBFrame, 1, __pyx_empty_bytes); if (unlikely(!__pyx_codeobj__34)) __PYX_ERR(2, 1, __pyx_L1_error)
  921. | ^~~~~~~~~~~~~~~~~~~~~~~~~~~~~~~~
  922. | |
  923. | PyObject * {aka struct _object *}
  924. _pydevd_bundle/pydevd_cython.c:331:69: note: in definition of macro ‘__Pyx_PyCode_New’
  925. 331 | PyCode_New(a, 0, k, l, s, f, code, c, n, v, fv, cell, fn, name, fline, lnos)
  926. | ^~~~
  927. In file included from /usr/include/python3.8/compile.h:5,
  928. from /usr/include/python3.8/Python.h:138,
  929. from _pydevd_bundle/pydevd_cython.c:17:
  930. /usr/include/python3.8/code.h:122:28: note: expected ‘int’ but argument is of type ‘PyObject *’ {aka ‘struct _object *’}
  931. 122 | PyAPI_FUNC(PyCodeObject *) PyCode_New(
  932. | ^~~~~~~~~~
  933. _pydevd_bundle/pydevd_cython.c:32458:261: warning: passing argument 15 of ‘PyCode_New’ makes pointer from integer without a cast [-Wint-conversion]
  934. 32458 | __pyx_codeobj__34 = (PyObject*)__Pyx_PyCode_New(3, 0, 5, 0, CO_OPTIMIZED|CO_NEWLOCALS, __pyx_empty_bytes, __pyx_empty_tuple, __pyx_empty_tuple, __pyx_tuple__33, __pyx_empty_tuple, __pyx_empty_tuple, __pyx_kp_s_stringsource, __pyx_n_s_pyx_unpickle_PyDBFrame, 1, __pyx_empty_bytes); if (unlikely(!__pyx_codeobj__34)) __PYX_ERR(2, 1, __pyx_L1_error)
  935. | ^
  936. | |
  937. | int
  938. _pydevd_bundle/pydevd_cython.c:331:75: note: in definition of macro ‘__Pyx_PyCode_New’
  939. 331 | PyCode_New(a, 0, k, l, s, f, code, c, n, v, fv, cell, fn, name, fline, lnos)
  940. | ^~~~~
  941. In file included from /usr/include/python3.8/compile.h:5,
  942. from /usr/include/python3.8/Python.h:138,
  943. from _pydevd_bundle/pydevd_cython.c:17:
  944. /usr/include/python3.8/code.h:122:28: note: expected ‘PyObject *’ {aka ‘struct _object *’} but argument is of type ‘int’
  945. 122 | PyAPI_FUNC(PyCodeObject *) PyCode_New(
  946. | ^~~~~~~~~~
  947. _pydevd_bundle/pydevd_cython.c:331:11: error: too many arguments to function ‘PyCode_New’
  948. 331 | PyCode_New(a, 0, k, l, s, f, code, c, n, v, fv, cell, fn, name, fline, lnos)
  949. | ^~~~~~~~~~
  950. _pydevd_bundle/pydevd_cython.c:32458:34: note: in expansion of macro ‘__Pyx_PyCode_New’
  951. 32458 | __pyx_codeobj__34 = (PyObject*)__Pyx_PyCode_New(3, 0, 5, 0, CO_OPTIMIZED|CO_NEWLOCALS, __pyx_empty_bytes, __pyx_empty_tuple, __pyx_empty_tuple, __pyx_tuple__33, __pyx_empty_tuple, __pyx_empty_tuple, __pyx_kp_s_stringsource, __pyx_n_s_pyx_unpickle_PyDBFrame, 1, __pyx_empty_bytes); if (unlikely(!__pyx_codeobj__34)) __PYX_ERR(2, 1, __pyx_L1_error)
  952. | ^~~~~~~~~~~~~~~~
  953. In file included from /usr/include/python3.8/compile.h:5,
  954. from /usr/include/python3.8/Python.h:138,
  955. from _pydevd_bundle/pydevd_cython.c:17:
  956. /usr/include/python3.8/code.h:122:28: note: declared here
  957. 122 | PyAPI_FUNC(PyCodeObject *) PyCode_New(
  958. | ^~~~~~~~~~
  959. /usr/include/python3.8/code.h:72:25: warning: passing argument 6 of ‘PyCode_New’ makes pointer from integer without a cast [-Wint-conversion]
  960. 72 | #define CO_OPTIMIZED 0x0001
  961. | ^
  962. | |
  963. | int
  964. _pydevd_bundle/pydevd_cython.c:331:37: note: in definition of macro ‘__Pyx_PyCode_New’
  965. 331 | PyCode_New(a, 0, k, l, s, f, code, c, n, v, fv, cell, fn, name, fline, lnos)
  966. | ^
  967. _pydevd_bundle/pydevd_cython.c:32462:63: note: in expansion of macro ‘CO_OPTIMIZED’
  968. 32462 | __pyx_codeobj__36 = (PyObject*)__Pyx_PyCode_New(3, 0, 5, 0, CO_OPTIMIZED|CO_NEWLOCALS, __pyx_empty_bytes, __pyx_empty_tuple, __pyx_empty_tuple, __pyx_tuple__35, __pyx_empty_tuple, __pyx_empty_tuple, __pyx_kp_s_stringsource, __pyx_n_s_pyx_unpickle_SafeCallWrapper, 1, __pyx_empty_bytes); if (unlikely(!__pyx_codeobj__36)) __PYX_ERR(2, 1, __pyx_L1_error)
  969. | ^~~~~~~~~~~~
  970. In file included from /usr/include/python3.8/compile.h:5,
  971. from /usr/include/python3.8/Python.h:138,
  972. from _pydevd_bundle/pydevd_cython.c:17:
  973. /usr/include/python3.8/code.h:122:28: note: expected ‘PyObject *’ {aka ‘struct _object *’} but argument is of type ‘int’
  974. 122 | PyAPI_FUNC(PyCodeObject *) PyCode_New(
  975. | ^~~~~~~~~~
  976. _pydevd_bundle/pydevd_cython.c:32462:227: warning: passing argument 14 of ‘PyCode_New’ makes integer from pointer without a cast [-Wint-conversion]
  977. 32462 | __pyx_codeobj__36 = (PyObject*)__Pyx_PyCode_New(3, 0, 5, 0, CO_OPTIMIZED|CO_NEWLOCALS, __pyx_empty_bytes, __pyx_empty_tuple, __pyx_empty_tuple, __pyx_tuple__35, __pyx_empty_tuple, __pyx_empty_tuple, __pyx_kp_s_stringsource, __pyx_n_s_pyx_unpickle_SafeCallWrapper, 1, __pyx_empty_bytes); if (unlikely(!__pyx_codeobj__36)) __PYX_ERR(2, 1, __pyx_L1_error)
  978. | ^~~~~~~~~~~~~~~~~~~~~~~~~~~~~~~~~~~~~~
  979. | |
  980. | PyObject * {aka struct _object *}
  981. _pydevd_bundle/pydevd_cython.c:331:69: note: in definition of macro ‘__Pyx_PyCode_New’
  982. 331 | PyCode_New(a, 0, k, l, s, f, code, c, n, v, fv, cell, fn, name, fline, lnos)
  983. | ^~~~
  984. In file included from /usr/include/python3.8/compile.h:5,
  985. from /usr/include/python3.8/Python.h:138,
  986. from _pydevd_bundle/pydevd_cython.c:17:
  987. /usr/include/python3.8/code.h:122:28: note: expected ‘int’ but argument is of type ‘PyObject *’ {aka ‘struct _object *’}
  988. 122 | PyAPI_FUNC(PyCodeObject *) PyCode_New(
  989. | ^~~~~~~~~~
  990. _pydevd_bundle/pydevd_cython.c:32462:267: warning: passing argument 15 of ‘PyCode_New’ makes pointer from integer without a cast [-Wint-conversion]
  991. 32462 | __pyx_codeobj__36 = (PyObject*)__Pyx_PyCode_New(3, 0, 5, 0, CO_OPTIMIZED|CO_NEWLOCALS, __pyx_empty_bytes, __pyx_empty_tuple, __pyx_empty_tuple, __pyx_tuple__35, __pyx_empty_tuple, __pyx_empty_tuple, __pyx_kp_s_stringsource, __pyx_n_s_pyx_unpickle_SafeCallWrapper, 1, __pyx_empty_bytes); if (unlikely(!__pyx_codeobj__36)) __PYX_ERR(2, 1, __pyx_L1_error)
  992. | ^
  993. | |
  994. | int
  995. _pydevd_bundle/pydevd_cython.c:331:75: note: in definition of macro ‘__Pyx_PyCode_New’
  996. 331 | PyCode_New(a, 0, k, l, s, f, code, c, n, v, fv, cell, fn, name, fline, lnos)
  997. | ^~~~~
  998. In file included from /usr/include/python3.8/compile.h:5,
  999. from /usr/include/python3.8/Python.h:138,
  1000. from _pydevd_bundle/pydevd_cython.c:17:
  1001. /usr/include/python3.8/code.h:122:28: note: expected ‘PyObject *’ {aka ‘struct _object *’} but argument is of type ‘int’
  1002. 122 | PyAPI_FUNC(PyCodeObject *) PyCode_New(
  1003. | ^~~~~~~~~~
  1004. _pydevd_bundle/pydevd_cython.c:331:11: error: too many arguments to function ‘PyCode_New’
  1005. 331 | PyCode_New(a, 0, k, l, s, f, code, c, n, v, fv, cell, fn, name, fline, lnos)
  1006. | ^~~~~~~~~~
  1007. _pydevd_bundle/pydevd_cython.c:32462:34: note: in expansion of macro ‘__Pyx_PyCode_New’
  1008. 32462 | __pyx_codeobj__36 = (PyObject*)__Pyx_PyCode_New(3, 0, 5, 0, CO_OPTIMIZED|CO_NEWLOCALS, __pyx_empty_bytes, __pyx_empty_tuple, __pyx_empty_tuple, __pyx_tuple__35, __pyx_empty_tuple, __pyx_empty_tuple, __pyx_kp_s_stringsource, __pyx_n_s_pyx_unpickle_SafeCallWrapper, 1, __pyx_empty_bytes); if (unlikely(!__pyx_codeobj__36)) __PYX_ERR(2, 1, __pyx_L1_error)
  1009. | ^~~~~~~~~~~~~~~~
  1010. In file included from /usr/include/python3.8/compile.h:5,
  1011. from /usr/include/python3.8/Python.h:138,
  1012. from _pydevd_bundle/pydevd_cython.c:17:
  1013. /usr/include/python3.8/code.h:122:28: note: declared here
  1014. 122 | PyAPI_FUNC(PyCodeObject *) PyCode_New(
  1015. | ^~~~~~~~~~
  1016. /usr/include/python3.8/code.h:72:25: warning: passing argument 6 of ‘PyCode_New’ makes pointer from integer without a cast [-Wint-conversion]
  1017. 72 | #define CO_OPTIMIZED 0x0001
  1018. | ^
  1019. | |
  1020. | int
  1021. _pydevd_bundle/pydevd_cython.c:331:37: note: in definition of macro ‘__Pyx_PyCode_New’
  1022. 331 | PyCode_New(a, 0, k, l, s, f, code, c, n, v, fv, cell, fn, name, fline, lnos)
  1023. | ^
  1024. _pydevd_bundle/pydevd_cython.c:32466:63: note: in expansion of macro ‘CO_OPTIMIZED’
  1025. 32466 | __pyx_codeobj__38 = (PyObject*)__Pyx_PyCode_New(3, 0, 5, 0, CO_OPTIMIZED|CO_NEWLOCALS, __pyx_empty_bytes, __pyx_empty_tuple, __pyx_empty_tuple, __pyx_tuple__37, __pyx_empty_tuple, __pyx_empty_tuple, __pyx_kp_s_stringsource, __pyx_n_s_pyx_unpickle_TopLevelThreadTra, 1, __pyx_empty_bytes); if (unlikely(!__pyx_codeobj__38)) __PYX_ERR(2, 1, __pyx_L1_error)
  1026. | ^~~~~~~~~~~~
  1027. In file included from /usr/include/python3.8/compile.h:5,
  1028. from /usr/include/python3.8/Python.h:138,
  1029. from _pydevd_bundle/pydevd_cython.c:17:
  1030. /usr/include/python3.8/code.h:122:28: note: expected ‘PyObject *’ {aka ‘struct _object *’} but argument is of type ‘int’
  1031. 122 | PyAPI_FUNC(PyCodeObject *) PyCode_New(
  1032. | ^~~~~~~~~~
  1033. _pydevd_bundle/pydevd_cython.c:32466:227: warning: passing argument 14 of ‘PyCode_New’ makes integer from pointer without a cast [-Wint-conversion]
  1034. 32466 | __pyx_codeobj__38 = (PyObject*)__Pyx_PyCode_New(3, 0, 5, 0, CO_OPTIMIZED|CO_NEWLOCALS, __pyx_empty_bytes, __pyx_empty_tuple, __pyx_empty_tuple, __pyx_tuple__37, __pyx_empty_tuple, __pyx_empty_tuple, __pyx_kp_s_stringsource, __pyx_n_s_pyx_unpickle_TopLevelThreadTra, 1, __pyx_empty_bytes); if (unlikely(!__pyx_codeobj__38)) __PYX_ERR(2, 1, __pyx_L1_error)
  1035. | ^~~~~~~~~~~~~~~~~~~~~~~~~~~~~~~~~~~~~~~~
  1036. | |
  1037. | PyObject * {aka struct _object *}
  1038. _pydevd_bundle/pydevd_cython.c:331:69: note: in definition of macro ‘__Pyx_PyCode_New’
  1039. 331 | PyCode_New(a, 0, k, l, s, f, code, c, n, v, fv, cell, fn, name, fline, lnos)
  1040. | ^~~~
  1041. In file included from /usr/include/python3.8/compile.h:5,
  1042. from /usr/include/python3.8/Python.h:138,
  1043. from _pydevd_bundle/pydevd_cython.c:17:
  1044. /usr/include/python3.8/code.h:122:28: note: expected ‘int’ but argument is of type ‘PyObject *’ {aka ‘struct _object *’}
  1045. 122 | PyAPI_FUNC(PyCodeObject *) PyCode_New(
  1046. | ^~~~~~~~~~
  1047. _pydevd_bundle/pydevd_cython.c:32466:269: warning: passing argument 15 of ‘PyCode_New’ makes pointer from integer without a cast [-Wint-conversion]
  1048. 32466 | __pyx_codeobj__38 = (PyObject*)__Pyx_PyCode_New(3, 0, 5, 0, CO_OPTIMIZED|CO_NEWLOCALS, __pyx_empty_bytes, __pyx_empty_tuple, __pyx_empty_tuple, __pyx_tuple__37, __pyx_empty_tuple, __pyx_empty_tuple, __pyx_kp_s_stringsource, __pyx_n_s_pyx_unpickle_TopLevelThreadTra, 1, __pyx_empty_bytes); if (unlikely(!__pyx_codeobj__38)) __PYX_ERR(2, 1, __pyx_L1_error)
  1049. | ^
  1050. | |
  1051. | int
  1052. _pydevd_bundle/pydevd_cython.c:331:75: note: in definition of macro ‘__Pyx_PyCode_New’
  1053. 331 | PyCode_New(a, 0, k, l, s, f, code, c, n, v, fv, cell, fn, name, fline, lnos)
  1054. | ^~~~~
  1055. In file included from /usr/include/python3.8/compile.h:5,
  1056. from /usr/include/python3.8/Python.h:138,
  1057. from _pydevd_bundle/pydevd_cython.c:17:
  1058. /usr/include/python3.8/code.h:122:28: note: expected ‘PyObject *’ {aka ‘struct _object *’} but argument is of type ‘int’
  1059. 122 | PyAPI_FUNC(PyCodeObject *) PyCode_New(
  1060. | ^~~~~~~~~~
  1061. _pydevd_bundle/pydevd_cython.c:331:11: error: too many arguments to function ‘PyCode_New’
  1062. 331 | PyCode_New(a, 0, k, l, s, f, code, c, n, v, fv, cell, fn, name, fline, lnos)
  1063. | ^~~~~~~~~~
  1064. _pydevd_bundle/pydevd_cython.c:32466:34: note: in expansion of macro ‘__Pyx_PyCode_New’
  1065. 32466 | __pyx_codeobj__38 = (PyObject*)__Pyx_PyCode_New(3, 0, 5, 0, CO_OPTIMIZED|CO_NEWLOCALS, __pyx_empty_bytes, __pyx_empty_tuple, __pyx_empty_tuple, __pyx_tuple__37, __pyx_empty_tuple, __pyx_empty_tuple, __pyx_kp_s_stringsource, __pyx_n_s_pyx_unpickle_TopLevelThreadTra, 1, __pyx_empty_bytes); if (unlikely(!__pyx_codeobj__38)) __PYX_ERR(2, 1, __pyx_L1_error)
  1066. | ^~~~~~~~~~~~~~~~
  1067. In file included from /usr/include/python3.8/compile.h:5,
  1068. from /usr/include/python3.8/Python.h:138,
  1069. from _pydevd_bundle/pydevd_cython.c:17:
  1070. /usr/include/python3.8/code.h:122:28: note: declared here
  1071. 122 | PyAPI_FUNC(PyCodeObject *) PyCode_New(
  1072. | ^~~~~~~~~~
  1073. /usr/include/python3.8/code.h:72:25: warning: passing argument 6 of ‘PyCode_New’ makes pointer from integer without a cast [-Wint-conversion]
  1074. 72 | #define CO_OPTIMIZED 0x0001
  1075. | ^
  1076. | |
  1077. | int
  1078. _pydevd_bundle/pydevd_cython.c:331:37: note: in definition of macro ‘__Pyx_PyCode_New’
  1079. 331 | PyCode_New(a, 0, k, l, s, f, code, c, n, v, fv, cell, fn, name, fline, lnos)
  1080. | ^
  1081. _pydevd_bundle/pydevd_cython.c:32470:63: note: in expansion of macro ‘CO_OPTIMIZED’
  1082. 32470 | __pyx_codeobj__40 = (PyObject*)__Pyx_PyCode_New(3, 0, 5, 0, CO_OPTIMIZED|CO_NEWLOCALS, __pyx_empty_bytes, __pyx_empty_tuple, __pyx_empty_tuple, __pyx_tuple__39, __pyx_empty_tuple, __pyx_empty_tuple, __pyx_kp_s_stringsource, __pyx_n_s_pyx_unpickle_TopLevelThreadTra_2, 1, __pyx_empty_bytes); if (unlikely(!__pyx_codeobj__40)) __PYX_ERR(2, 1, __pyx_L1_error)
  1083. | ^~~~~~~~~~~~
  1084. In file included from /usr/include/python3.8/compile.h:5,
  1085. from /usr/include/python3.8/Python.h:138,
  1086. from _pydevd_bundle/pydevd_cython.c:17:
  1087. /usr/include/python3.8/code.h:122:28: note: expected ‘PyObject *’ {aka ‘struct _object *’} but argument is of type ‘int’
  1088. 122 | PyAPI_FUNC(PyCodeObject *) PyCode_New(
  1089. | ^~~~~~~~~~
  1090. _pydevd_bundle/pydevd_cython.c:32470:227: warning: passing argument 14 of ‘PyCode_New’ makes integer from pointer without a cast [-Wint-conversion]
  1091. 32470 | __pyx_codeobj__40 = (PyObject*)__Pyx_PyCode_New(3, 0, 5, 0, CO_OPTIMIZED|CO_NEWLOCALS, __pyx_empty_bytes, __pyx_empty_tuple, __pyx_empty_tuple, __pyx_tuple__39, __pyx_empty_tuple, __pyx_empty_tuple, __pyx_kp_s_stringsource, __pyx_n_s_pyx_unpickle_TopLevelThreadTra_2, 1, __pyx_empty_bytes); if (unlikely(!__pyx_codeobj__40)) __PYX_ERR(2, 1, __pyx_L1_error)
  1092. | ^~~~~~~~~~~~~~~~~~~~~~~~~~~~~~~~~~~~~~~~~~
  1093. | |
  1094. | PyObject * {aka struct _object *}
  1095. _pydevd_bundle/pydevd_cython.c:331:69: note: in definition of macro ‘__Pyx_PyCode_New’
  1096. 331 | PyCode_New(a, 0, k, l, s, f, code, c, n, v, fv, cell, fn, name, fline, lnos)
  1097. | ^~~~
  1098. In file included from /usr/include/python3.8/compile.h:5,
  1099. from /usr/include/python3.8/Python.h:138,
  1100. from _pydevd_bundle/pydevd_cython.c:17:
  1101. /usr/include/python3.8/code.h:122:28: note: expected ‘int’ but argument is of type ‘PyObject *’ {aka ‘struct _object *’}
  1102. 122 | PyAPI_FUNC(PyCodeObject *) PyCode_New(
  1103. | ^~~~~~~~~~
  1104. _pydevd_bundle/pydevd_cython.c:32470:271: warning: passing argument 15 of ‘PyCode_New’ makes pointer from integer without a cast [-Wint-conversion]
  1105. 32470 | __pyx_codeobj__40 = (PyObject*)__Pyx_PyCode_New(3, 0, 5, 0, CO_OPTIMIZED|CO_NEWLOCALS, __pyx_empty_bytes, __pyx_empty_tuple, __pyx_empty_tuple, __pyx_tuple__39, __pyx_empty_tuple, __pyx_empty_tuple, __pyx_kp_s_stringsource, __pyx_n_s_pyx_unpickle_TopLevelThreadTra_2, 1, __pyx_empty_bytes); if (unlikely(!__pyx_codeobj__40)) __PYX_ERR(2, 1, __pyx_L1_error)
  1106. | ^
  1107. | |
  1108. | int
  1109. _pydevd_bundle/pydevd_cython.c:331:75: note: in definition of macro ‘__Pyx_PyCode_New’
  1110. 331 | PyCode_New(a, 0, k, l, s, f, code, c, n, v, fv, cell, fn, name, fline, lnos)
  1111. | ^~~~~
  1112. In file included from /usr/include/python3.8/compile.h:5,
  1113. from /usr/include/python3.8/Python.h:138,
  1114. from _pydevd_bundle/pydevd_cython.c:17:
  1115. /usr/include/python3.8/code.h:122:28: note: expected ‘PyObject *’ {aka ‘struct _object *’} but argument is of type ‘int’
  1116. 122 | PyAPI_FUNC(PyCodeObject *) PyCode_New(
  1117. | ^~~~~~~~~~
  1118. _pydevd_bundle/pydevd_cython.c:331:11: error: too many arguments to function ‘PyCode_New’
  1119. 331 | PyCode_New(a, 0, k, l, s, f, code, c, n, v, fv, cell, fn, name, fline, lnos)
  1120. | ^~~~~~~~~~
  1121. _pydevd_bundle/pydevd_cython.c:32470:34: note: in expansion of macro ‘__Pyx_PyCode_New’
  1122. 32470 | __pyx_codeobj__40 = (PyObject*)__Pyx_PyCode_New(3, 0, 5, 0, CO_OPTIMIZED|CO_NEWLOCALS, __pyx_empty_bytes, __pyx_empty_tuple, __pyx_empty_tuple, __pyx_tuple__39, __pyx_empty_tuple, __pyx_empty_tuple, __pyx_kp_s_stringsource, __pyx_n_s_pyx_unpickle_TopLevelThreadTra_2, 1, __pyx_empty_bytes); if (unlikely(!__pyx_codeobj__40)) __PYX_ERR(2, 1, __pyx_L1_error)
  1123. | ^~~~~~~~~~~~~~~~
  1124. In file included from /usr/include/python3.8/compile.h:5,
  1125. from /usr/include/python3.8/Python.h:138,
  1126. from _pydevd_bundle/pydevd_cython.c:17:
  1127. /usr/include/python3.8/code.h:122:28: note: declared here
  1128. 122 | PyAPI_FUNC(PyCodeObject *) PyCode_New(
  1129. | ^~~~~~~~~~
  1130. /usr/include/python3.8/code.h:72:25: warning: passing argument 6 of ‘PyCode_New’ makes pointer from integer without a cast [-Wint-conversion]
  1131. 72 | #define CO_OPTIMIZED 0x0001
  1132. | ^
  1133. | |
  1134. | int
  1135. _pydevd_bundle/pydevd_cython.c:331:37: note: in definition of macro ‘__Pyx_PyCode_New’
  1136. 331 | PyCode_New(a, 0, k, l, s, f, code, c, n, v, fv, cell, fn, name, fline, lnos)
  1137. | ^
  1138. _pydevd_bundle/pydevd_cython.c:32474:63: note: in expansion of macro ‘CO_OPTIMIZED’
  1139. 32474 | __pyx_codeobj__42 = (PyObject*)__Pyx_PyCode_New(3, 0, 5, 0, CO_OPTIMIZED|CO_NEWLOCALS, __pyx_empty_bytes, __pyx_empty_tuple, __pyx_empty_tuple, __pyx_tuple__41, __pyx_empty_tuple, __pyx_empty_tuple, __pyx_kp_s_stringsource, __pyx_n_s_pyx_unpickle_ThreadTracer, 1, __pyx_empty_bytes); if (unlikely(!__pyx_codeobj__42)) __PYX_ERR(2, 1, __pyx_L1_error)
  1140. | ^~~~~~~~~~~~
  1141. In file included from /usr/include/python3.8/compile.h:5,
  1142. from /usr/include/python3.8/Python.h:138,
  1143. from _pydevd_bundle/pydevd_cython.c:17:
  1144. /usr/include/python3.8/code.h:122:28: note: expected ‘PyObject *’ {aka ‘struct _object *’} but argument is of type ‘int’
  1145. 122 | PyAPI_FUNC(PyCodeObject *) PyCode_New(
  1146. | ^~~~~~~~~~
  1147. _pydevd_bundle/pydevd_cython.c:32474:227: warning: passing argument 14 of ‘PyCode_New’ makes integer from pointer without a cast [-Wint-conversion]
  1148. 32474 | __pyx_codeobj__42 = (PyObject*)__Pyx_PyCode_New(3, 0, 5, 0, CO_OPTIMIZED|CO_NEWLOCALS, __pyx_empty_bytes, __pyx_empty_tuple, __pyx_empty_tuple, __pyx_tuple__41, __pyx_empty_tuple, __pyx_empty_tuple, __pyx_kp_s_stringsource, __pyx_n_s_pyx_unpickle_ThreadTracer, 1, __pyx_empty_bytes); if (unlikely(!__pyx_codeobj__42)) __PYX_ERR(2, 1, __pyx_L1_error)
  1149. | ^~~~~~~~~~~~~~~~~~~~~~~~~~~~~~~~~~~
  1150. | |
  1151. | PyObject * {aka struct _object *}
  1152. _pydevd_bundle/pydevd_cython.c:331:69: note: in definition of macro ‘__Pyx_PyCode_New’
  1153. 331 | PyCode_New(a, 0, k, l, s, f, code, c, n, v, fv, cell, fn, name, fline, lnos)
  1154. | ^~~~
  1155. In file included from /usr/include/python3.8/compile.h:5,
  1156. from /usr/include/python3.8/Python.h:138,
  1157. from _pydevd_bundle/pydevd_cython.c:17:
  1158. /usr/include/python3.8/code.h:122:28: note: expected ‘int’ but argument is of type ‘PyObject *’ {aka ‘struct _object *’}
  1159. 122 | PyAPI_FUNC(PyCodeObject *) PyCode_New(
  1160. | ^~~~~~~~~~
  1161. _pydevd_bundle/pydevd_cython.c:32474:264: warning: passing argument 15 of ‘PyCode_New’ makes pointer from integer without a cast [-Wint-conversion]
  1162. 32474 | __pyx_codeobj__42 = (PyObject*)__Pyx_PyCode_New(3, 0, 5, 0, CO_OPTIMIZED|CO_NEWLOCALS, __pyx_empty_bytes, __pyx_empty_tuple, __pyx_empty_tuple, __pyx_tuple__41, __pyx_empty_tuple, __pyx_empty_tuple, __pyx_kp_s_stringsource, __pyx_n_s_pyx_unpickle_ThreadTracer, 1, __pyx_empty_bytes); if (unlikely(!__pyx_codeobj__42)) __PYX_ERR(2, 1, __pyx_L1_error)
  1163. | ^
  1164. | |
  1165. | int
  1166. _pydevd_bundle/pydevd_cython.c:331:75: note: in definition of macro ‘__Pyx_PyCode_New’
  1167. 331 | PyCode_New(a, 0, k, l, s, f, code, c, n, v, fv, cell, fn, name, fline, lnos)
  1168. | ^~~~~
  1169. In file included from /usr/include/python3.8/compile.h:5,
  1170. from /usr/include/python3.8/Python.h:138,
  1171. from _pydevd_bundle/pydevd_cython.c:17:
  1172. /usr/include/python3.8/code.h:122:28: note: expected ‘PyObject *’ {aka ‘struct _object *’} but argument is of type ‘int’
  1173. 122 | PyAPI_FUNC(PyCodeObject *) PyCode_New(
  1174. | ^~~~~~~~~~
  1175. _pydevd_bundle/pydevd_cython.c:331:11: error: too many arguments to function ‘PyCode_New’
  1176. 331 | PyCode_New(a, 0, k, l, s, f, code, c, n, v, fv, cell, fn, name, fline, lnos)
  1177. | ^~~~~~~~~~
  1178. _pydevd_bundle/pydevd_cython.c:32474:34: note: in expansion of macro ‘__Pyx_PyCode_New’
  1179. 32474 | __pyx_codeobj__42 = (PyObject*)__Pyx_PyCode_New(3, 0, 5, 0, CO_OPTIMIZED|CO_NEWLOCALS, __pyx_empty_bytes, __pyx_empty_tuple, __pyx_empty_tuple, __pyx_tuple__41, __pyx_empty_tuple, __pyx_empty_tuple, __pyx_kp_s_stringsource, __pyx_n_s_pyx_unpickle_ThreadTracer, 1, __pyx_empty_bytes); if (unlikely(!__pyx_codeobj__42)) __PYX_ERR(2, 1, __pyx_L1_error)
  1180. | ^~~~~~~~~~~~~~~~
  1181. In file included from /usr/include/python3.8/compile.h:5,
  1182. from /usr/include/python3.8/Python.h:138,
  1183. from _pydevd_bundle/pydevd_cython.c:17:
  1184. /usr/include/python3.8/code.h:122:28: note: declared here
  1185. 122 | PyAPI_FUNC(PyCodeObject *) PyCode_New(
  1186. | ^~~~~~~~~~
  1187. _pydevd_bundle/pydevd_cython.c: In function ‘__Pyx_CreateCodeObjectForTraceback’:
  1188. _pydevd_bundle/pydevd_cython.c:37931:9: warning: passing argument 14 of ‘PyCode_New’ makes integer from pointer without a cast [-Wint-conversion]
  1189. 37931 | py_funcname, /*PyObject *name,*/
  1190. | ^~~~~~~~~~~
  1191. | |
  1192. | PyObject * {aka struct _object *}
  1193. _pydevd_bundle/pydevd_cython.c:331:69: note: in definition of macro ‘__Pyx_PyCode_New’
  1194. 331 | PyCode_New(a, 0, k, l, s, f, code, c, n, v, fv, cell, fn, name, fline, lnos)
  1195. | ^~~~
  1196. In file included from /usr/include/python3.8/compile.h:5,
  1197. from /usr/include/python3.8/Python.h:138,
  1198. from _pydevd_bundle/pydevd_cython.c:17:
  1199. /usr/include/python3.8/code.h:122:28: note: expected ‘int’ but argument is of type ‘PyObject *’ {aka ‘struct _object *’}
  1200. 122 | PyAPI_FUNC(PyCodeObject *) PyCode_New(
  1201. | ^~~~~~~~~~
  1202. _pydevd_bundle/pydevd_cython.c:37932:9: warning: passing argument 15 of ‘PyCode_New’ makes pointer from integer without a cast [-Wint-conversion]
  1203. 37932 | py_line,
  1204. | ^~~~~~~
  1205. | |
  1206. | int
  1207. _pydevd_bundle/pydevd_cython.c:331:75: note: in definition of macro ‘__Pyx_PyCode_New’
  1208. 331 | PyCode_New(a, 0, k, l, s, f, code, c, n, v, fv, cell, fn, name, fline, lnos)
  1209. | ^~~~~
  1210. In file included from /usr/include/python3.8/compile.h:5,
  1211. from /usr/include/python3.8/Python.h:138,
  1212. from _pydevd_bundle/pydevd_cython.c:17:
  1213. /usr/include/python3.8/code.h:122:28: note: expected ‘PyObject *’ {aka ‘struct _object *’} but argument is of type ‘int’
  1214. 122 | PyAPI_FUNC(PyCodeObject *) PyCode_New(
  1215. | ^~~~~~~~~~
  1216. _pydevd_bundle/pydevd_cython.c:331:11: error: too many arguments to function ‘PyCode_New’
  1217. 331 | PyCode_New(a, 0, k, l, s, f, code, c, n, v, fv, cell, fn, name, fline, lnos)
  1218. | ^~~~~~~~~~
  1219. _pydevd_bundle/pydevd_cython.c:37918:15: note: in expansion of macro ‘__Pyx_PyCode_New’
  1220. 37918 | py_code = __Pyx_PyCode_New(
  1221. | ^~~~~~~~~~~~~~~~
  1222. In file included from /usr/include/python3.8/compile.h:5,
  1223. from /usr/include/python3.8/Python.h:138,
  1224. from _pydevd_bundle/pydevd_cython.c:17:
  1225. /usr/include/python3.8/code.h:122:28: note: declared here
  1226. 122 | PyAPI_FUNC(PyCodeObject *) PyCode_New(
  1227. | ^~~~~~~~~~
  1228. error: command 'gcc' failed with exit status 1
  1229. ==> ERROR:(B A failure occurred in build().(B
  1230.  Aborting...(B
  1231. ==> ERROR: Build failed, check /var/lib/archbuild/extra-x86_64/dbd/build
RAW Paste Data

Adblocker detected! Please consider disabling it...

We've detected AdBlock Plus or some other adblocking software preventing Pastebin.com from fully loading.

We don't have any obnoxious sound, or popup ads, we actively block these annoying types of ads!

Please add Pastebin.com to your ad blocker whitelist or disable your adblocking software.

×