SHARE
TWEET

Erorr

a guest Jun 19th, 2019 87 Never
Not a member of Pastebin yet? Sign Up, it unlocks many cool features!
  1. iPhone-tit-Callis-:~ mobile$ su
  2. Password:
  3. iPhone-tit-Callis-:/var/mobile root# cd passpha
  4. iPhone-tit-Callis-:/var/mobile/passpha root# make pckage
  5. bash: xcode-select: command not found
  6. make: *** No rule to make target 'pckage'.  Stop.
  7. iPhone-tit-Callis-:/var/mobile/passpha root# make package
  8. bash: xcode-select: command not found
  9. bash: xcode-select: command not found
  10. > Making all for tweak passpha…
  11. bash: xcode-select: command not found
  12. bash: md5: command not found
  13. bash: md5: command not found
  14. bash: xcode-select: command not found
  15. bash: xcode-select: command not found
  16. bash: xcode-select: command not found
  17. bash: xcode-select: command not found
  18. bash: md5: command not found
  19. bash: md5: command not found
  20. bash: xcode-select: command not found
  21. bash: xcode-select: command not found
  22. bash: md5: command not found
  23. bash: md5: command not found
  24. bash: xcode-select: command not found
  25. ==> Preprocessing Tweak.xm…
  26. bash: xcode-select: command not found
  27. ==> Compiling Tweak.xm (arm64)…
  28. Tweak.xm:3:235: error: expected unqualified-id
  29. static void _logos_method$_ungrouped$SBDashBoardPasscodeBackgroundView$_setPlusDBackgroundColorWithWeighting$(_LOGOS_SELF_TYPE_NORMAL SBDashBoardPasscodeBackgroundView* _LOGOS_SELF_CONST __unused self, SEL __unused _cmd, double arg1);{
  30.                                                                                                                                                                                                                                           ^
  31. 1 error generated.
  32. make[3]: *** [/var/theos/makefiles/instance/rules.mk:269: /var/mobile/passpha/.theos/obj/debug/arm64/Tweak.xm..o] Error 1
  33. make[2]: *** [/var/theos/makefiles/instance/library.mk:33: /var/mobile/passpha/.theos/obj/debug/arm64/passpha.dylib] Error 2
  34. make[1]: *** [/var/theos/makefiles/instance/library.mk:24: internal-library-all_] Error 2
  35. make: *** [/var/theos/makefiles/master/rules.mk:112: passpha.all.tweak.variables] Error 2
  36. iPhone-tit-Callis-:/var/mobile/passpha root#
RAW Paste Data
We use cookies for various purposes including analytics. By continuing to use Pastebin, you agree to our use of cookies as described in the Cookies Policy. OK, I Understand
 
Top