Guest User

Untitled

a guest
Sep 29th, 2021
27
Never
Not a member of Pastebin yet? Sign Up, it unlocks many cool features!
  1. make[3]: Entering directory '/<<PKGBUILDDIR>>/.build'
  2. cd /<<PKGBUILDDIR>>/.build && /usr/bin/cmake -E cmake_depends "Unix Makefiles" /<<PKGBUILDDIR>> /<<PKGBUILDDIR>>/gnucash/gschemas /<<PKGBUILDDIR>>/.build /<<PKGBUILDDIR>>/.build/gnucash/gschemas /<<PKGBUILDDIR>>/.build/gnucash/gschemas/CMakeFiles/org.gnucash.GnuCash.dialogs.import.csv.gschema.valid-target.dir/DependInfo.cmake --color=
  3. cd /<<PKGBUILDDIR>>/.build/gnucash/gschemas && /usr/bin/cmake -E touch /<<PKGBUILDDIR>>/.build/gnucash/gschemas/org.gnucash.GnuCash.dialogs.reconcile.gschema.valid
  4. make[3]: Leaving directory '/<<PKGBUILDDIR>>/.build'
  5. Scanning dependencies of target org.gnucash.GnuCash.dialogs.import.csv.gschema.valid-target
  6. make[3]: Leaving directory '/<<PKGBUILDDIR>>/.build'
  7. make -f gnucash/gschemas/CMakeFiles/org.gnucash.GnuCash.dialogs.import.csv.gschema.valid-target.dir/build.make gnucash/gschemas/CMakeFiles/org.gnucash.GnuCash.dialogs.import.csv.gschema.valid-target.dir/build
  8. [ 23%] Built target org.gnucash.GnuCash.dialogs.sxs.gschema.valid-target
  9. make[3]: Leaving directory '/<<PKGBUILDDIR>>/.build'
  10. make -f gnucash/gschemas/CMakeFiles/migratable-prefs.dir/build.make gnucash/gschemas/CMakeFiles/migratable-prefs.dir/depend
  11. make[3]: Entering directory '/<<PKGBUILDDIR>>/.build'
  12. make[3]: Entering directory '/<<PKGBUILDDIR>>/.build'
  13. cd /<<PKGBUILDDIR>>/.build && /usr/bin/cmake -E cmake_depends "Unix Makefiles" /<<PKGBUILDDIR>> /<<PKGBUILDDIR>>/gnucash/gschemas /<<PKGBUILDDIR>>/.build /<<PKGBUILDDIR>>/.build/gnucash/gschemas /<<PKGBUILDDIR>>/.build/gnucash/gschemas/CMakeFiles/migratable-prefs.dir/DependInfo.cmake --color=
  14. [ 23%] Generating org.gnucash.GnuCash.dialogs.import.csv.gschema.valid
  15. [ 23%] Built target org.gnucash.GnuCash.dialogs.reconcile.gschema.valid-target
  16. cd /<<PKGBUILDDIR>>/.build/gnucash/gschemas && /usr/bin/cmake -E env /usr/bin/glib-compile-schemas --strict --dry-run --schema-file=/<<PKGBUILDDIR>>/.build/share/glib-2.0/schemas/org.gnucash.GnuCash.dialogs.import.csv.gschema.xml
  17. Scanning dependencies of target migratable-prefs
  18. make -f bindings/guile/test/CMakeFiles/scm-deprecated-gnucash-deprecated-module.dir/build.make bindings/guile/test/CMakeFiles/scm-deprecated-gnucash-deprecated-module.dir/depend
  19. make[3]: Leaving directory '/<<PKGBUILDDIR>>/.build'
  20. make -f gnucash/gschemas/CMakeFiles/migratable-prefs.dir/build.make gnucash/gschemas/CMakeFiles/migratable-prefs.dir/build
  21. make[3]: Entering directory '/<<PKGBUILDDIR>>/.build'
  22. cd /<<PKGBUILDDIR>>/.build && /usr/bin/cmake -E cmake_depends "Unix Makefiles" /<<PKGBUILDDIR>> /<<PKGBUILDDIR>>/bindings/guile/test /<<PKGBUILDDIR>>/.build /<<PKGBUILDDIR>>/.build/bindings/guile/test /<<PKGBUILDDIR>>/.build/bindings/guile/test/CMakeFiles/scm-deprecated-gnucash-deprecated-module.dir/DependInfo.cmake --color=
  23. make[3]: Entering directory '/<<PKGBUILDDIR>>/.build'
  24. [ 23%] Generating ../../share/gnucash/migratable-prefs.xml
  25. cd /<<PKGBUILDDIR>>/.build/gnucash/gschemas && /usr/bin/cmake -E touch /<<PKGBUILDDIR>>/.build/gnucash/gschemas/org.gnucash.GnuCash.dialogs.import.csv.gschema.valid
  26. cd /<<PKGBUILDDIR>>/.build/gnucash/gschemas && /usr/bin/cmake -E cat /<<PKGBUILDDIR>>/gnucash/import-export/aqb/gschemas/migratable-prefs.xml /<<PKGBUILDDIR>>/gnucash/import-export/ofx/gschemas/migratable-prefs.xml /<<PKGBUILDDIR>>/gnucash/gschemas/migratable-prefs.xml > /<<PKGBUILDDIR>>/.build/share/gnucash/migratable-prefs.xml
  27. Scanning dependencies of target scm-deprecated-gnucash-deprecated-module
  28. make[3]: Leaving directory '/<<PKGBUILDDIR>>/.build'
  29. make -f bindings/guile/test/CMakeFiles/scm-deprecated-gnucash-deprecated-module.dir/build.make bindings/guile/test/CMakeFiles/scm-deprecated-gnucash-deprecated-module.dir/build
  30. make[3]: Entering directory '/<<PKGBUILDDIR>>/.build'
  31. CMake Error: cmake version 3.16.3
  32. Usage: /usr/bin/cmake -E <command> [arguments...]
  33. Available commands:
  34. capabilities - Report capabilities built into cmake in JSON format
  35. chdir dir cmd [args...] - run command in a given directory
  36. compare_files [--ignore-eol] file1 file2
  37. - check if file1 is same as file2
  38. copy <file>... destination - copy files to destination (either file or directory)
  39. copy_directory <dir>... destination - copy content of <dir>... directories to 'destination' directory
  40. copy_if_different <file>... destination - copy files if it has changed
  41. echo [<string>...] - displays arguments as text
  42. echo_append [<string>...] - displays arguments as text but no new line
  43. env [--unset=NAME]... [NAME=VALUE]... COMMAND [ARG]...
  44. - run command in a modified environment
  45. environment - display the current environment
  46. make_directory <dir>... - create parent and <dir> directories
  47. md5sum <file>... - create MD5 checksum of files
  48. sha1sum <file>... - create SHA1 checksum of files
  49. sha224sum <file>... - create SHA224 checksum of files
  50. sha256sum <file>... - create SHA256 checksum of files
  51. sha384sum <file>... - create SHA384 checksum of files
  52. sha512sum <file>... - create SHA512 checksum of files
  53. remove [-f] <file>... - remove the file(s), use -f to force it
  54. remove_directory <dir>... - remove directories and their contents
  55. rename oldname newname - rename a file or directory (on one volume)
  56. server - start cmake in server mode
  57. sleep <number>... - sleep for given number of seconds
  58. tar [cxt][vf][zjJ] file.tar [file/dir1 file/dir2 ...]
  59. - create or extract a tar or zip archive
  60. time command [args...] - run command and display elapsed time
  61. touch <file>... - touch a <file>.
  62. touch_nocreate <file>... - touch a <file> but do not create it.
  63. create_symlink old new - create a symbolic link new -> old
  64. true - do nothing with an exit code of 0
  65. false - do nothing with an exit code of 1
  66. make[3]: Leaving directory '/<<PKGBUILDDIR>>/.build'
  67.  
  68. make[3]: *** [gnucash/gschemas/CMakeFiles/migratable-prefs.dir/build.make:66: share/gnucash/migratable-prefs.xml] Error 1
  69. make[3]: *** Deleting file 'share/gnucash/migratable-prefs.xml'
  70. make[3]: Leaving directory '/<<PKGBUILDDIR>>/.build'
  71. make[2]: *** [CMakeFiles/Makefile2:12471: gnucash/gschemas/CMakeFiles/migratable-prefs.dir/all] Error 2
  72. make[2]: *** Waiting for unfinished jobs....
  73. [ 23%] Generating ../../../lib/x86_64-linux-gnu/guile/3.0/site-ccache/gnucash/deprecated/gnucash/deprecated-module.go
  74. cd /<<PKGBUILDDIR>>/.build/bindings/guile/test && /usr/bin/cmake -E env LD_LIBRARY_PATH=/<<PKGBUILDDIR>>/.build/lib/x86_64-linux-gnu:/<<PKGBUILDDIR>>/.build/lib/x86_64-linux-gnu/gnucash: GNC_UNINSTALLED=YES GNC_BUILDDIR=/<<PKGBUILDDIR>>/.build GUILE_LOAD_PATH=/<<PKGBUILDDIR>>/bindings/guile/test:/<<PKGBUILDDIR>>/.build/bindings/guile/test:/<<PKGBUILDDIR>>/.build/bindings/guile/test/deprecated:/<<PKGBUILDDIR>>/.build/share/guile/site/3.0 GUILE_LOAD_COMPILED_PATH=/<<PKGBUILDDIR>>/.build/bindings/guile/test:/<<PKGBUILDDIR>>/.build/lib/x86_64-linux-gnu/guile/3.0/site-ccache:/<<PKGBUILDDIR>>/.build/lib/x86_64-linux-gnu/guile/3.0/site-ccache/gnucash/deprecated GNC_MODULE_PATH=/<<PKGBUILDDIR>>/.build/lib/x86_64-linux-gnu:/<<PKGBUILDDIR>>/.build/lib/x86_64-linux-gnu/gnucash: /usr/bin/guile -e "(@@ (guild) main)" -s /usr/bin/guild compile -o /<<PKGBUILDDIR>>/.build/lib/x86_64-linux-gnu/guile/3.0/site-ccache/gnucash/deprecated/gnucash/deprecated-module.go /<<PKGBUILDDIR>>/.build/bindings/guile/test/deprecated/deprecated-module.scm
  75. [ 23%] Built target org.gnucash.GnuCash.dialogs.import.csv.gschema.valid-target
  76. wrote `/<<PKGBUILDDIR>>/.build/lib/x86_64-linux-gnu/guile/3.0/site-ccache/gnucash/deprecated/gnucash/deprecated-module.go'
  77. make[3]: Leaving directory '/<<PKGBUILDDIR>>/.build'
  78. [ 23%] Built target scm-deprecated-gnucash-deprecated-module
  79. [ 23%] Linking CXX static library libgmock.a
  80. cd /<<PKGBUILDDIR>>/.build/common/test-core && /usr/bin/cmake -P CMakeFiles/gmock.dir/cmake_clean_target.cmake
  81. cd /<<PKGBUILDDIR>>/.build/common/test-core && /usr/bin/cmake -E cmake_link_script CMakeFiles/gmock.dir/link.txt --verbose=1
  82. /usr/bin/ar qc libgmock.a CMakeFiles/gmock.dir/usr/src/googletest/googlemock/src/gmock-all.cc.o
  83. /usr/bin/ranlib libgmock.a
  84. make[3]: Leaving directory '/<<PKGBUILDDIR>>/.build'
  85. [ 23%] Built target gmock
  86. [ 23%] Generating gnucash.desktop
  87. cd /<<PKGBUILDDIR>>/.build/gnucash/gnome && /usr/bin/cmake -D SRC=/<<PKGBUILDDIR>>/.build/gnucash/gnome/gnucash.desktop.in -D DST=/<<PKGBUILDDIR>>/.build/gnucash/gnome/gnucash.desktop -D VCS_INFO_FILE=/<<PKGBUILDDIR>>/libgnucash/core-utils/gnc-vcs-info.h -D PROJECT_VERSION=4.8 -D SRC_DIR=/<<PKGBUILDDIR>> -P /<<PKGBUILDDIR>>/cmake/configure-gnucash-desktop.cmake
  88. make[3]: Leaving directory '/<<PKGBUILDDIR>>/.build'
  89. [ 23%] Built target gnucash-desktop
  90. [ 23%] Linking CXX static library libgtest.a
  91. cd /<<PKGBUILDDIR>>/.build/common/test-core && /usr/bin/cmake -P CMakeFiles/gtest.dir/cmake_clean_target.cmake
  92. cd /<<PKGBUILDDIR>>/.build/common/test-core && /usr/bin/cmake -E cmake_link_script CMakeFiles/gtest.dir/link.txt --verbose=1
  93. /usr/bin/ar qc libgtest.a CMakeFiles/gtest.dir/usr/src/googletest/googletest/src/gtest_main.cc.o CMakeFiles/gtest.dir/usr/src/googletest/googletest/src/gtest-all.cc.o
  94. /usr/bin/ranlib libgtest.a
  95. make[3]: Leaving directory '/<<PKGBUILDDIR>>/.build'
  96. [ 23%] Built target gtest
  97. make[2]: Leaving directory '/<<PKGBUILDDIR>>/.build'
  98. make[1]: *** [Makefile:166: all] Error 2
  99. make[1]: Leaving directory '/<<PKGBUILDDIR>>/.build'
  100. dh_auto_build: error: cd .build && make -j6 "INSTALL=install --strip-program=true" returned exit code 2
  101. make: *** [debian/rules:22: binary] Error 25
  102. dpkg-buildpackage: error: debian/rules binary subprocess returned exit status 2
RAW Paste Data