Not a member of Pastebin yet?
Sign Up,
it unlocks many cool features!
- Determining if the include file link.h exists failed with the following output:
- Change Dir: C:/Users/WORK/Desktop/git/llvm-obfuscator/build/CMakeFiles/CMakeTmp
- Run Build Command(s):C:/msys64/mingw64/bin/mingw32-make.exe cmTC_f1ca2/fast
- C:/msys64/mingw64/bin/mingw32-make.exe -f CMakeFiles\cmTC_f1ca2.dir\build.make CMakeFiles/cmTC_f1ca2.dir/build
- mingw32-make.exe[1]: Entering directory 'C:/Users/WORK/Desktop/git/llvm-obfuscator/build/CMakeFiles/CMakeTmp'
- Building C object CMakeFiles/cmTC_f1ca2.dir/CheckIncludeFile.c.obj
- C:\msys64\usr\bin\gcc.exe -o CMakeFiles\cmTC_f1ca2.dir\CheckIncludeFile.c.obj -c C:\Users\WORK\Desktop\git\llvm-obfuscator\build\CMakeFiles\CMakeTmp\CheckIncludeFile.c
- C:\Users\WORK\Desktop\git\llvm-obfuscator\build\CMakeFiles\CMakeTmp\CheckIncludeFile.c:1:10: fatal error: link.h: No such file or directory
- #include <link.h>
- ^~~~~~~~
- compilation terminated.
- mingw32-make.exe[1]: *** [CMakeFiles\cmTC_f1ca2.dir\build.make:65: CMakeFiles/cmTC_f1ca2.dir/CheckIncludeFile.c.obj] Error 1
- mingw32-make.exe[1]: Leaving directory 'C:/Users/WORK/Desktop/git/llvm-obfuscator/build/CMakeFiles/CMakeTmp'
- mingw32-make.exe: *** [Makefile:120: cmTC_f1ca2/fast] Error 2
- Determining if the include file malloc/malloc.h exists failed with the following output:
- Change Dir: C:/Users/WORK/Desktop/git/llvm-obfuscator/build/CMakeFiles/CMakeTmp
- Run Build Command(s):C:/msys64/mingw64/bin/mingw32-make.exe cmTC_eaaaf/fast
- C:/msys64/mingw64/bin/mingw32-make.exe -f CMakeFiles\cmTC_eaaaf.dir\build.make CMakeFiles/cmTC_eaaaf.dir/build
- mingw32-make.exe[1]: Entering directory 'C:/Users/WORK/Desktop/git/llvm-obfuscator/build/CMakeFiles/CMakeTmp'
- Building C object CMakeFiles/cmTC_eaaaf.dir/CheckIncludeFile.c.obj
- C:\msys64\usr\bin\gcc.exe -o CMakeFiles\cmTC_eaaaf.dir\CheckIncludeFile.c.obj -c C:\Users\WORK\Desktop\git\llvm-obfuscator\build\CMakeFiles\CMakeTmp\CheckIncludeFile.c
- C:\Users\WORK\Desktop\git\llvm-obfuscator\build\CMakeFiles\CMakeTmp\CheckIncludeFile.c:1:10: fatal error: malloc/malloc.h: No such file or directory
- #include <malloc/malloc.h>
- ^~~~~~~~~~~~~~~~~
- compilation terminated.
- mingw32-make.exe[1]: *** [CMakeFiles\cmTC_eaaaf.dir\build.make:65: CMakeFiles/cmTC_eaaaf.dir/CheckIncludeFile.c.obj] Error 1
- mingw32-make.exe[1]: Leaving directory 'C:/Users/WORK/Desktop/git/llvm-obfuscator/build/CMakeFiles/CMakeTmp'
- mingw32-make.exe: *** [Makefile:120: cmTC_eaaaf/fast] Error 2
- Determining if the include file ndir.h exists failed with the following output:
- Change Dir: C:/Users/WORK/Desktop/git/llvm-obfuscator/build/CMakeFiles/CMakeTmp
- Run Build Command(s):C:/msys64/mingw64/bin/mingw32-make.exe cmTC_cf61d/fast
- C:/msys64/mingw64/bin/mingw32-make.exe -f CMakeFiles\cmTC_cf61d.dir\build.make CMakeFiles/cmTC_cf61d.dir/build
- mingw32-make.exe[1]: Entering directory 'C:/Users/WORK/Desktop/git/llvm-obfuscator/build/CMakeFiles/CMakeTmp'
- Building C object CMakeFiles/cmTC_cf61d.dir/CheckIncludeFile.c.obj
- C:\msys64\usr\bin\gcc.exe -o CMakeFiles\cmTC_cf61d.dir\CheckIncludeFile.c.obj -c C:\Users\WORK\Desktop\git\llvm-obfuscator\build\CMakeFiles\CMakeTmp\CheckIncludeFile.c
- C:\Users\WORK\Desktop\git\llvm-obfuscator\build\CMakeFiles\CMakeTmp\CheckIncludeFile.c:1:10: fatal error: ndir.h: No such file or directory
- #include <ndir.h>
- ^~~~~~~~
- compilation terminated.
- mingw32-make.exe[1]: *** [CMakeFiles\cmTC_cf61d.dir\build.make:65: CMakeFiles/cmTC_cf61d.dir/CheckIncludeFile.c.obj] Error 1
- mingw32-make.exe[1]: Leaving directory 'C:/Users/WORK/Desktop/git/llvm-obfuscator/build/CMakeFiles/CMakeTmp'
- mingw32-make.exe: *** [Makefile:120: cmTC_cf61d/fast] Error 2
- Determining if the include file sys/ndir.h exists failed with the following output:
- Change Dir: C:/Users/WORK/Desktop/git/llvm-obfuscator/build/CMakeFiles/CMakeTmp
- Run Build Command(s):C:/msys64/mingw64/bin/mingw32-make.exe cmTC_61d31/fast
- C:/msys64/mingw64/bin/mingw32-make.exe -f CMakeFiles\cmTC_61d31.dir\build.make CMakeFiles/cmTC_61d31.dir/build
- mingw32-make.exe[1]: Entering directory 'C:/Users/WORK/Desktop/git/llvm-obfuscator/build/CMakeFiles/CMakeTmp'
- Building C object CMakeFiles/cmTC_61d31.dir/CheckIncludeFile.c.obj
- C:\msys64\usr\bin\gcc.exe -o CMakeFiles\cmTC_61d31.dir\CheckIncludeFile.c.obj -c C:\Users\WORK\Desktop\git\llvm-obfuscator\build\CMakeFiles\CMakeTmp\CheckIncludeFile.c
- C:\Users\WORK\Desktop\git\llvm-obfuscator\build\CMakeFiles\CMakeTmp\CheckIncludeFile.c:1:10: fatal error: sys/ndir.h: No such file or directory
- #include <sys/ndir.h>
- ^~~~~~~~~~~~
- compilation terminated.
- mingw32-make.exe[1]: *** [CMakeFiles\cmTC_61d31.dir\build.make:65: CMakeFiles/cmTC_61d31.dir/CheckIncludeFile.c.obj] Error 1
- mingw32-make.exe[1]: Leaving directory 'C:/Users/WORK/Desktop/git/llvm-obfuscator/build/CMakeFiles/CMakeTmp'
- mingw32-make.exe: *** [Makefile:120: cmTC_61d31/fast] Error 2
- Determining if the include file valgrind/valgrind.h exists failed with the following output:
- Change Dir: C:/Users/WORK/Desktop/git/llvm-obfuscator/build/CMakeFiles/CMakeTmp
- Run Build Command(s):C:/msys64/mingw64/bin/mingw32-make.exe cmTC_4babc/fast
- C:/msys64/mingw64/bin/mingw32-make.exe -f CMakeFiles\cmTC_4babc.dir\build.make CMakeFiles/cmTC_4babc.dir/build
- mingw32-make.exe[1]: Entering directory 'C:/Users/WORK/Desktop/git/llvm-obfuscator/build/CMakeFiles/CMakeTmp'
- Building C object CMakeFiles/cmTC_4babc.dir/CheckIncludeFile.c.obj
- C:\msys64\usr\bin\gcc.exe -o CMakeFiles\cmTC_4babc.dir\CheckIncludeFile.c.obj -c C:\Users\WORK\Desktop\git\llvm-obfuscator\build\CMakeFiles\CMakeTmp\CheckIncludeFile.c
- C:\Users\WORK\Desktop\git\llvm-obfuscator\build\CMakeFiles\CMakeTmp\CheckIncludeFile.c:1:10: fatal error: valgrind/valgrind.h: No such file or directory
- #include <valgrind/valgrind.h>
- ^~~~~~~~~~~~~~~~~~~~~
- compilation terminated.
- mingw32-make.exe[1]: *** [CMakeFiles\cmTC_4babc.dir\build.make:65: CMakeFiles/cmTC_4babc.dir/CheckIncludeFile.c.obj] Error 1
- mingw32-make.exe[1]: Leaving directory 'C:/Users/WORK/Desktop/git/llvm-obfuscator/build/CMakeFiles/CMakeTmp'
- mingw32-make.exe: *** [Makefile:120: cmTC_4babc/fast] Error 2
- Determining if the include file mach/mach.h exists failed with the following output:
- Change Dir: C:/Users/WORK/Desktop/git/llvm-obfuscator/build/CMakeFiles/CMakeTmp
- Run Build Command(s):C:/msys64/mingw64/bin/mingw32-make.exe cmTC_45ffa/fast
- C:/msys64/mingw64/bin/mingw32-make.exe -f CMakeFiles\cmTC_45ffa.dir\build.make CMakeFiles/cmTC_45ffa.dir/build
- mingw32-make.exe[1]: Entering directory 'C:/Users/WORK/Desktop/git/llvm-obfuscator/build/CMakeFiles/CMakeTmp'
- Building C object CMakeFiles/cmTC_45ffa.dir/CheckIncludeFile.c.obj
- C:\msys64\usr\bin\gcc.exe -o CMakeFiles\cmTC_45ffa.dir\CheckIncludeFile.c.obj -c C:\Users\WORK\Desktop\git\llvm-obfuscator\build\CMakeFiles\CMakeTmp\CheckIncludeFile.c
- C:\Users\WORK\Desktop\git\llvm-obfuscator\build\CMakeFiles\CMakeTmp\CheckIncludeFile.c:1:10: fatal error: mach/mach.h: No such file or directory
- #include <mach/mach.h>
- ^~~~~~~~~~~~~
- compilation terminated.
- mingw32-make.exe[1]: *** [CMakeFiles\cmTC_45ffa.dir\build.make:65: CMakeFiles/cmTC_45ffa.dir/CheckIncludeFile.c.obj] Error 1
- mingw32-make.exe[1]: Leaving directory 'C:/Users/WORK/Desktop/git/llvm-obfuscator/build/CMakeFiles/CMakeTmp'
- mingw32-make.exe: *** [Makefile:120: cmTC_45ffa/fast] Error 2
- Determining if the include file CrashReporterClient.h exists failed with the following output:
- Change Dir: C:/Users/WORK/Desktop/git/llvm-obfuscator/build/CMakeFiles/CMakeTmp
- Run Build Command(s):C:/msys64/mingw64/bin/mingw32-make.exe cmTC_e8cd0/fast
- C:/msys64/mingw64/bin/mingw32-make.exe -f CMakeFiles\cmTC_e8cd0.dir\build.make CMakeFiles/cmTC_e8cd0.dir/build
- mingw32-make.exe[1]: Entering directory 'C:/Users/WORK/Desktop/git/llvm-obfuscator/build/CMakeFiles/CMakeTmp'
- Building C object CMakeFiles/cmTC_e8cd0.dir/CheckIncludeFile.c.obj
- C:\msys64\usr\bin\gcc.exe -o CMakeFiles\cmTC_e8cd0.dir\CheckIncludeFile.c.obj -c C:\Users\WORK\Desktop\git\llvm-obfuscator\build\CMakeFiles\CMakeTmp\CheckIncludeFile.c
- C:\Users\WORK\Desktop\git\llvm-obfuscator\build\CMakeFiles\CMakeTmp\CheckIncludeFile.c:1:10: fatal error: CrashReporterClient.h: No such file or directory
- #include <CrashReporterClient.h>
- ^~~~~~~~~~~~~~~~~~~~~~~
- compilation terminated.
- mingw32-make.exe[1]: *** [CMakeFiles\cmTC_e8cd0.dir\build.make:65: CMakeFiles/cmTC_e8cd0.dir/CheckIncludeFile.c.obj] Error 1
- mingw32-make.exe[1]: Leaving directory 'C:/Users/WORK/Desktop/git/llvm-obfuscator/build/CMakeFiles/CMakeTmp'
- mingw32-make.exe: *** [Makefile:120: cmTC_e8cd0/fast] Error 2
- Determining if the function setupterm exists in the tinfo failed with the following output:
- Change Dir: C:/Users/WORK/Desktop/git/llvm-obfuscator/build/CMakeFiles/CMakeTmp
- Run Build Command(s):C:/msys64/mingw64/bin/mingw32-make.exe cmTC_73f0e/fast
- C:/msys64/mingw64/bin/mingw32-make.exe -f CMakeFiles\cmTC_73f0e.dir\build.make CMakeFiles/cmTC_73f0e.dir/build
- mingw32-make.exe[1]: Entering directory 'C:/Users/WORK/Desktop/git/llvm-obfuscator/build/CMakeFiles/CMakeTmp'
- Building C object CMakeFiles/cmTC_73f0e.dir/CheckFunctionExists.c.obj
- C:\msys64\usr\bin\gcc.exe -DCHECK_FUNCTION_EXISTS=setupterm -o CMakeFiles\cmTC_73f0e.dir\CheckFunctionExists.c.obj -c "C:\Program Files\CMake\share\cmake-3.14\Modules\CheckFunctionExists.c"
- Linking C executable cmTC_73f0e.exe
- "C:\Program Files\CMake\bin\cmake.exe" -E cmake_link_script CMakeFiles\cmTC_73f0e.dir\link.txt --verbose=1
- "C:\Program Files\CMake\bin\cmake.exe" -E remove -f CMakeFiles\cmTC_73f0e.dir/objects.a
- C:\msys64\usr\bin\ar.exe cr CMakeFiles\cmTC_73f0e.dir/objects.a @CMakeFiles\cmTC_73f0e.dir\objects1.rsp
- C:\msys64\usr\bin\gcc.exe -DCHECK_FUNCTION_EXISTS=setupterm -Wl,--whole-archive CMakeFiles\cmTC_73f0e.dir/objects.a -Wl,--no-whole-archive -o cmTC_73f0e.exe -Wl,--out-implib,libcmTC_73f0e.dll.a -Wl,--major-image-version,0,--minor-image-version,0 @CMakeFiles\cmTC_73f0e.dir\linklibs.rsp
- /usr/lib/gcc/x86_64-pc-msys/7.4.0/../../../../x86_64-pc-msys/bin/ld: cannot find -ltinfo
- collect2: error: ld returned 1 exit status
- mingw32-make.exe[1]: *** [CMakeFiles\cmTC_73f0e.dir\build.make:88: cmTC_73f0e.exe] Error 1
- mingw32-make.exe[1]: Leaving directory 'C:/Users/WORK/Desktop/git/llvm-obfuscator/build/CMakeFiles/CMakeTmp'
- mingw32-make.exe: *** [Makefile:120: cmTC_73f0e/fast] Error 2
- Determining if the function setupterm exists in the terminfo failed with the following output:
- Change Dir: C:/Users/WORK/Desktop/git/llvm-obfuscator/build/CMakeFiles/CMakeTmp
- Run Build Command(s):C:/msys64/mingw64/bin/mingw32-make.exe cmTC_4c36b/fast
- C:/msys64/mingw64/bin/mingw32-make.exe -f CMakeFiles\cmTC_4c36b.dir\build.make CMakeFiles/cmTC_4c36b.dir/build
- mingw32-make.exe[1]: Entering directory 'C:/Users/WORK/Desktop/git/llvm-obfuscator/build/CMakeFiles/CMakeTmp'
- Building C object CMakeFiles/cmTC_4c36b.dir/CheckFunctionExists.c.obj
- C:\msys64\usr\bin\gcc.exe -DCHECK_FUNCTION_EXISTS=setupterm -o CMakeFiles\cmTC_4c36b.dir\CheckFunctionExists.c.obj -c "C:\Program Files\CMake\share\cmake-3.14\Modules\CheckFunctionExists.c"
- Linking C executable cmTC_4c36b.exe
- "C:\Program Files\CMake\bin\cmake.exe" -E cmake_link_script CMakeFiles\cmTC_4c36b.dir\link.txt --verbose=1
- "C:\Program Files\CMake\bin\cmake.exe" -E remove -f CMakeFiles\cmTC_4c36b.dir/objects.a
- C:\msys64\usr\bin\ar.exe cr CMakeFiles\cmTC_4c36b.dir/objects.a @CMakeFiles\cmTC_4c36b.dir\objects1.rsp
- C:\msys64\usr\bin\gcc.exe -DCHECK_FUNCTION_EXISTS=setupterm -Wl,--whole-archive CMakeFiles\cmTC_4c36b.dir/objects.a -Wl,--no-whole-archive -o cmTC_4c36b.exe -Wl,--out-implib,libcmTC_4c36b.dll.a -Wl,--major-image-version,0,--minor-image-version,0 @CMakeFiles\cmTC_4c36b.dir\linklibs.rsp
- /usr/lib/gcc/x86_64-pc-msys/7.4.0/../../../../x86_64-pc-msys/bin/ld: cannot find -lterminfo
- collect2: error: ld returned 1 exit status
- mingw32-make.exe[1]: *** [CMakeFiles\cmTC_4c36b.dir\build.make:88: cmTC_4c36b.exe] Error 1
- mingw32-make.exe[1]: Leaving directory 'C:/Users/WORK/Desktop/git/llvm-obfuscator/build/CMakeFiles/CMakeTmp'
- mingw32-make.exe: *** [Makefile:120: cmTC_4c36b/fast] Error 2
- Determining if the function xar_open exists in the xar failed with the following output:
- Change Dir: C:/Users/WORK/Desktop/git/llvm-obfuscator/build/CMakeFiles/CMakeTmp
- Run Build Command(s):C:/msys64/mingw64/bin/mingw32-make.exe cmTC_3e66b/fast
- C:/msys64/mingw64/bin/mingw32-make.exe -f CMakeFiles\cmTC_3e66b.dir\build.make CMakeFiles/cmTC_3e66b.dir/build
- mingw32-make.exe[1]: Entering directory 'C:/Users/WORK/Desktop/git/llvm-obfuscator/build/CMakeFiles/CMakeTmp'
- Building C object CMakeFiles/cmTC_3e66b.dir/CheckFunctionExists.c.obj
- C:\msys64\usr\bin\gcc.exe -DCHECK_FUNCTION_EXISTS=xar_open -o CMakeFiles\cmTC_3e66b.dir\CheckFunctionExists.c.obj -c "C:\Program Files\CMake\share\cmake-3.14\Modules\CheckFunctionExists.c"
- Linking C executable cmTC_3e66b.exe
- "C:\Program Files\CMake\bin\cmake.exe" -E cmake_link_script CMakeFiles\cmTC_3e66b.dir\link.txt --verbose=1
- "C:\Program Files\CMake\bin\cmake.exe" -E remove -f CMakeFiles\cmTC_3e66b.dir/objects.a
- C:\msys64\usr\bin\ar.exe cr CMakeFiles\cmTC_3e66b.dir/objects.a @CMakeFiles\cmTC_3e66b.dir\objects1.rsp
- C:\msys64\usr\bin\gcc.exe -DCHECK_FUNCTION_EXISTS=xar_open -Wl,--whole-archive CMakeFiles\cmTC_3e66b.dir/objects.a -Wl,--no-whole-archive -o cmTC_3e66b.exe -Wl,--out-implib,libcmTC_3e66b.dll.a -Wl,--major-image-version,0,--minor-image-version,0 @CMakeFiles\cmTC_3e66b.dir\linklibs.rsp
- /usr/lib/gcc/x86_64-pc-msys/7.4.0/../../../../x86_64-pc-msys/bin/ld: cannot find -lxar
- collect2: error: ld returned 1 exit status
- mingw32-make.exe[1]: *** [CMakeFiles\cmTC_3e66b.dir\build.make:88: cmTC_3e66b.exe] Error 1
- mingw32-make.exe[1]: Leaving directory 'C:/Users/WORK/Desktop/git/llvm-obfuscator/build/CMakeFiles/CMakeTmp'
- mingw32-make.exe: *** [Makefile:120: cmTC_3e66b/fast] Error 2
- Determining if the backtrace exist failed with the following output:
- Change Dir: C:/Users/WORK/Desktop/git/llvm-obfuscator/build/CMakeFiles/CMakeTmp
- Run Build Command(s):C:/msys64/mingw64/bin/mingw32-make.exe cmTC_016b2/fast
- C:/msys64/mingw64/bin/mingw32-make.exe -f CMakeFiles\cmTC_016b2.dir\build.make CMakeFiles/cmTC_016b2.dir/build
- mingw32-make.exe[1]: Entering directory 'C:/Users/WORK/Desktop/git/llvm-obfuscator/build/CMakeFiles/CMakeTmp'
- Building C object CMakeFiles/cmTC_016b2.dir/CheckSymbolExists.c.obj
- C:\msys64\usr\bin\gcc.exe -o CMakeFiles\cmTC_016b2.dir\CheckSymbolExists.c.obj -c C:\Users\WORK\Desktop\git\llvm-obfuscator\build\CMakeFiles\CMakeTmp\CheckSymbolExists.c
- C:\Users\WORK\Desktop\git\llvm-obfuscator\build\CMakeFiles\CMakeTmp\CheckSymbolExists.c:2:10: fatal error: execinfo.h: No such file or directory
- #include <execinfo.h>
- ^~~~~~~~~~~~
- compilation terminated.
- mingw32-make.exe[1]: *** [CMakeFiles\cmTC_016b2.dir\build.make:65: CMakeFiles/cmTC_016b2.dir/CheckSymbolExists.c.obj] Error 1
- mingw32-make.exe[1]: Leaving directory 'C:/Users/WORK/Desktop/git/llvm-obfuscator/build/CMakeFiles/CMakeTmp'
- mingw32-make.exe: *** [Makefile:120: cmTC_016b2/fast] Error 2
- File C:/Users/WORK/Desktop/git/llvm-obfuscator/build/CMakeFiles/CMakeTmp/CheckSymbolExists.c:
- /* */
- #include <execinfo.h>
- int main(int argc, char** argv)
- {
- (void)argv;
- #ifndef backtrace
- return ((int*)(&backtrace))[argc];
- #else
- (void)argc;
- return 0;
- #endif
- }
- Determining if the lseek64 exist failed with the following output:
- Change Dir: C:/Users/WORK/Desktop/git/llvm-obfuscator/build/CMakeFiles/CMakeTmp
- Run Build Command(s):C:/msys64/mingw64/bin/mingw32-make.exe cmTC_1a1aa/fast
- C:/msys64/mingw64/bin/mingw32-make.exe -f CMakeFiles\cmTC_1a1aa.dir\build.make CMakeFiles/cmTC_1a1aa.dir/build
- mingw32-make.exe[1]: Entering directory 'C:/Users/WORK/Desktop/git/llvm-obfuscator/build/CMakeFiles/CMakeTmp'
- Building C object CMakeFiles/cmTC_1a1aa.dir/CheckSymbolExists.c.obj
- C:\msys64\usr\bin\gcc.exe -D_LARGEFILE64_SOURCE -o CMakeFiles\cmTC_1a1aa.dir\CheckSymbolExists.c.obj -c C:\Users\WORK\Desktop\git\llvm-obfuscator\build\CMakeFiles\CMakeTmp\CheckSymbolExists.c
- C:\Users\WORK\Desktop\git\llvm-obfuscator\build\CMakeFiles\CMakeTmp\CheckSymbolExists.c: In function 'main':
- C:\Users\WORK\Desktop\git\llvm-obfuscator\build\CMakeFiles\CMakeTmp\CheckSymbolExists.c:9:19: error: 'lseek64' undeclared (first use in this function); did you mean 'lseek'?
- return ((int*)(&lseek64))[argc];
- ^~~~~~~
- lseek
- C:\Users\WORK\Desktop\git\llvm-obfuscator\build\CMakeFiles\CMakeTmp\CheckSymbolExists.c:9:19: note: each undeclared identifier is reported only once for each function it appears in
- mingw32-make.exe[1]: *** [CMakeFiles\cmTC_1a1aa.dir\build.make:65: CMakeFiles/cmTC_1a1aa.dir/CheckSymbolExists.c.obj] Error 1
- mingw32-make.exe[1]: Leaving directory 'C:/Users/WORK/Desktop/git/llvm-obfuscator/build/CMakeFiles/CMakeTmp'
- mingw32-make.exe: *** [Makefile:120: cmTC_1a1aa/fast] Error 2
- File C:/Users/WORK/Desktop/git/llvm-obfuscator/build/CMakeFiles/CMakeTmp/CheckSymbolExists.c:
- /* */
- #include <sys/types.h>
- #include <unistd.h>
- int main(int argc, char** argv)
- {
- (void)argv;
- #ifndef lseek64
- return ((int*)(&lseek64))[argc];
- #else
- (void)argc;
- return 0;
- #endif
- }
- Determining if the mallctl exist failed with the following output:
- Change Dir: C:/Users/WORK/Desktop/git/llvm-obfuscator/build/CMakeFiles/CMakeTmp
- Run Build Command(s):C:/msys64/mingw64/bin/mingw32-make.exe cmTC_48d94/fast
- C:/msys64/mingw64/bin/mingw32-make.exe -f CMakeFiles\cmTC_48d94.dir\build.make CMakeFiles/cmTC_48d94.dir/build
- mingw32-make.exe[1]: Entering directory 'C:/Users/WORK/Desktop/git/llvm-obfuscator/build/CMakeFiles/CMakeTmp'
- Building C object CMakeFiles/cmTC_48d94.dir/CheckSymbolExists.c.obj
- C:\msys64\usr\bin\gcc.exe -o CMakeFiles\cmTC_48d94.dir\CheckSymbolExists.c.obj -c C:\Users\WORK\Desktop\git\llvm-obfuscator\build\CMakeFiles\CMakeTmp\CheckSymbolExists.c
- C:\Users\WORK\Desktop\git\llvm-obfuscator\build\CMakeFiles\CMakeTmp\CheckSymbolExists.c:2:10: fatal error: malloc_np.h: No such file or directory
- #include <malloc_np.h>
- ^~~~~~~~~~~~~
- compilation terminated.
- mingw32-make.exe[1]: *** [CMakeFiles\cmTC_48d94.dir\build.make:65: CMakeFiles/cmTC_48d94.dir/CheckSymbolExists.c.obj] Error 1
- mingw32-make.exe[1]: Leaving directory 'C:/Users/WORK/Desktop/git/llvm-obfuscator/build/CMakeFiles/CMakeTmp'
- mingw32-make.exe: *** [Makefile:120: cmTC_48d94/fast] Error 2
- File C:/Users/WORK/Desktop/git/llvm-obfuscator/build/CMakeFiles/CMakeTmp/CheckSymbolExists.c:
- /* */
- #include <malloc_np.h>
- int main(int argc, char** argv)
- {
- (void)argv;
- #ifndef mallctl
- return ((int*)(&mallctl))[argc];
- #else
- (void)argc;
- return 0;
- #endif
- }
- Determining if the malloc_zone_statistics exist failed with the following output:
- Change Dir: C:/Users/WORK/Desktop/git/llvm-obfuscator/build/CMakeFiles/CMakeTmp
- Run Build Command(s):C:/msys64/mingw64/bin/mingw32-make.exe cmTC_227db/fast
- C:/msys64/mingw64/bin/mingw32-make.exe -f CMakeFiles\cmTC_227db.dir\build.make CMakeFiles/cmTC_227db.dir/build
- mingw32-make.exe[1]: Entering directory 'C:/Users/WORK/Desktop/git/llvm-obfuscator/build/CMakeFiles/CMakeTmp'
- Building C object CMakeFiles/cmTC_227db.dir/CheckSymbolExists.c.obj
- C:\msys64\usr\bin\gcc.exe -o CMakeFiles\cmTC_227db.dir\CheckSymbolExists.c.obj -c C:\Users\WORK\Desktop\git\llvm-obfuscator\build\CMakeFiles\CMakeTmp\CheckSymbolExists.c
- C:\Users\WORK\Desktop\git\llvm-obfuscator\build\CMakeFiles\CMakeTmp\CheckSymbolExists.c:2:10: fatal error: malloc/malloc.h: No such file or directory
- #include <malloc/malloc.h>
- ^~~~~~~~~~~~~~~~~
- compilation terminated.
- mingw32-make.exe[1]: *** [CMakeFiles\cmTC_227db.dir\build.make:65: CMakeFiles/cmTC_227db.dir/CheckSymbolExists.c.obj] Error 1
- mingw32-make.exe[1]: Leaving directory 'C:/Users/WORK/Desktop/git/llvm-obfuscator/build/CMakeFiles/CMakeTmp'
- mingw32-make.exe: *** [Makefile:120: cmTC_227db/fast] Error 2
- File C:/Users/WORK/Desktop/git/llvm-obfuscator/build/CMakeFiles/CMakeTmp/CheckSymbolExists.c:
- /* */
- #include <malloc/malloc.h>
- int main(int argc, char** argv)
- {
- (void)argv;
- #ifndef malloc_zone_statistics
- return ((int*)(&malloc_zone_statistics))[argc];
- #else
- (void)argc;
- return 0;
- #endif
- }
- Determining if the strerror_s exist failed with the following output:
- Change Dir: C:/Users/WORK/Desktop/git/llvm-obfuscator/build/CMakeFiles/CMakeTmp
- Run Build Command(s):C:/msys64/mingw64/bin/mingw32-make.exe cmTC_e4bb8/fast
- C:/msys64/mingw64/bin/mingw32-make.exe -f CMakeFiles\cmTC_e4bb8.dir\build.make CMakeFiles/cmTC_e4bb8.dir/build
- mingw32-make.exe[1]: Entering directory 'C:/Users/WORK/Desktop/git/llvm-obfuscator/build/CMakeFiles/CMakeTmp'
- Building C object CMakeFiles/cmTC_e4bb8.dir/CheckSymbolExists.c.obj
- C:\msys64\usr\bin\gcc.exe -o CMakeFiles\cmTC_e4bb8.dir\CheckSymbolExists.c.obj -c C:\Users\WORK\Desktop\git\llvm-obfuscator\build\CMakeFiles\CMakeTmp\CheckSymbolExists.c
- C:\Users\WORK\Desktop\git\llvm-obfuscator\build\CMakeFiles\CMakeTmp\CheckSymbolExists.c: In function 'main':
- C:\Users\WORK\Desktop\git\llvm-obfuscator\build\CMakeFiles\CMakeTmp\CheckSymbolExists.c:8:19: error: 'strerror_s' undeclared (first use in this function); did you mean 'strerror_r'?
- return ((int*)(&strerror_s))[argc];
- ^~~~~~~~~~
- strerror_r
- C:\Users\WORK\Desktop\git\llvm-obfuscator\build\CMakeFiles\CMakeTmp\CheckSymbolExists.c:8:19: note: each undeclared identifier is reported only once for each function it appears in
- mingw32-make.exe[1]: *** [CMakeFiles\cmTC_e4bb8.dir\build.make:65: CMakeFiles/cmTC_e4bb8.dir/CheckSymbolExists.c.obj] Error 1
- mingw32-make.exe[1]: Leaving directory 'C:/Users/WORK/Desktop/git/llvm-obfuscator/build/CMakeFiles/CMakeTmp'
- mingw32-make.exe: *** [Makefile:120: cmTC_e4bb8/fast] Error 2
- File C:/Users/WORK/Desktop/git/llvm-obfuscator/build/CMakeFiles/CMakeTmp/CheckSymbolExists.c:
- /* */
- #include <string.h>
- int main(int argc, char** argv)
- {
- (void)argv;
- #ifndef strerror_s
- return ((int*)(&strerror_s))[argc];
- #else
- (void)argc;
- return 0;
- #endif
- }
- Determining if the dladdr exist failed with the following output:
- Change Dir: C:/Users/WORK/Desktop/git/llvm-obfuscator/build/CMakeFiles/CMakeTmp
- Run Build Command(s):C:/msys64/mingw64/bin/mingw32-make.exe cmTC_49777/fast
- C:/msys64/mingw64/bin/mingw32-make.exe -f CMakeFiles\cmTC_49777.dir\build.make CMakeFiles/cmTC_49777.dir/build
- mingw32-make.exe[1]: Entering directory 'C:/Users/WORK/Desktop/git/llvm-obfuscator/build/CMakeFiles/CMakeTmp'
- Building C object CMakeFiles/cmTC_49777.dir/CheckSymbolExists.c.obj
- C:\msys64\usr\bin\gcc.exe -o CMakeFiles\cmTC_49777.dir\CheckSymbolExists.c.obj -c C:\Users\WORK\Desktop\git\llvm-obfuscator\build\CMakeFiles\CMakeTmp\CheckSymbolExists.c
- C:\Users\WORK\Desktop\git\llvm-obfuscator\build\CMakeFiles\CMakeTmp\CheckSymbolExists.c: In function 'main':
- C:\Users\WORK\Desktop\git\llvm-obfuscator\build\CMakeFiles\CMakeTmp\CheckSymbolExists.c:8:19: error: 'dladdr' undeclared (first use in this function)
- return ((int*)(&dladdr))[argc];
- ^~~~~~
- C:\Users\WORK\Desktop\git\llvm-obfuscator\build\CMakeFiles\CMakeTmp\CheckSymbolExists.c:8:19: note: each undeclared identifier is reported only once for each function it appears in
- mingw32-make.exe[1]: *** [CMakeFiles\cmTC_49777.dir\build.make:65: CMakeFiles/cmTC_49777.dir/CheckSymbolExists.c.obj] Error 1
- mingw32-make.exe[1]: Leaving directory 'C:/Users/WORK/Desktop/git/llvm-obfuscator/build/CMakeFiles/CMakeTmp'
- mingw32-make.exe: *** [Makefile:120: cmTC_49777/fast] Error 2
- File C:/Users/WORK/Desktop/git/llvm-obfuscator/build/CMakeFiles/CMakeTmp/CheckSymbolExists.c:
- /* */
- #include <dlfcn.h>
- int main(int argc, char** argv)
- {
- (void)argv;
- #ifndef dladdr
- return ((int*)(&dladdr))[argc];
- #else
- (void)argc;
- return 0;
- #endif
- }
- Determining if the __GLIBC__ exist failed with the following output:
- Change Dir: C:/Users/WORK/Desktop/git/llvm-obfuscator/build/CMakeFiles/CMakeTmp
- Run Build Command(s):C:/msys64/mingw64/bin/mingw32-make.exe cmTC_23437/fast
- C:/msys64/mingw64/bin/mingw32-make.exe -f CMakeFiles\cmTC_23437.dir\build.make CMakeFiles/cmTC_23437.dir/build
- mingw32-make.exe[1]: Entering directory 'C:/Users/WORK/Desktop/git/llvm-obfuscator/build/CMakeFiles/CMakeTmp'
- Building C object CMakeFiles/cmTC_23437.dir/CheckSymbolExists.c.obj
- C:\msys64\usr\bin\gcc.exe -o CMakeFiles\cmTC_23437.dir\CheckSymbolExists.c.obj -c C:\Users\WORK\Desktop\git\llvm-obfuscator\build\CMakeFiles\CMakeTmp\CheckSymbolExists.c
- C:\Users\WORK\Desktop\git\llvm-obfuscator\build\CMakeFiles\CMakeTmp\CheckSymbolExists.c: In function 'main':
- C:\Users\WORK\Desktop\git\llvm-obfuscator\build\CMakeFiles\CMakeTmp\CheckSymbolExists.c:8:19: error: '__GLIBC__' undeclared (first use in this function); did you mean '__LINE__'?
- return ((int*)(&__GLIBC__))[argc];
- ^~~~~~~~~
- __LINE__
- C:\Users\WORK\Desktop\git\llvm-obfuscator\build\CMakeFiles\CMakeTmp\CheckSymbolExists.c:8:19: note: each undeclared identifier is reported only once for each function it appears in
- mingw32-make.exe[1]: *** [CMakeFiles\cmTC_23437.dir\build.make:65: CMakeFiles/cmTC_23437.dir/CheckSymbolExists.c.obj] Error 1
- mingw32-make.exe[1]: Leaving directory 'C:/Users/WORK/Desktop/git/llvm-obfuscator/build/CMakeFiles/CMakeTmp'
- mingw32-make.exe: *** [Makefile:120: cmTC_23437/fast] Error 2
- File C:/Users/WORK/Desktop/git/llvm-obfuscator/build/CMakeFiles/CMakeTmp/CheckSymbolExists.c:
- /* */
- #include <stdio.h>
- int main(int argc, char** argv)
- {
- (void)argv;
- #ifndef __GLIBC__
- return ((int*)(&__GLIBC__))[argc];
- #else
- (void)argc;
- return 0;
- #endif
- }
- Performing C++ SOURCE FILE Test SUPPORTS_GNU_ZERO_VARIADIC_MACRO_ARGUMENTS_FLAG failed with the following output:
- Change Dir: C:/Users/WORK/Desktop/git/llvm-obfuscator/build/CMakeFiles/CMakeTmp
- Run Build Command(s):C:/msys64/mingw64/bin/mingw32-make.exe cmTC_cae52/fast
- C:/msys64/mingw64/bin/mingw32-make.exe -f CMakeFiles\cmTC_cae52.dir\build.make CMakeFiles/cmTC_cae52.dir/build
- mingw32-make.exe[1]: Entering directory 'C:/Users/WORK/Desktop/git/llvm-obfuscator/build/CMakeFiles/CMakeTmp'
- Building CXX object CMakeFiles/cmTC_cae52.dir/src.cxx.o
- C:\msys64\usr\bin\g++.exe -DSUPPORTS_GNU_ZERO_VARIADIC_MACRO_ARGUMENTS_FLAG -Wgnu-zero-variadic-macro-arguments -o CMakeFiles\cmTC_cae52.dir\src.cxx.o -c C:\Users\WORK\Desktop\git\llvm-obfuscator\build\CMakeFiles\CMakeTmp\src.cxx
- g++: error: unrecognized command line option '-Wgnu-zero-variadic-macro-arguments'; did you mean '-Wno-variadic-macros'?
- mingw32-make.exe[1]: *** [CMakeFiles\cmTC_cae52.dir\build.make:65: CMakeFiles/cmTC_cae52.dir/src.cxx.o] Error 1
- mingw32-make.exe[1]: Leaving directory 'C:/Users/WORK/Desktop/git/llvm-obfuscator/build/CMakeFiles/CMakeTmp'
- mingw32-make.exe: *** [Makefile:120: cmTC_cae52/fast] Error 2
- Source file was:
- int main() { return 0; }
- Performing C SOURCE FILE Test C_SUPPORTS_COVERED_SWITCH_DEFAULT_FLAG failed with the following output:
- Change Dir: C:/Users/WORK/Desktop/git/llvm-obfuscator/build/CMakeFiles/CMakeTmp
- Run Build Command(s):C:/msys64/mingw64/bin/mingw32-make.exe cmTC_7a58a/fast
- C:/msys64/mingw64/bin/mingw32-make.exe -f CMakeFiles\cmTC_7a58a.dir\build.make CMakeFiles/cmTC_7a58a.dir/build
- mingw32-make.exe[1]: Entering directory 'C:/Users/WORK/Desktop/git/llvm-obfuscator/build/CMakeFiles/CMakeTmp'
- Building C object CMakeFiles/cmTC_7a58a.dir/src.c.obj
- C:\msys64\usr\bin\gcc.exe -Werror=date-time -Wall -W -Wno-unused-parameter -Wwrite-strings -Wno-missing-field-initializers -pedantic -Wno-long-long -DC_SUPPORTS_COVERED_SWITCH_DEFAULT_FLAG -Werror -Wcovered-switch-default -o CMakeFiles\cmTC_7a58a.dir\src.c.obj -c C:\Users\WORK\Desktop\git\llvm-obfuscator\build\CMakeFiles\CMakeTmp\src.c
- gcc: error: unrecognized command line option '-Wcovered-switch-default'; did you mean '-Wno-switch-default'?
- mingw32-make.exe[1]: *** [CMakeFiles\cmTC_7a58a.dir\build.make:65: CMakeFiles/cmTC_7a58a.dir/src.c.obj] Error 1
- mingw32-make.exe[1]: Leaving directory 'C:/Users/WORK/Desktop/git/llvm-obfuscator/build/CMakeFiles/CMakeTmp'
- mingw32-make.exe: *** [Makefile:120: cmTC_7a58a/fast] Error 2
- Source file was:
- int main(void) { return 0; }
- Performing C++ SOURCE FILE Test CXX_SUPPORTS_COVERED_SWITCH_DEFAULT_FLAG failed with the following output:
- Change Dir: C:/Users/WORK/Desktop/git/llvm-obfuscator/build/CMakeFiles/CMakeTmp
- Run Build Command(s):C:/msys64/mingw64/bin/mingw32-make.exe cmTC_de204/fast
- C:/msys64/mingw64/bin/mingw32-make.exe -f CMakeFiles\cmTC_de204.dir\build.make CMakeFiles/cmTC_de204.dir/build
- mingw32-make.exe[1]: Entering directory 'C:/Users/WORK/Desktop/git/llvm-obfuscator/build/CMakeFiles/CMakeTmp'
- Building CXX object CMakeFiles/cmTC_de204.dir/src.cxx.o
- C:\msys64\usr\bin\g++.exe -Werror=date-time -std=gnu++11 -Wall -W -Wno-unused-parameter -Wwrite-strings -Wcast-qual -Wno-missing-field-initializers -pedantic -Wno-long-long -DCXX_SUPPORTS_COVERED_SWITCH_DEFAULT_FLAG -Werror -Wcovered-switch-default -o CMakeFiles\cmTC_de204.dir\src.cxx.o -c C:\Users\WORK\Desktop\git\llvm-obfuscator\build\CMakeFiles\CMakeTmp\src.cxx
- g++: error: unrecognized command line option '-Wcovered-switch-default'; did you mean '-Wno-switch-default'?
- mingw32-make.exe[1]: *** [CMakeFiles\cmTC_de204.dir\build.make:65: CMakeFiles/cmTC_de204.dir/src.cxx.o] Error 1
- mingw32-make.exe[1]: Leaving directory 'C:/Users/WORK/Desktop/git/llvm-obfuscator/build/CMakeFiles/CMakeTmp'
- mingw32-make.exe: *** [Makefile:120: cmTC_de204/fast] Error 2
- Source file was:
- int main() { return 0; }
- Performing C SOURCE FILE Test C_SUPPORTS_DELETE_NON_VIRTUAL_DTOR_FLAG failed with the following output:
- Change Dir: C:/Users/WORK/Desktop/git/llvm-obfuscator/build/CMakeFiles/CMakeTmp
- Run Build Command(s):C:/msys64/mingw64/bin/mingw32-make.exe cmTC_f8770/fast
- C:/msys64/mingw64/bin/mingw32-make.exe -f CMakeFiles\cmTC_f8770.dir\build.make CMakeFiles/cmTC_f8770.dir/build
- mingw32-make.exe[1]: Entering directory 'C:/Users/WORK/Desktop/git/llvm-obfuscator/build/CMakeFiles/CMakeTmp'
- Building C object CMakeFiles/cmTC_f8770.dir/src.c.obj
- C:\msys64\usr\bin\gcc.exe -Werror=date-time -Wall -W -Wno-unused-parameter -Wwrite-strings -Wno-missing-field-initializers -pedantic -Wno-long-long -DC_SUPPORTS_DELETE_NON_VIRTUAL_DTOR_FLAG -Werror -Wdelete-non-virtual-dtor -o CMakeFiles\cmTC_f8770.dir\src.c.obj -c C:\Users\WORK\Desktop\git\llvm-obfuscator\build\CMakeFiles\CMakeTmp\src.c
- cc1: error: command line option '-Wdelete-non-virtual-dtor' is valid for C++/ObjC++ but not for C [-Werror]
- cc1: all warnings being treated as errors
- mingw32-make.exe[1]: *** [CMakeFiles\cmTC_f8770.dir\build.make:65: CMakeFiles/cmTC_f8770.dir/src.c.obj] Error 1
- mingw32-make.exe[1]: Leaving directory 'C:/Users/WORK/Desktop/git/llvm-obfuscator/build/CMakeFiles/CMakeTmp'
- mingw32-make.exe: *** [Makefile:120: cmTC_f8770/fast] Error 2
- Source file was:
- int main(void) { return 0; }
- Performing C SOURCE FILE Test C_WCOMMENT_ALLOWS_LINE_WRAP failed with the following output:
- Change Dir: C:/Users/WORK/Desktop/git/llvm-obfuscator/build/CMakeFiles/CMakeTmp
- Run Build Command(s):C:/msys64/mingw64/bin/mingw32-make.exe cmTC_c1de0/fast
- C:/msys64/mingw64/bin/mingw32-make.exe -f CMakeFiles\cmTC_c1de0.dir\build.make CMakeFiles/cmTC_c1de0.dir/build
- mingw32-make.exe[1]: Entering directory 'C:/Users/WORK/Desktop/git/llvm-obfuscator/build/CMakeFiles/CMakeTmp'
- Building C object CMakeFiles/cmTC_c1de0.dir/src.c.obj
- C:\msys64\usr\bin\gcc.exe -Werror=date-time -Wall -W -Wno-unused-parameter -Wwrite-strings -Wno-missing-field-initializers -pedantic -Wno-long-long -DC_WCOMMENT_ALLOWS_LINE_WRAP -Werror -Wcomment -o CMakeFiles\cmTC_c1de0.dir\src.c.obj -c C:\Users\WORK\Desktop\git\llvm-obfuscator\build\CMakeFiles\CMakeTmp\src.c
- C:\Users\WORK\Desktop\git\llvm-obfuscator\build\CMakeFiles\CMakeTmp\src.c:1:1: error: multi-line comment [-Werror=comment]
- // \
- ^
- cc1: all warnings being treated as errors
- mingw32-make.exe[1]: *** [CMakeFiles\cmTC_c1de0.dir\build.make:65: CMakeFiles/cmTC_c1de0.dir/src.c.obj] Error 1
- mingw32-make.exe[1]: Leaving directory 'C:/Users/WORK/Desktop/git/llvm-obfuscator/build/CMakeFiles/CMakeTmp'
- mingw32-make.exe: *** [Makefile:120: cmTC_c1de0/fast] Error 2
- Source file was:
- // \
- //
- int main() {return 0;}
- Performing C SOURCE FILE Test C_SUPPORTS_STRING_CONVERSION_FLAG failed with the following output:
- Change Dir: C:/Users/WORK/Desktop/git/llvm-obfuscator/build/CMakeFiles/CMakeTmp
- Run Build Command(s):C:/msys64/mingw64/bin/mingw32-make.exe cmTC_9b228/fast
- C:/msys64/mingw64/bin/mingw32-make.exe -f CMakeFiles\cmTC_9b228.dir\build.make CMakeFiles/cmTC_9b228.dir/build
- mingw32-make.exe[1]: Entering directory 'C:/Users/WORK/Desktop/git/llvm-obfuscator/build/CMakeFiles/CMakeTmp'
- Building C object CMakeFiles/cmTC_9b228.dir/src.c.obj
- C:\msys64\usr\bin\gcc.exe -Werror=date-time -Wall -W -Wno-unused-parameter -Wwrite-strings -Wno-missing-field-initializers -pedantic -Wno-long-long -Wno-comment -DC_SUPPORTS_STRING_CONVERSION_FLAG -Werror -Wstring-conversion -o CMakeFiles\cmTC_9b228.dir\src.c.obj -c C:\Users\WORK\Desktop\git\llvm-obfuscator\build\CMakeFiles\CMakeTmp\src.c
- gcc: error: unrecognized command line option '-Wstring-conversion'; did you mean '-Wint-conversion'?
- mingw32-make.exe[1]: *** [CMakeFiles\cmTC_9b228.dir\build.make:65: CMakeFiles/cmTC_9b228.dir/src.c.obj] Error 1
- mingw32-make.exe[1]: Leaving directory 'C:/Users/WORK/Desktop/git/llvm-obfuscator/build/CMakeFiles/CMakeTmp'
- mingw32-make.exe: *** [Makefile:120: cmTC_9b228/fast] Error 2
- Source file was:
- int main(void) { return 0; }
- Performing C++ SOURCE FILE Test CXX_SUPPORTS_STRING_CONVERSION_FLAG failed with the following output:
- Change Dir: C:/Users/WORK/Desktop/git/llvm-obfuscator/build/CMakeFiles/CMakeTmp
- Run Build Command(s):C:/msys64/mingw64/bin/mingw32-make.exe cmTC_97579/fast
- C:/msys64/mingw64/bin/mingw32-make.exe -f CMakeFiles\cmTC_97579.dir\build.make CMakeFiles/cmTC_97579.dir/build
- mingw32-make.exe[1]: Entering directory 'C:/Users/WORK/Desktop/git/llvm-obfuscator/build/CMakeFiles/CMakeTmp'
- Building CXX object CMakeFiles/cmTC_97579.dir/src.cxx.o
- C:\msys64\usr\bin\g++.exe -Werror=date-time -std=gnu++11 -Wall -W -Wno-unused-parameter -Wwrite-strings -Wcast-qual -Wno-missing-field-initializers -pedantic -Wno-long-long -Wno-maybe-uninitialized -Wdelete-non-virtual-dtor -Wno-comment -DCXX_SUPPORTS_STRING_CONVERSION_FLAG -Werror -Wstring-conversion -o CMakeFiles\cmTC_97579.dir\src.cxx.o -c C:\Users\WORK\Desktop\git\llvm-obfuscator\build\CMakeFiles\CMakeTmp\src.cxx
- g++: error: unrecognized command line option '-Wstring-conversion'; did you mean '-Wint-conversion'?
- mingw32-make.exe[1]: *** [CMakeFiles\cmTC_97579.dir\build.make:65: CMakeFiles/cmTC_97579.dir/src.cxx.o] Error 1
- mingw32-make.exe[1]: Leaving directory 'C:/Users/WORK/Desktop/git/llvm-obfuscator/build/CMakeFiles/CMakeTmp'
- mingw32-make.exe: *** [Makefile:120: cmTC_97579/fast] Error 2
- Source file was:
- int main() { return 0; }
- Performing C++ SOURCE FILE Test CXX_SUPPORTS_NO_NESTED_ANON_TYPES_FLAG failed with the following output:
- Change Dir: C:/Users/WORK/Desktop/git/llvm-obfuscator/build/CMakeFiles/CMakeTmp
- Run Build Command(s):C:/msys64/mingw64/bin/mingw32-make.exe cmTC_be828/fast
- C:/msys64/mingw64/bin/mingw32-make.exe -f CMakeFiles\cmTC_be828.dir\build.make CMakeFiles/cmTC_be828.dir/build
- mingw32-make.exe[1]: Entering directory 'C:/Users/WORK/Desktop/git/llvm-obfuscator/build/CMakeFiles/CMakeTmp'
- Building CXX object CMakeFiles/cmTC_be828.dir/src.cxx.o
- C:\msys64\usr\bin\g++.exe -Werror=date-time -std=gnu++11 -Wall -W -Wno-unused-parameter -Wwrite-strings -Wcast-qual -Wno-missing-field-initializers -pedantic -Wno-long-long -Wno-maybe-uninitialized -Wdelete-non-virtual-dtor -Wno-comment -fno-common -Woverloaded-virtual -fno-strict-aliasing -DCXX_SUPPORTS_NO_NESTED_ANON_TYPES_FLAG -Werror -Wnested-anon-types -o CMakeFiles\cmTC_be828.dir\src.cxx.o -c C:\Users\WORK\Desktop\git\llvm-obfuscator\build\CMakeFiles\CMakeTmp\src.cxx
- g++: error: unrecognized command line option '-Wnested-anon-types'; did you mean '-Wnested-externs'?
- mingw32-make.exe[1]: *** [CMakeFiles\cmTC_be828.dir\build.make:65: CMakeFiles/cmTC_be828.dir/src.cxx.o] Error 1
- mingw32-make.exe[1]: Leaving directory 'C:/Users/WORK/Desktop/git/llvm-obfuscator/build/CMakeFiles/CMakeTmp'
- mingw32-make.exe: *** [Makefile:120: cmTC_be828/fast] Error 2
- Source file was:
- int main() { return 0; }
Advertisement
Add Comment
Please, Sign In to add comment