lamiastella

renderdoc_sln_error

Dec 14th, 2016
334
0
Never
Not a member of Pastebin yet? Sign Up, it unlocks many cool features!
text 6.26 KB | None | 0 0
  1. 1>------ Build started: Project: spirv, Configuration: Debug Win32 ------
  2. 2>------ Build started: Project: crash_generation_client, Configuration: Debug Win32 ------
  3. 3>------ Build started: Project: crash_generation_server, Configuration: Debug Win32 ------
  4. 4>------ Build started: Project: exception_handler, Configuration: Debug Win32 ------
  5. 2> crash_generation_client.cc
  6. 2>C:\Program Files (x86)\Windows Kits\8.1\Include\um\dbghelp.h(1545): error C2220: warning treated as error - no 'object' file generated
  7. 2>C:\Program Files (x86)\Windows Kits\8.1\Include\um\dbghelp.h(1545): warning C4091: 'typedef ': ignored on left of '' when no variable is declared
  8. 2>C:\Program Files (x86)\Windows Kits\8.1\Include\um\dbghelp.h(3191): warning C4091: 'typedef ': ignored on left of '' when no variable is declared
  9. 3> client_info.cc
  10. 3> minidump_generator.cc
  11. 3> crash_generation_server.cc
  12. 3>C:\Program Files (x86)\Windows Kits\8.1\Include\um\dbghelp.h(1545): error C2220: warning treated as error - no 'object' file generated (compiling source file minidump_generator.cc)
  13. 3>C:\Program Files (x86)\Windows Kits\8.1\Include\um\dbghelp.h(1545): warning C4091: 'typedef ': ignored on left of '' when no variable is declared (compiling source file minidump_generator.cc)
  14. 3>C:\Program Files (x86)\Windows Kits\8.1\Include\um\DbgHelp.h(1545): error C2220: warning treated as error - no 'object' file generated (compiling source file client_info.cc)
  15. 3>C:\Program Files (x86)\Windows Kits\8.1\Include\um\DbgHelp.h(1545): warning C4091: 'typedef ': ignored on left of '' when no variable is declared (compiling source file client_info.cc)
  16. 3>C:\Program Files (x86)\Windows Kits\8.1\Include\um\dbghelp.h(3191): warning C4091: 'typedef ': ignored on left of '' when no variable is declared (compiling source file minidump_generator.cc)
  17. 3>C:\Program Files (x86)\Windows Kits\8.1\Include\um\DbgHelp.h(3191): warning C4091: 'typedef ': ignored on left of '' when no variable is declared (compiling source file client_info.cc)
  18. 3>C:\Program Files (x86)\Windows Kits\8.1\Include\um\DbgHelp.h(1545): error C2220: warning treated as error - no 'object' file generated (compiling source file crash_generation_server.cc)
  19. 3>C:\Program Files (x86)\Windows Kits\8.1\Include\um\DbgHelp.h(1545): warning C4091: 'typedef ': ignored on left of '' when no variable is declared (compiling source file crash_generation_server.cc)
  20. 3>C:\Program Files (x86)\Windows Kits\8.1\Include\um\DbgHelp.h(3191): warning C4091: 'typedef ': ignored on left of '' when no variable is declared (compiling source file crash_generation_server.cc)
  21. 4> exception_handler.cc
  22. 4>C:\Program Files (x86)\Windows Kits\8.1\Include\um\DbgHelp.h(1545): error C2220: warning treated as error - no 'object' file generated
  23. 4>C:\Program Files (x86)\Windows Kits\8.1\Include\um\DbgHelp.h(1545): warning C4091: 'typedef ': ignored on left of '' when no variable is declared
  24. 4>C:\Program Files (x86)\Windows Kits\8.1\Include\um\DbgHelp.h(3191): warning C4091: 'typedef ': ignored on left of '' when no variable is declared
  25. 1> PpTokens.cpp
  26. 1>..\..\..\3rdparty\glslang\glslang\MachineIndependent\preprocessor\PpTokens.cpp(218): error C2220: warning treated as error - no 'object' file generated
  27. 1>..\..\..\3rdparty\glslang\glslang\MachineIndependent\preprocessor\PpTokens.cpp(218): warning C4996: 'strcpy': This function or variable may be unsafe. Consider using strcpy_s instead. To disable deprecation, use _CRT_SECURE_NO_WARNINGS. See online help for details.
  28. 1> C:\Program Files (x86)\Windows Kits\10\Include\10.0.10240.0\ucrt\string.h(119): note: see declaration of 'strcpy'
  29. 1>..\..\..\3rdparty\glslang\glslang\MachineIndependent\preprocessor\PpTokens.cpp(223): warning C4996: 'strcpy': This function or variable may be unsafe. Consider using strcpy_s instead. To disable deprecation, use _CRT_SECURE_NO_WARNINGS. See online help for details.
  30. 1> C:\Program Files (x86)\Windows Kits\10\Include\10.0.10240.0\ucrt\string.h(119): note: see declaration of 'strcpy'
  31. 5>------ Build started: Project: renderdoc, Configuration: Debug Win32 ------
  32. 5> core.cpp
  33. 5> win32_callstack.cpp
  34. 5> replay_renderer.cpp
  35. 5> serialiser.cpp
  36. 5>serialise\serialiser.cpp(493): error C2220: warning treated as error - no 'object' file generated
  37. 5>serialise\serialiser.cpp(493): warning C4456: declaration of 'memoryBufEnd' hides previous local declaration
  38. 5> serialise\serialiser.cpp(493): note: to simplify migration, consider the temporary use of /Wv:18 flag with the version of the compiler with which you used to build without warnings
  39. 5> serialise\serialiser.cpp(446): note: see declaration of 'memoryBufEnd'
  40. 5>C:\Program Files (x86)\Windows Kits\8.1\Include\um\dbghelp.h(1545): error C2220: warning treated as error - no 'object' file generated (compiling source file os\win32\win32_callstack.cpp)
  41. 5>C:\Program Files (x86)\Windows Kits\8.1\Include\um\dbghelp.h(1545): warning C4091: 'typedef ': ignored on left of '' when no variable is declared (compiling source file os\win32\win32_callstack.cpp)
  42. 5>C:\Program Files (x86)\Windows Kits\8.1\Include\um\dbghelp.h(3191): warning C4091: 'typedef ': ignored on left of '' when no variable is declared (compiling source file os\win32\win32_callstack.cpp)
  43. 5>replay\replay_renderer.cpp(49): fatal error C1083: Cannot open include file: 'ImfOutputFile.h': No such file or directory
  44. 5>core\core.cpp(854): error C2220: warning treated as error - no 'object' file generated
  45. 5>core\core.cpp(854): warning C4456: declaration of 'it' hides previous local declaration
  46. 5> core\core.cpp(854): note: to simplify migration, consider the temporary use of /Wv:18 flag with the version of the compiler with which you used to build without warnings
  47. 5> core\core.cpp(839): note: see declaration of 'it'
  48. 6>------ Build started: Project: renderdoccmd, Configuration: Debug Win32 ------
  49. 6> renderdoccmd_win32.cpp
  50. 6>C:\Program Files (x86)\Windows Kits\8.1\Include\um\DbgHelp.h(1545): error C2220: warning treated as error - no 'object' file generated
  51. 6>C:\Program Files (x86)\Windows Kits\8.1\Include\um\DbgHelp.h(1545): warning C4091: 'typedef ': ignored on left of '' when no variable is declared
  52. 6>C:\Program Files (x86)\Windows Kits\8.1\Include\um\DbgHelp.h(3191): warning C4091: 'typedef ': ignored on left of '' when no variable is declared
  53. ========== Build: 0 succeeded, 6 failed, 9 up-to-date, 0 skipped ==========
Advertisement
Add Comment
Please, Sign In to add comment