Advertisement
Guest User

Untitled

a guest
May 28th, 2018
187
Never
Not a member of Pastebin yet? Sign Up, it unlocks many cool features!
  1. This file contains any messages produced by compilers while
  2. running configure, to aid debugging if configure makes a mistake.
  3.  
  4. It was created by trousers configure 0.3.14, which was
  5. generated by GNU Autoconf 2.69. Invocation command line was
  6.  
  7. $ ./configure --prefix=/usr --sysconfdir=/etc --libdir=/usr/lib --sbindir=/usr/bin --with-openssl=/usr --with-gui=openssl
  8.  
  9. ## --------- ##
  10. ## Platform. ##
  11. ## --------- ##
  12.  
  13. hostname = roman_workstation
  14. uname -m = x86_64
  15. uname -r = 4.16.12-1-ARCH
  16. uname -s = Linux
  17. uname -v = #1 SMP PREEMPT Fri May 25 23:30:31 UTC 2018
  18.  
  19. /usr/bin/uname -p = unknown
  20. /bin/uname -X = unknown
  21.  
  22. /bin/arch = unknown
  23. /usr/bin/arch -k = unknown
  24. /usr/convex/getsysinfo = unknown
  25. /usr/bin/hostinfo = unknown
  26. /bin/machine = unknown
  27. /usr/bin/oslevel = unknown
  28. /bin/universe = unknown
  29.  
  30. PATH: /usr/local/bin
  31. PATH: /usr/local/sbin
  32. PATH: /usr/bin
  33. PATH: /usr/lib/jvm/default/bin
  34. PATH: /usr/bin/site_perl
  35. PATH: /usr/bin/vendor_perl
  36. PATH: /usr/bin/core_perl
  37.  
  38.  
  39. ## ----------- ##
  40. ## Core tests. ##
  41. ## ----------- ##
  42.  
  43. configure:2450: checking build system type
  44. configure:2464: result: x86_64-unknown-linux-gnu
  45. configure:2484: checking host system type
  46. configure:2497: result: x86_64-unknown-linux-gnu
  47. configure:2517: checking target system type
  48. configure:2530: result: x86_64-unknown-linux-gnu
  49. configure:2572: checking for a BSD-compatible install
  50. configure:2640: result: /usr/bin/install -c
  51. configure:2651: checking whether build environment is sane
  52. configure:2706: result: yes
  53. configure:2857: checking for a thread-safe mkdir -p
  54. configure:2896: result: /usr/bin/mkdir -p
  55. configure:2903: checking for gawk
  56. configure:2919: found /usr/bin/gawk
  57. configure:2930: result: gawk
  58. configure:2941: checking whether make sets $(MAKE)
  59. configure:2963: result: yes
  60. configure:2992: checking whether make supports nested variables
  61. configure:3009: result: yes
  62. configure:3175: checking Non-standard OpenSSL location
  63. configure:3185: result: yes
  64. configure:3212: checking for style of include used by make
  65. configure:3240: result: GNU
  66. configure:3311: checking for gcc
  67. configure:3327: found /usr/bin/gcc
  68. configure:3338: result: gcc
  69. configure:3567: checking for C compiler version
  70. configure:3576: gcc --version >&5
  71. gcc (GCC) 8.1.0
  72. Copyright (C) 2018 Free Software Foundation, Inc.
  73. This is free software; see the source for copying conditions. There is NO
  74. warranty; not even for MERCHANTABILITY or FITNESS FOR A PARTICULAR PURPOSE.
  75.  
  76. configure:3587: $? = 0
  77. configure:3576: gcc -v >&5
  78. Using built-in specs.
  79. COLLECT_GCC=gcc
  80. COLLECT_LTO_WRAPPER=/usr/lib/gcc/x86_64-pc-linux-gnu/8.1.0/lto-wrapper
  81. Target: x86_64-pc-linux-gnu
  82. Configured with: /build/gcc/src/gcc/configure --prefix=/usr --libdir=/usr/lib --libexecdir=/usr/lib --mandir=/usr/share/man --infodir=/usr/share/info --with-bugurl=https://bugs.archlinux.org/ --enable-languages=c,c++,ada,fortran,go,lto,objc,obj-c++ --enable-shared --enable-threads=posix --enable-libmpx --with-system-zlib --with-isl --enable-__cxa_atexit --disable-libunwind-exceptions --enable-clocale=gnu --disable-libstdcxx-pch --disable-libssp --enable-gnu-unique-object --enable-linker-build-id --enable-lto --enable-plugin --enable-install-libiberty --with-linker-hash-style=gnu --enable-gnu-indirect-function --enable-multilib --disable-werror --enable-checking=release --enable-default-pie --enable-default-ssp
  83. Thread model: posix
  84. gcc version 8.1.0 (GCC)
  85. configure:3587: $? = 0
  86. configure:3576: gcc -V >&5
  87. gcc: error: unrecognized command line option '-V'
  88. gcc: fatal error: no input files
  89. compilation terminated.
  90. configure:3587: $? = 1
  91. configure:3576: gcc -qversion >&5
  92. gcc: error: unrecognized command line option '-qversion'; did you mean '--version'?
  93. gcc: fatal error: no input files
  94. compilation terminated.
  95. configure:3587: $? = 1
  96. configure:3607: checking whether the C compiler works
  97. configure:3629: gcc -std=gnu89 -march=native -mtune=native -Ofast -flto=32 -fuse-linker-plugin -pipe -fstack-protector-strong -fno-plt -L/usr/lib -I/usr/include -D_FORTIFY_SOURCE=2 -Wl,-O3,--sort-common,--as-needed,-z,relro,-z,now, -flto=32 -fuse-linker-plugin conftest.c >&5
  98. /usr/bin/ld: cannot find : No such file or directory
  99. collect2: error: ld returned 1 exit status
  100. configure:3633: $? = 1
  101. configure:3671: result: no
  102. configure: failed program was:
  103. | /* confdefs.h */
  104. | #define PACKAGE_NAME "trousers"
  105. | #define PACKAGE_TARNAME "trousers"
  106. | #define PACKAGE_VERSION "0.3.14"
  107. | #define PACKAGE_STRING "trousers 0.3.14"
  108. | #define PACKAGE_BUGREPORT "trousers-tech@lists.sf.net"
  109. | #define PACKAGE_URL ""
  110. | #define PACKAGE "trousers"
  111. | #define VERSION "0.3.14"
  112. | /* end confdefs.h. */
  113. |
  114. | int
  115. | main ()
  116. | {
  117. |
  118. | ;
  119. | return 0;
  120. | }
  121. configure:3676: error: in `/tmp/yaourt-tmp-blackout/aur-trousers/src/trousers-0.3.14':
  122. configure:3678: error: C compiler cannot create executables
  123. See `config.log' for more details
  124.  
  125. ## ---------------- ##
  126. ## Cache variables. ##
  127. ## ---------------- ##
  128.  
  129. ac_cv_build=x86_64-unknown-linux-gnu
  130. ac_cv_env_CC_set=
  131. ac_cv_env_CC_value=
  132. ac_cv_env_CFLAGS_set=set
  133. ac_cv_env_CFLAGS_value='-std=gnu89 -march=native -mtune=native -Ofast -flto=32 -fuse-linker-plugin -pipe -fstack-protector-strong -fno-plt'
  134. ac_cv_env_CPPFLAGS_set=set
  135. ac_cv_env_CPPFLAGS_value=-D_FORTIFY_SOURCE=2
  136. ac_cv_env_CPP_set=
  137. ac_cv_env_CPP_value=
  138. ac_cv_env_GTK_CFLAGS_set=
  139. ac_cv_env_GTK_CFLAGS_value=
  140. ac_cv_env_GTK_LIBS_set=
  141. ac_cv_env_GTK_LIBS_value=
  142. ac_cv_env_LDFLAGS_set=set
  143. ac_cv_env_LDFLAGS_value='-Wl,-O3,--sort-common,--as-needed,-z,relro,-z,now, -flto=32 -fuse-linker-plugin'
  144. ac_cv_env_LIBS_set=
  145. ac_cv_env_LIBS_value=
  146. ac_cv_env_LT_SYS_LIBRARY_PATH_set=
  147. ac_cv_env_LT_SYS_LIBRARY_PATH_value=
  148. ac_cv_env_PKG_CONFIG_LIBDIR_set=
  149. ac_cv_env_PKG_CONFIG_LIBDIR_value=
  150. ac_cv_env_PKG_CONFIG_PATH_set=
  151. ac_cv_env_PKG_CONFIG_PATH_value=
  152. ac_cv_env_PKG_CONFIG_set=
  153. ac_cv_env_PKG_CONFIG_value=
  154. ac_cv_env_build_alias_set=
  155. ac_cv_env_build_alias_value=
  156. ac_cv_env_host_alias_set=
  157. ac_cv_env_host_alias_value=
  158. ac_cv_env_target_alias_set=
  159. ac_cv_env_target_alias_value=
  160. ac_cv_host=x86_64-unknown-linux-gnu
  161. ac_cv_path_install='/usr/bin/install -c'
  162. ac_cv_path_mkdir=/usr/bin/mkdir
  163. ac_cv_prog_AWK=gawk
  164. ac_cv_prog_ac_ct_CC=gcc
  165. ac_cv_prog_make_make_set=yes
  166. ac_cv_target=x86_64-unknown-linux-gnu
  167. am_cv_make_support_nested_variables=yes
  168.  
  169. ## ----------------- ##
  170. ## Output variables. ##
  171. ## ----------------- ##
  172.  
  173. ACLOCAL='${SHELL} /tmp/yaourt-tmp-blackout/aur-trousers/src/trousers-0.3.14/missing aclocal-1.15'
  174. AMDEPBACKSLASH='\'
  175. AMDEP_FALSE='#'
  176. AMDEP_TRUE=''
  177. AMTAR='$${TAR-tar}'
  178. AM_BACKSLASH='\'
  179. AM_DEFAULT_V='$(AM_DEFAULT_VERBOSITY)'
  180. AM_DEFAULT_VERBOSITY='1'
  181. AM_V='$(V)'
  182. AR=''
  183. AUTOCONF='${SHELL} /tmp/yaourt-tmp-blackout/aur-trousers/src/trousers-0.3.14/missing autoconf'
  184. AUTOHEADER='${SHELL} /tmp/yaourt-tmp-blackout/aur-trousers/src/trousers-0.3.14/missing autoheader'
  185. AUTOMAKE='${SHELL} /tmp/yaourt-tmp-blackout/aur-trousers/src/trousers-0.3.14/missing automake-1.15'
  186. AWK='gawk'
  187. CC='gcc'
  188. CCDEPMODE=''
  189. CFLAGS='-march=native -mtune=native -Ofast -flto=32 -fuse-linker-plugin -pipe -fstack-protector-strong -fno-plt -L/usr/lib -I/usr/include'
  190. CPP=''
  191. CPPFLAGS='-D_FORTIFY_SOURCE=2'
  192. CRYPTOLIB=''
  193. CRYPTO_PACKAGE=''
  194. CYGPATH_W='echo'
  195. DEFS=''
  196. DEPDIR='.deps'
  197. DLLTOOL=''
  198. DSYMUTIL=''
  199. DUMPBIN=''
  200. ECHO_C=''
  201. ECHO_N='-n'
  202. ECHO_T=''
  203. EGREP=''
  204. EXEEXT=''
  205. FGREP=''
  206. GREP=''
  207. GTK_CFLAGS=''
  208. GTK_LIBS=''
  209. HAVE_GTK_FALSE=''
  210. HAVE_GTK_TRUE=''
  211. INSTALL_DATA='${INSTALL} -m 644'
  212. INSTALL_PROGRAM='${INSTALL}'
  213. INSTALL_SCRIPT='${INSTALL}'
  214. INSTALL_STRIP_PROGRAM='$(install_sh) -c -s'
  215. LD=''
  216. LDFLAGS='-Wl,-O3,--sort-common,--as-needed,-z,relro,-z,now, -flto=32 -fuse-linker-plugin'
  217. LIBOBJS=''
  218. LIBS=''
  219. LIBTOOL=''
  220. LIPO=''
  221. LN_S=''
  222. LTLIBOBJS=''
  223. LT_SYS_LIBRARY_PATH=''
  224. MAKEINFO='${SHELL} /tmp/yaourt-tmp-blackout/aur-trousers/src/trousers-0.3.14/missing makeinfo'
  225. MANIFEST_TOOL=''
  226. MKDIR_P='/usr/bin/mkdir -p'
  227. NM=''
  228. NMEDIT=''
  229. NOUSERCHECK_FALSE=''
  230. NOUSERCHECK_TRUE=''
  231. OBJDUMP=''
  232. OBJEXT=''
  233. OPENSSL_LIB_DIR='/usr/lib'
  234. OPENSSL_UI_FALSE=''
  235. OPENSSL_UI_TRUE=''
  236. OTOOL64=''
  237. OTOOL=''
  238. PACKAGE='trousers'
  239. PACKAGE_BUGREPORT='trousers-tech@lists.sf.net'
  240. PACKAGE_NAME='trousers'
  241. PACKAGE_STRING='trousers 0.3.14'
  242. PACKAGE_TARNAME='trousers'
  243. PACKAGE_URL=''
  244. PACKAGE_VERSION='0.3.14'
  245. PATH_SEPARATOR=':'
  246. PKG_CONFIG=''
  247. PKG_CONFIG_LIBDIR=''
  248. PKG_CONFIG_PATH=''
  249. RANLIB=''
  250. RPC=''
  251. SED=''
  252. SET_MAKE=''
  253. SHELL='/bin/sh'
  254. STRIP=''
  255. TCSD_DEFAULT_PORT=''
  256. TCSD_LDFLAGS='-pie -Wl,-z,relro -Wl,-z,now'
  257. TSS_BUILD_ADMIN_FALSE=''
  258. TSS_BUILD_ADMIN_TRUE=''
  259. TSS_BUILD_AIK_FALSE=''
  260. TSS_BUILD_AIK_TRUE=''
  261. TSS_BUILD_ASN1_FALSE=''
  262. TSS_BUILD_ASN1_TRUE=''
  263. TSS_BUILD_ASYM_CRYPTO_FALSE=''
  264. TSS_BUILD_ASYM_CRYPTO_TRUE=''
  265. TSS_BUILD_AUDIT_FALSE=''
  266. TSS_BUILD_AUDIT_TRUE=''
  267. TSS_BUILD_AUTH_FALSE=''
  268. TSS_BUILD_AUTH_TRUE=''
  269. TSS_BUILD_BIND_FALSE=''
  270. TSS_BUILD_BIND_TRUE=''
  271. TSS_BUILD_CAPS_FALSE=''
  272. TSS_BUILD_CAPS_TPM_FALSE=''
  273. TSS_BUILD_CAPS_TPM_TRUE=''
  274. TSS_BUILD_CAPS_TRUE=''
  275. TSS_BUILD_CERTIFY_FALSE=''
  276. TSS_BUILD_CERTIFY_TRUE=''
  277. TSS_BUILD_CHANGEAUTH_FALSE=''
  278. TSS_BUILD_CHANGEAUTH_TRUE=''
  279. TSS_BUILD_CMK_FALSE=''
  280. TSS_BUILD_CMK_TRUE=''
  281. TSS_BUILD_COUNTER_FALSE=''
  282. TSS_BUILD_COUNTER_TRUE=''
  283. TSS_BUILD_DAA_FALSE=''
  284. TSS_BUILD_DAA_TRUE=''
  285. TSS_BUILD_DELEGATION_FALSE=''
  286. TSS_BUILD_DELEGATION_TRUE=''
  287. TSS_BUILD_DIR_FALSE=''
  288. TSS_BUILD_DIR_TRUE=''
  289. TSS_BUILD_EK_FALSE=''
  290. TSS_BUILD_EK_TRUE=''
  291. TSS_BUILD_ENCDATA_LIST_FALSE=''
  292. TSS_BUILD_ENCDATA_LIST_TRUE=''
  293. TSS_BUILD_GETSET_FALSE=''
  294. TSS_BUILD_GETSET_TRUE=''
  295. TSS_BUILD_GET_FLAGS_FALSE=''
  296. TSS_BUILD_GET_FLAGS_TRUE=''
  297. TSS_BUILD_HASH_FALSE=''
  298. TSS_BUILD_HASH_LIST_FALSE=''
  299. TSS_BUILD_HASH_LIST_TRUE=''
  300. TSS_BUILD_HASH_TRUE=''
  301. TSS_BUILD_KEY_FALSE=''
  302. TSS_BUILD_KEY_TRUE=''
  303. TSS_BUILD_MAINT_FALSE=''
  304. TSS_BUILD_MAINT_TRUE=''
  305. TSS_BUILD_MIGRATION_FALSE=''
  306. TSS_BUILD_MIGRATION_TRUE=''
  307. TSS_BUILD_NV_FALSE=''
  308. TSS_BUILD_NV_LIST_FALSE=''
  309. TSS_BUILD_NV_LIST_TRUE=''
  310. TSS_BUILD_NV_SUPPORT_FALSE=''
  311. TSS_BUILD_NV_SUPPORT_TRUE=''
  312. TSS_BUILD_NV_TRUE=''
  313. TSS_BUILD_OWN_FALSE=''
  314. TSS_BUILD_OWN_TRUE=''
  315. TSS_BUILD_PCRS_LIST_FALSE=''
  316. TSS_BUILD_PCRS_LIST_TRUE=''
  317. TSS_BUILD_PCR_COMP12_FALSE=''
  318. TSS_BUILD_PCR_COMP12_TRUE=''
  319. TSS_BUILD_PCR_COMP_FALSE=''
  320. TSS_BUILD_PCR_COMP_TRUE=''
  321. TSS_BUILD_PCR_EVENTS_FALSE=''
  322. TSS_BUILD_PCR_EVENTS_TRUE=''
  323. TSS_BUILD_PCR_EXTEND_FALSE=''
  324. TSS_BUILD_PCR_EXTEND_TRUE=''
  325. TSS_BUILD_POLICY_FALSE=''
  326. TSS_BUILD_POLICY_TRUE=''
  327. TSS_BUILD_PS_FALSE=''
  328. TSS_BUILD_PS_TRUE=''
  329. TSS_BUILD_QUOTE2_FALSE=''
  330. TSS_BUILD_QUOTE2_TRUE=''
  331. TSS_BUILD_QUOTE_FALSE=''
  332. TSS_BUILD_QUOTE_TRUE=''
  333. TSS_BUILD_RANDOM_FALSE=''
  334. TSS_BUILD_RANDOM_TRUE=''
  335. TSS_BUILD_RSAKEY_LIST_FALSE=''
  336. TSS_BUILD_RSAKEY_LIST_TRUE=''
  337. TSS_BUILD_SEALX_FALSE=''
  338. TSS_BUILD_SEALX_TRUE=''
  339. TSS_BUILD_SEAL_FALSE=''
  340. TSS_BUILD_SEAL_TRUE=''
  341. TSS_BUILD_SELFTEST_FALSE=''
  342. TSS_BUILD_SELFTEST_TRUE=''
  343. TSS_BUILD_SIGN_FALSE=''
  344. TSS_BUILD_SIGN_TRUE=''
  345. TSS_BUILD_SYM_CRYPTO_FALSE=''
  346. TSS_BUILD_SYM_CRYPTO_TRUE=''
  347. TSS_BUILD_TICK_FALSE=''
  348. TSS_BUILD_TICK_TRUE=''
  349. TSS_BUILD_TRANSPORT_FALSE=''
  350. TSS_BUILD_TRANSPORT_TRUE=''
  351. TSS_BUILD_TSS12_FALSE=''
  352. TSS_BUILD_TSS12_TRUE=''
  353. VERSION='0.3.14'
  354. ac_ct_AR=''
  355. ac_ct_CC='gcc'
  356. ac_ct_DUMPBIN=''
  357. am__EXEEXT_FALSE=''
  358. am__EXEEXT_TRUE=''
  359. am__fastdepCC_FALSE=''
  360. am__fastdepCC_TRUE=''
  361. am__include='include'
  362. am__isrc=''
  363. am__leading_dot='.'
  364. am__nodep='_no'
  365. am__quote=''
  366. am__tar='$${TAR-tar} chof - "$$tardir"'
  367. am__untar='$${TAR-tar} xf -'
  368. bindir='${exec_prefix}/bin'
  369. build='x86_64-unknown-linux-gnu'
  370. build_alias=''
  371. build_cpu='x86_64'
  372. build_os='linux-gnu'
  373. build_vendor='unknown'
  374. datadir='${datarootdir}'
  375. datarootdir='${prefix}/share'
  376. docdir='${datarootdir}/doc/${PACKAGE_TARNAME}'
  377. dvidir='${docdir}'
  378. exec_prefix='NONE'
  379. host='x86_64-unknown-linux-gnu'
  380. host_alias=''
  381. host_cpu='x86_64'
  382. host_os='linux-gnu'
  383. host_vendor='unknown'
  384. htmldir='${docdir}'
  385. includedir='${prefix}/include'
  386. infodir='${datarootdir}/info'
  387. install_sh='${SHELL} /tmp/yaourt-tmp-blackout/aur-trousers/src/trousers-0.3.14/install-sh'
  388. libdir='/usr/lib'
  389. libexecdir='${exec_prefix}/libexec'
  390. localedir='${datarootdir}/locale'
  391. localstatedir='${prefix}/var'
  392. mandir='${datarootdir}/man'
  393. mkdir_p='$(MKDIR_P)'
  394. oldincludedir='/usr/include'
  395. pdfdir='${docdir}'
  396. prefix='/usr'
  397. program_transform_name='s,x,x,'
  398. psdir='${docdir}'
  399. sbindir='/usr/bin'
  400. sharedstatedir='${prefix}/com'
  401. sysconfdir='/etc'
  402. target='x86_64-unknown-linux-gnu'
  403. target_alias=''
  404. target_cpu='x86_64'
  405. target_os='linux-gnu'
  406. target_vendor='unknown'
  407.  
  408. ## ----------- ##
  409. ## confdefs.h. ##
  410. ## ----------- ##
  411.  
  412. /* confdefs.h */
  413. #define PACKAGE_NAME "trousers"
  414. #define PACKAGE_TARNAME "trousers"
  415. #define PACKAGE_VERSION "0.3.14"
  416. #define PACKAGE_STRING "trousers 0.3.14"
  417. #define PACKAGE_BUGREPORT "trousers-tech@lists.sf.net"
  418. #define PACKAGE_URL ""
  419. #define PACKAGE "trousers"
  420. #define VERSION "0.3.14"
  421.  
  422. configure: exit 77
Advertisement
RAW Paste Data Copied
Advertisement