Advertisement
Guest User

Mcreator thing

a guest
Jan 1st, 2022
59
Never
Not a member of Pastebin yet? Sign Up, it unlocks many cool features!
  1.  
  2. Executing Gradle task: runClient
  3. Build info: MCreator 2021.3.53117, forge-1.17.1, 64-bit, 16149 MB, Windows 10, JVM 16.0.2, JAVA_HOME: C:\Program Files\Pylo\MCreator\jdk
  4.  
  5. > Configure project :
  6. The code of this workspace uses official obfuscation mappings provided by Mojang. These mappings fall under their associated license you should be fully aware of.
  7. (c) 2020 Microsoft Corporation. These mappings are provided "as-is" and you bear the risk of using them. You may copy and use the mappings for development purposes,
  8. but you may not redistribute the mappings complete and unmodified. Microsoft makes no warranties, express or implied, with respect to the mappings provided here.
  9. Use and modification of this document or the source code (in any form) of Minecraft: Java Edition is governed by the Minecraft End User License Agreement available
  10. at https://account.mojang.com/documents/minecraft_eula.
  11.  
  12. > Task :compileJava UP-TO-DATE
  13. > Task :processResources UP-TO-DATE
  14. > Task :classes UP-TO-DATE
  15. > Task :downloadMcpConfig
  16. > Task :extractSrg UP-TO-DATE
  17. > Task :createSrgToMcp UP-TO-DATE
  18. > Task :downloadMCMeta UP-TO-DATE
  19. > Task :downloadAssets UP-TO-DATE
  20. > Task :extractNatives UP-TO-DATE
  21. > Task :makeSrcDirs
  22. > Task :prepareRuns
  23. > Task :prepareRunClient
  24. > Task :runClient FAILED
  25. 20:42.00 [main/INFO] [Launcher/MODLAUNCHER]: ModLauncher running: args [--launchTarget, forgeclientuserdev, --version, MOD_DEV, --assetIndex, 1.17, --assetsDir, C:\Users\Loganator\.mcreator\gradle\caches\forge_gradle\assets, --gameDir, ., --fml.forgeVersion, 37.1.1, --fml.mcVersion, 1.17.1, --fml.forgeGroup, net.minecraftforge, --fml.mcpVersion, 20210706.113038]
  26. 20:42.00 [main/INFO] [Launcher/MODLAUNCHER]: ModLauncher 9.0.17+9.0.17+main.3e5b8360 starting: java version 16.0.2 by Eclipse Foundation
  27. 20:42.00 [main/DEBUG] [LaunchServiceHandler/MODLAUNCHER]: Found launch services [fmlclientdev,forgeclient,minecraft,fmlserveruserdev,fmlclient,fmldatauserdev,forgeserverdev,forgeserveruserdev,forgeclientdev,forgeclientuserdev,forgeserver,forgedatadev,fmlserver,fmlclientuserdev,fmlserverdev,forgedatauserdev,testharness]
  28. 20:42.00 [main/DEBUG] [NameMappingServiceHandler/MODLAUNCHER]: Found naming services : [srgtomcp]
  29. 20:42.00 [main/DEBUG] [LaunchPluginHandler/MODLAUNCHER]: Found launch plugins: [mixin,eventbus,object_holder_definalize,runtime_enum_extender,capability_token_subclass,capability_inject_definalize,accesstransformer,runtimedistcleaner]
  30. Exception in thread "main" java.lang.NullPointerException: Cannot invoke "joptsimple.OptionSet.valueOf(joptsimple.OptionSpec)" because "this.optionSet" is null
  31. at MC-BOOTSTRAP/cpw.mods.modlauncher@9.0.17/cpw.mods.modlauncher.ArgumentHandler.lambda$setArgs$0(
  32. ArgumentHandler.java:46
  33. at MC-BOOTSTRAP/cpw.mods.modlauncher@9.0.17/cpw.mods.modlauncher.ArgumentHandler.lambda$setArgs$0(ArgumentHandler.java:46)
  34. at java.base/java.util.concurrent.ConcurrentHashMap.computeIfAbsent(
  35. ConcurrentHashMap.java:1708
  36. at java.base/java.util.concurrent.ConcurrentHashMap.computeIfAbsent(ConcurrentHashMap.java:1708)
  37. at MC-BOOTSTRAP/cpw.mods.modlauncher@9.0.17/cpw.mods.modlauncher.api.TypesafeMap.computeIfAbsent(
  38. TypesafeMap.java:52
  39. at MC-BOOTSTRAP/cpw.mods.modlauncher@9.0.17/cpw.mods.modlauncher.api.TypesafeMap.computeIfAbsent(TypesafeMap.java:52)
  40. at MC-BOOTSTRAP/cpw.mods.modlauncher@9.0.17/cpw.mods.modlauncher.api.TypesafeMap.computeIfAbsent(
  41. TypesafeMap.java:47
  42. at MC-BOOTSTRAP/cpw.mods.modlauncher@9.0.17/cpw.mods.modlauncher.api.TypesafeMap.computeIfAbsent(TypesafeMap.java:47)
  43. at MC-BOOTSTRAP/cpw.mods.modlauncher@9.0.17/cpw.mods.modlauncher.Environment.computePropertyIfAbsent(
  44. Environment.java:67
  45. at MC-BOOTSTRAP/cpw.mods.modlauncher@9.0.17/cpw.mods.modlauncher.Environment.computePropertyIfAbsent(Environment.java:67)
  46. at MC-BOOTSTRAP/cpw.mods.modlauncher@9.0.17/cpw.mods.modlauncher.ArgumentHandler.setArgs(
  47. ArgumentHandler.java:46
  48. at MC-BOOTSTRAP/cpw.mods.modlauncher@9.0.17/cpw.mods.modlauncher.ArgumentHandler.setArgs(ArgumentHandler.java:46)
  49. at MC-BOOTSTRAP/cpw.mods.modlauncher@9.0.17/cpw.mods.modlauncher.Launcher.run(
  50. Launcher.java:85
  51. at MC-BOOTSTRAP/cpw.mods.modlauncher@9.0.17/cpw.mods.modlauncher.Launcher.run(Launcher.java:85)
  52. at MC-BOOTSTRAP/cpw.mods.modlauncher@9.0.17/cpw.mods.modlauncher.Launcher.main(
  53. Launcher.java:77
  54. at MC-BOOTSTRAP/cpw.mods.modlauncher@9.0.17/cpw.mods.modlauncher.Launcher.main(Launcher.java:77)
  55. at MC-BOOTSTRAP/cpw.mods.modlauncher@9.0.17/cpw.mods.modlauncher.BootstrapLaunchConsumer.accept(
  56. BootstrapLaunchConsumer.java:26
  57. at MC-BOOTSTRAP/cpw.mods.modlauncher@9.0.17/cpw.mods.modlauncher.BootstrapLaunchConsumer.accept(BootstrapLaunchConsumer.java:26)
  58. at MC-BOOTSTRAP/cpw.mods.modlauncher@9.0.17/cpw.mods.modlauncher.BootstrapLaunchConsumer.accept(
  59. BootstrapLaunchConsumer.java:23
  60. at MC-BOOTSTRAP/cpw.mods.modlauncher@9.0.17/cpw.mods.modlauncher.BootstrapLaunchConsumer.accept(BootstrapLaunchConsumer.java:23)
  61. at cpw.mods.bootstraplauncher@0.1.17/cpw.mods.bootstraplauncher.BootstrapLauncher.main(
  62. BootstrapLauncher.java:90
  63. at cpw.mods.bootstraplauncher@0.1.17/cpw.mods.bootstraplauncher.BootstrapLauncher.main(BootstrapLauncher.java:90)
  64. FAILURE: Build failed with an exception.
  65. * What went wrong:
  66. Execution failed for task ':runClient'.
  67. > Process 'command 'C:\Program Files\Pylo\MCreator\jdk\bin\java.exe'' finished with non-zero exit value 1
  68. * Try:
  69. Run with --stacktrace option to get the stack trace. Run with --info or --debug option to get more log output. Run with --scan to get full insights.
  70. * Get more help at https://help.gradle.org
  71. BUILD FAILED in 2s
  72. 10 actionable tasks: 3 executed, 7 up-to-date
  73.  
  74. BUILD FAILED
  75. Task completed in 2 seconds
Advertisement
RAW Paste Data Copied
Advertisement