daily pastebin goal
1%
SHARE
TWEET

Untitled

a guest Jun 23rd, 2016 128 Never
Not a member of Pastebin yet? Sign Up, it unlocks many cool features!
  1. [phollux@Charon:Archer_T2UH_V1_150909/Driver]$ sudo make
  2. [sudo] Passwort für phollux:
  3. make -C UTIL/ osutil
  4. make[1]: Verzeichnis „/home/phollux/Code/Archer_T2UH_V1_150909/Driver/UTIL“ wird betreten
  5. cp -f os/linux/Makefile.6.util /home/phollux/Code/Archer_T2UH_V1_150909/Driver/UTIL/os/linux/Makefile
  6. make -C /lib/modules/4.5.7-300.fc24.x86_64/build SUBDIRS=/home/phollux/Code/Archer_T2UH_V1_150909/Driver/UTIL/os/linux modules
  7. make[2]: Verzeichnis „/usr/src/kernels/4.5.7-300.fc24.x86_64“ wird betreten
  8.   CC [M]  /home/phollux/Code/Archer_T2UH_V1_150909/Driver/UTIL/os/linux/../../common/rt_os_util.o
  9.   CC [M]  /home/phollux/Code/Archer_T2UH_V1_150909/Driver/UTIL/os/linux/../../os/linux/rt_linux_symb.o
  10.   CC [M]  /home/phollux/Code/Archer_T2UH_V1_150909/Driver/UTIL/os/linux/../../os/linux/rt_rbus_pci_util.o
  11.   CC [M]  /home/phollux/Code/Archer_T2UH_V1_150909/Driver/UTIL/os/linux/../../os/linux/rt_usb_util.o
  12. /home/phollux/Code/Archer_T2UH_V1_150909/Driver/UTIL/os/linux/../../os/linux/rt_usb_util.c: In Funktion »rausb_fill_bulk_urb«:
  13. /home/phollux/Code/Archer_T2UH_V1_150909/Driver/UTIL/os/linux/../../os/linux/rt_usb_util.c:425:68: Warnung: Übergabe des Arguments 6 von »usb_fill_bulk_urb« von inkompatiblem Zeigertyp [-Wincompatible-pointer-types]
  14.   usb_fill_bulk_urb(urb, dev, pipe, transfer_buffer, buffer_length, complete_fn, context);
  15.                                                                     ^~~~~~~~~~~
  16. In file included from /home/phollux/Code/Archer_T2UH_V1_150909/Driver/UTIL/include/os/rt_linux.h:40:0,
  17.                  from /home/phollux/Code/Archer_T2UH_V1_150909/Driver/UTIL/include/rtmp_os.h:48,
  18.                  from /home/phollux/Code/Archer_T2UH_V1_150909/Driver/UTIL/include/rtmp_comm.h:62,
  19.                  from /home/phollux/Code/Archer_T2UH_V1_150909/Driver/UTIL/os/linux/../../os/linux/rt_usb_util.c:18:
  20. include/linux/usb.h:1538:20: Anmerkung: »usb_complete_t {aka void (*)(struct urb *)}« erwartet, aber Argument hat Typ »USB_COMPLETE_HANDLER {aka void (*)(void *)}«
  21.  static inline void usb_fill_bulk_urb(struct urb *urb,
  22.                     ^~~~~~~~~~~~~~~~~
  23.   CC [M]  /home/phollux/Code/Archer_T2UH_V1_150909/Driver/UTIL/os/linux/../../os/linux/rt_linux.o
  24. /home/phollux/Code/Archer_T2UH_V1_150909/Driver/UTIL/os/linux/../../os/linux/rt_linux.c: In Funktion »RtmpOsUsDelay«:
  25. /home/phollux/Code/Archer_T2UH_V1_150909/Driver/UTIL/os/linux/../../os/linux/rt_linux.c:179:8: Warnung: Variable »i« wird nicht verwendet [-Wunused-variable]
  26.   ULONG i;
  27.         ^
  28. /home/phollux/Code/Archer_T2UH_V1_150909/Driver/UTIL/os/linux/../../os/linux/rt_linux.c: In Funktion »ClonePacket«:
  29. /home/phollux/Code/Archer_T2UH_V1_150909/Driver/UTIL/os/linux/../../os/linux/rt_linux.c:664:20: Warnung: Zuweisung erzeugt Ganzzahl von Zeiger ohne Typkonvertierung [-Wint-conversion]
  30.    pClonedPkt->tail = pClonedPkt->data + pClonedPkt->len;
  31.                     ^
  32. In file included from /home/phollux/Code/Archer_T2UH_V1_150909/Driver/UTIL/include/rtmp_os.h:48:0,
  33.                  from /home/phollux/Code/Archer_T2UH_V1_150909/Driver/UTIL/include/rtmp_comm.h:62,
  34.                  from /home/phollux/Code/Archer_T2UH_V1_150909/Driver/UTIL/os/linux/../../os/linux/rt_linux.c:34:
  35. /home/phollux/Code/Archer_T2UH_V1_150909/Driver/UTIL/os/linux/../../os/linux/rt_linux.c: In Funktion »RtmpOsPktInit«:
  36. /home/phollux/Code/Archer_T2UH_V1_150909/Driver/UTIL/include/os/rt_linux.h:893:34: Warnung: Zuweisung erzeugt Ganzzahl von Zeiger ohne Typkonvertierung [-Wint-conversion]
  37.    ((RTPKT_TO_OSPKT(_pkt))->tail) = (PUCHAR)((_start) + (_len))
  38.                                   ^
  39. /home/phollux/Code/Archer_T2UH_V1_150909/Driver/UTIL/os/linux/../../os/linux/rt_linux.c:683:2: Anmerkung: bei Substitution des Makros »SET_OS_PKT_DATATAIL«
  40.   SET_OS_PKT_DATATAIL(pRxPkt, pData, DataSize);
  41.   ^~~~~~~~~~~~~~~~~~~
  42. /home/phollux/Code/Archer_T2UH_V1_150909/Driver/UTIL/os/linux/../../os/linux/rt_linux.c: In Funktion »wlan_802_11_to_802_3_packet«:
  43. /home/phollux/Code/Archer_T2UH_V1_150909/Driver/UTIL/os/linux/../../os/linux/rt_linux.c:709:15: Warnung: Zuweisung erzeugt Ganzzahl von Zeiger ohne Typkonvertierung [-Wint-conversion]
  44.   pOSPkt->tail = pOSPkt->data + pOSPkt->len;
  45.                ^
  46. /home/phollux/Code/Archer_T2UH_V1_150909/Driver/UTIL/os/linux/../../os/linux/rt_linux.c: In Funktion »RtmpDrvAllRFPrint«:
  47. /home/phollux/Code/Archer_T2UH_V1_150909/Driver/UTIL/os/linux/../../os/linux/rt_linux.c:2051:32: Warnung: Übergabe des Arguments 2 von »file_w->f_op->write« von inkompatiblem Zeigertyp [-Wincompatible-pointer-types]
  48.     file_w->f_op->write(file_w, pBuf, BufLen, &file_w->f_pos);
  49.                                 ^~~~
  50. /home/phollux/Code/Archer_T2UH_V1_150909/Driver/UTIL/os/linux/../../os/linux/rt_linux.c:2051:32: Anmerkung: »const char *« erwartet, aber Argument hat Typ »UINT32 * {aka unsigned int *}«
  51. /home/phollux/Code/Archer_T2UH_V1_150909/Driver/UTIL/os/linux/../../os/linux/rt_linux.c:2036:22: Warnung: Variable »macValue« wird nicht verwendet [-Wunused-variable]
  52.   UINT32 macAddr = 0, macValue = 0;
  53.                       ^~~~~~~~
  54. /home/phollux/Code/Archer_T2UH_V1_150909/Driver/UTIL/os/linux/../../os/linux/rt_linux.c:2036:9: Warnung: Variable »macAddr« wird nicht verwendet [-Wunused-variable]
  55.   UINT32 macAddr = 0, macValue = 0;
  56.          ^~~~~~~
  57. /home/phollux/Code/Archer_T2UH_V1_150909/Driver/UTIL/os/linux/../../os/linux/rt_linux.c: In Funktion »RtmpOSIRQRelease«:
  58. /home/phollux/Code/Archer_T2UH_V1_150909/Driver/UTIL/os/linux/../../os/linux/rt_linux.c:2172:21: Warnung: Variable »net_dev« wird nicht verwendet [-Wunused-variable]
  59.   struct net_device *net_dev = (struct net_device *)pNetDev;
  60.                      ^~~~~~~
  61. /home/phollux/Code/Archer_T2UH_V1_150909/Driver/UTIL/os/linux/../../os/linux/rt_linux.c: In Funktion »RtmpOsFreeSpinLock«:
  62. /home/phollux/Code/Archer_T2UH_V1_150909/Driver/UTIL/os/linux/../../os/linux/rt_linux.c:4266:8: Warnung: Zuweisung von inkompatiblem Zeigertyp [-Wincompatible-pointer-types]
  63.   pLock = (OS_NDIS_MINIPORT_TIMER *) (pLockOrg->pContent);
  64.         ^
  65. In file included from /home/phollux/Code/Archer_T2UH_V1_150909/Driver/UTIL/include/rtmp_os.h:48:0,
  66.                  from /home/phollux/Code/Archer_T2UH_V1_150909/Driver/UTIL/include/rtmp_comm.h:62,
  67.                  from /home/phollux/Code/Archer_T2UH_V1_150909/Driver/UTIL/os/linux/../../os/linux/rt_linux.c:34:
  68. /home/phollux/Code/Archer_T2UH_V1_150909/Driver/UTIL/os/linux/../../os/linux/rt_linux.c: In Funktion »RtmpOsPktTailAdjust«:
  69. /home/phollux/Code/Archer_T2UH_V1_150909/Driver/UTIL/include/os/rt_linux.h:893:36: Warnung: Typkonvertierung in Zeiger von Ganzzahl anderer Breite [-Wint-to-pointer-cast]
  70.    ((RTPKT_TO_OSPKT(_pkt))->tail) = (PUCHAR)((_start) + (_len))
  71.                                     ^
  72. /home/phollux/Code/Archer_T2UH_V1_150909/Driver/UTIL/include/os/rt_linux.h:917:2: Anmerkung: bei Substitution des Makros »SET_OS_PKT_DATATAIL«
  73.   SET_OS_PKT_DATATAIL(_pkt, GET_OS_PKT_DATATAIL(_pkt), (-_removedTagLen)); \
  74.   ^~~~~~~~~~~~~~~~~~~
  75. /home/phollux/Code/Archer_T2UH_V1_150909/Driver/UTIL/os/linux/../../os/linux/rt_linux.c:5200:2: Anmerkung: bei Substitution des Makros »OS_PKT_TAIL_ADJUST«
  76.   OS_PKT_TAIL_ADJUST(pNetPkt, removedTagLen);
  77.   ^~~~~~~~~~~~~~~~~~
  78. /home/phollux/Code/Archer_T2UH_V1_150909/Driver/UTIL/include/os/rt_linux.h:893:34: Warnung: Zuweisung erzeugt Ganzzahl von Zeiger ohne Typkonvertierung [-Wint-conversion]
  79.    ((RTPKT_TO_OSPKT(_pkt))->tail) = (PUCHAR)((_start) + (_len))
  80.                                   ^
  81. /home/phollux/Code/Archer_T2UH_V1_150909/Driver/UTIL/include/os/rt_linux.h:917:2: Anmerkung: bei Substitution des Makros »SET_OS_PKT_DATATAIL«
  82.   SET_OS_PKT_DATATAIL(_pkt, GET_OS_PKT_DATATAIL(_pkt), (-_removedTagLen)); \
  83.   ^~~~~~~~~~~~~~~~~~~
  84. /home/phollux/Code/Archer_T2UH_V1_150909/Driver/UTIL/os/linux/../../os/linux/rt_linux.c:5200:2: Anmerkung: bei Substitution des Makros »OS_PKT_TAIL_ADJUST«
  85.   OS_PKT_TAIL_ADJUST(pNetPkt, removedTagLen);
  86.   ^~~~~~~~~~~~~~~~~~
  87.   LD [M]  /home/phollux/Code/Archer_T2UH_V1_150909/Driver/UTIL/os/linux/mt7650u_sta_util.o
  88.   Building modules, stage 2.
  89.   MODPOST 1 modules
  90.   CC      /home/phollux/Code/Archer_T2UH_V1_150909/Driver/UTIL/os/linux/mt7650u_sta_util.mod.o
  91.   LD [M]  /home/phollux/Code/Archer_T2UH_V1_150909/Driver/UTIL/os/linux/mt7650u_sta_util.ko
  92. make[2]: Verzeichnis „/usr/src/kernels/4.5.7-300.fc24.x86_64“ wird verlassen
  93. make[1]: Verzeichnis „/home/phollux/Code/Archer_T2UH_V1_150909/Driver/UTIL“ wird verlassen
  94. /bin/sh cp_util.sh
  95.  
  96. make -C MODULE/ build_tools
  97. make[1]: Verzeichnis „/home/phollux/Code/Archer_T2UH_V1_150909/Driver/MODULE“ wird betreten
  98. make -C tools
  99. make[2]: Verzeichnis „/home/phollux/Code/Archer_T2UH_V1_150909/Driver/MODULE/tools“ wird betreten
  100. gcc -g bin2h.c -o bin2h
  101. make[2]: Verzeichnis „/home/phollux/Code/Archer_T2UH_V1_150909/Driver/MODULE/tools“ wird verlassen
  102. /home/phollux/Code/Archer_T2UH_V1_150909/Driver/MODULE/tools/bin2h
  103. chipset = mt7650u
  104. chipset = mt7630u
  105. chipset = mt7610u
  106. make[1]: Verzeichnis „/home/phollux/Code/Archer_T2UH_V1_150909/Driver/MODULE“ wird verlassen
  107. make -C MODULE/ osdrv
  108. make[1]: Verzeichnis „/home/phollux/Code/Archer_T2UH_V1_150909/Driver/MODULE“ wird betreten
  109. cp -f os/linux/Makefile.6 /home/phollux/Code/Archer_T2UH_V1_150909/Driver/MODULE/os/linux/Makefile
  110. make -C /lib/modules/4.5.7-300.fc24.x86_64/build SUBDIRS=/home/phollux/Code/Archer_T2UH_V1_150909/Driver/MODULE/os/linux modules
  111. make[2]: Verzeichnis „/usr/src/kernels/4.5.7-300.fc24.x86_64“ wird betreten
  112.   CC [M]  /home/phollux/Code/Archer_T2UH_V1_150909/Driver/MODULE/os/linux/../../os/linux/rt_profile.o
  113. /home/phollux/Code/Archer_T2UH_V1_150909/Driver/MODULE/os/linux/../../os/linux/rt_profile.c: In Funktion »announce_802_3_packet«:
  114. /home/phollux/Code/Archer_T2UH_V1_150909/Driver/MODULE/os/linux/../../os/linux/rt_profile.c:397:16: Warnung: Variable »pAd« wird nicht verwendet [-Wunused-variable]
  115.   RTMP_ADAPTER *pAd = (RTMP_ADAPTER *)pAdSrc;
  116.                 ^~~
  117.   CC [M]  /home/phollux/Code/Archer_T2UH_V1_150909/Driver/MODULE/os/linux/../../sta/assoc.o
  118.   CC [M]  /home/phollux/Code/Archer_T2UH_V1_150909/Driver/MODULE/os/linux/../../sta/auth.o
  119.   CC [M]  /home/phollux/Code/Archer_T2UH_V1_150909/Driver/MODULE/os/linux/../../sta/auth_rsp.o
  120.   CC [M]  /home/phollux/Code/Archer_T2UH_V1_150909/Driver/MODULE/os/linux/../../sta/sync.o
  121.   CC [M]  /home/phollux/Code/Archer_T2UH_V1_150909/Driver/MODULE/os/linux/../../sta/sanity.o
  122.   CC [M]  /home/phollux/Code/Archer_T2UH_V1_150909/Driver/MODULE/os/linux/../../sta/rtmp_data.o
  123.   CC [M]  /home/phollux/Code/Archer_T2UH_V1_150909/Driver/MODULE/os/linux/../../sta/connect.o
  124.   CC [M]  /home/phollux/Code/Archer_T2UH_V1_150909/Driver/MODULE/os/linux/../../sta/wpa.o
  125.   CC [M]  /home/phollux/Code/Archer_T2UH_V1_150909/Driver/MODULE/os/linux/../../sta/sta_cfg.o
  126. /home/phollux/Code/Archer_T2UH_V1_150909/Driver/MODULE/os/linux/../../sta/sta_cfg.c: In Funktion »Set_EncrypType_Proc«:
  127. /home/phollux/Code/Archer_T2UH_V1_150909/Driver/MODULE/os/linux/../../sta/sta_cfg.c:910:5: Warnung: this »else« clause does not guard... [-Wmisleading-indentation]
  128.      else
  129.      ^~~~
  130. /home/phollux/Code/Archer_T2UH_V1_150909/Driver/MODULE/os/linux/../../sta/sta_cfg.c:913:2: Anmerkung: ...this statement, but the latter is misleadingly indented as if it is guarded by the »else«
  131.   if (pAd->StaCfg.BssType == BSS_ADHOC)
  132.   ^~
  133. /home/phollux/Code/Archer_T2UH_V1_150909/Driver/MODULE/os/linux/../../sta/sta_cfg.c: In Funktion »RTMPIoctlShow«:
  134. /home/phollux/Code/Archer_T2UH_V1_150909/Driver/MODULE/os/linux/../../sta/sta_cfg.c:7053:85: Fehler: Das Makro »__DATE__« könnte reproduzierbare Builds verhindern [-Werror=date-time]
  135.              snprintf(extra, size, "Driver version-%s, %s %s\n", STA_DRIVER_VERSION, __DATE__, __TIME__ );
  136.                                                                                      ^~~~~~~~
  137. /home/phollux/Code/Archer_T2UH_V1_150909/Driver/MODULE/os/linux/../../sta/sta_cfg.c:7053:95: Fehler: Das Makro »__TIME__« könnte reproduzierbare Builds verhindern [-Werror=date-time]
  138.              snprintf(extra, size, "Driver version-%s, %s %s\n", STA_DRIVER_VERSION, __DATE__, __TIME__ );
  139.                                                                                                ^~~~~~~~
  140. /home/phollux/Code/Archer_T2UH_V1_150909/Driver/MODULE/os/linux/../../sta/sta_cfg.c: In Funktion »RtmpIoctl_rt_ioctl_siwfreq«:
  141. /home/phollux/Code/Archer_T2UH_V1_150909/Driver/MODULE/os/linux/../../sta/sta_cfg.c:7307:5: Warnung: this »else« clause does not guard... [-Wmisleading-indentation]
  142.      else
  143.      ^~~~
  144. /home/phollux/Code/Archer_T2UH_V1_150909/Driver/MODULE/os/linux/../../sta/sta_cfg.c:7310:2: Anmerkung: ...this statement, but the latter is misleadingly indented as if it is guarded by the »else«
  145.   return NDIS_STATUS_SUCCESS;
  146.   ^~~~~~
  147. /home/phollux/Code/Archer_T2UH_V1_150909/Driver/MODULE/os/linux/../../sta/sta_cfg.c: In Funktion »RtmpIoctl_rt_ioctl_giwrate«:
  148. /home/phollux/Code/Archer_T2UH_V1_150909/Driver/MODULE/os/linux/../../sta/sta_cfg.c:9178:5: Warnung: this »if« clause does not guard... [-Wmisleading-indentation]
  149.      if (rate_index >= rate_count)
  150.      ^~
  151. /home/phollux/Code/Archer_T2UH_V1_150909/Driver/MODULE/os/linux/../../sta/sta_cfg.c:9181:2: Anmerkung: ...this statement, but the latter is misleadingly indented as if it is guarded by the »if«
  152.   *(ULONG *)pData = ralinkrate[rate_index] * 500000;
  153.   ^
  154. /home/phollux/Code/Archer_T2UH_V1_150909/Driver/MODULE/os/linux/../../sta/sta_cfg.c: In Funktion »RtmpIoctl_rt_private_get_statistics«:
  155. /home/phollux/Code/Archer_T2UH_V1_150909/Driver/MODULE/os/linux/../../sta/sta_cfg.c:9737:17: Warnung: Variable »fec_coding« wird nicht verwendet [-Wunused-variable]
  156.     static char *fec_coding[2] = {"bcc", "ldpc"};
  157.                  ^~~~~~~~~~
  158. Auf höchster Ebene:
  159. /home/phollux/Code/Archer_T2UH_V1_150909/Driver/MODULE/os/linux/../../sta/sta_cfg.c:9737:17: Warnung: »fec_coding« defined but not used [-Wunused-variable]
  160. cc1: Einige Warnungen werden als Fehler behandelt
  161. scripts/Makefile.build:258: die Regel für Ziel „/home/phollux/Code/Archer_T2UH_V1_150909/Driver/MODULE/os/linux/../../sta/sta_cfg.o“ scheiterte
  162. make[3]: *** [/home/phollux/Code/Archer_T2UH_V1_150909/Driver/MODULE/os/linux/../../sta/sta_cfg.o] Fehler 1
  163. Makefile:1396: die Regel für Ziel „_module_/home/phollux/Code/Archer_T2UH_V1_150909/Driver/MODULE/os/linux“ scheiterte
  164. make[2]: *** [_module_/home/phollux/Code/Archer_T2UH_V1_150909/Driver/MODULE/os/linux] Fehler 2
  165. make[2]: Verzeichnis „/usr/src/kernels/4.5.7-300.fc24.x86_64“ wird verlassen
  166. Makefile:548: die Regel für Ziel „osdrv“ scheiterte
  167. make[1]: *** [osdrv] Fehler 2
  168. make[1]: Verzeichnis „/home/phollux/Code/Archer_T2UH_V1_150909/Driver/MODULE“ wird verlassen
  169. Makefile:3: die Regel für Ziel „all“ scheiterte
  170. make: *** [all] Fehler 2
RAW Paste Data
Top