SHARE
TWEET

Untitled

a guest Apr 22nd, 2019 85 Never
Not a member of Pastebin yet? Sign Up, it unlocks many cool features!
  1.   CC      drivers/usb/gadget_brcm/dwc_otg_hcd_intr.o
  2.  6089 In file included from include/linux/vt_buffer.h:18:0,
  3.  6090                  from include/linux/selection.h:11,
  4.  6091                  from drivers/video/console/vgacon.c:45:
  5.  6092 drivers/video/console/vgacon.c: In function 'vgacon_startup':
  6.  6093 /home/pmos/build/src/android_kernel_samsung_bcm21553-common-b35d0c2458d89dc2f177969a7fcb16a03cde6eee/arch/arm/include/asm/vga.h:7:27: error: 'PCIMEM_BASE' undeclared (first use in this function)
  7.  6094  #define VGA_MAP_MEM(x,s) (PCIMEM_BASE + (x))
  8.  6095                            ^
  9.  6096 drivers/video/console/vgacon.c:508:18: note: in expansion of macro 'VGA_MAP_MEM'
  10.  6097   vga_vram_base = VGA_MAP_MEM(vga_vram_base, vga_vram_size);
  11.  6098                   ^
  12.  6099 /home/pmos/build/src/android_kernel_samsung_bcm21553-common-b35d0c2458d89dc2f177969a7fcb16a03cde6eee/arch/arm/include/asm/vga.h:7:27: note: each undeclared identifier is reported only once for each functio
  13.       n it appears in
  14.  6100  #define VGA_MAP_MEM(x,s) (PCIMEM_BASE + (x))
  15.  6101                            ^
  16.  6102 drivers/video/console/vgacon.c:508:18: note: in expansion of macro 'VGA_MAP_MEM'
  17.  6103   vga_vram_base = VGA_MAP_MEM(vga_vram_base, vga_vram_size);
  18.  6104                   ^
  19.  6105 drivers/video/console/vgacon.c: In function 'vgacon_do_font_op':
  20.  6106 /home/pmos/build/src/android_kernel_samsung_bcm21553-common-b35d0c2458d89dc2f177969a7fcb16a03cde6eee/arch/arm/include/asm/vga.h:7:27: error: 'PCIMEM_BASE' undeclared (first use in this function)
  21.  6107  #define VGA_MAP_MEM(x,s) (PCIMEM_BASE + (x))
  22.  6108                            ^
  23.  6109 drivers/video/console/vgacon.c:1073:22: note: in expansion of macro 'VGA_MAP_MEM'
  24.  6110    charmap = (char *) VGA_MAP_MEM(colourmap, 0);
  25.  6111                       ^
  26.  6112 make[3]: *** [scripts/Makefile.build:231: drivers/video/console/vgacon.o] Error 1
  27.  6113 make[2]: *** [scripts/Makefile.build:366: drivers/video/console] Error 2
RAW Paste Data
We use cookies for various purposes including analytics. By continuing to use Pastebin, you agree to our use of cookies as described in the Cookies Policy. OK, I Understand
 
Top