Advertisement
Not a member of Pastebin yet?
Sign Up,
it unlocks many cool features!
- Log LOCAL
- warning: (arm64) /Users/ahmedharmouche/Library/Developer/Xcode/DerivedData/Exponent-arcxwmfndgfebtajwluwihfuvqtj/Build/Products/Debug-iphoneos/Expo Go.app/Expo Go empty dSYM file detected, dSYM was created with an executable with no debug info.
- 11.3.0 - [FirebaseCore][I-COR000008] The project's Bundle ID is inconsistent with either the Bundle ID in 'GoogleService-Info.plist', or the Bundle ID in the options if you are using a customized options. To ensure that everything can be configured correctly, you may need to make the Bundle IDs consistent. To continue with this plist file, you may change your app's bundle identifier to 'host.exp.Exponent'. Or you can download a new configuration file that matches your bundle identifier from https://console.firebase.google.com/ and replace the current one.
- 11.3.0 - [FirebaseAnalytics][I-ACS023007] Analytics v.11.3.0 started
- 11.3.0 - [FirebaseAnalytics][I-ACS023008] To enable debug logging set the following application argument: -FIRAnalyticsDebugEnabled (see http://goo.gl/RfcP7r)
- [Firebase/Crashlytics] Version 11.3.0
- Expo iOS Runtime Version 2.32.10
- 🟢 {"timestamp":1740643929000,"level":"info","code":"None","message":"Deleted assets and updates from SQLite in 35.09998321533203 ms"}
- 🟢 {"level":"info","timestamp":1740643929000,"message":"Deleted 0 assets from disk in 0.009059906005859375 ms","code":"None"}
- 🟢 {"level":"info","timestamp":1740643929000,"message":"Retried deleting assets from disk in -0.0 ms","code":"None"}
- 🟢 Registering module 'ExpoGo'
- 🟢 Registering module 'ExpoUpdates'
- nw_socket_handle_socket_event [C4.1.1:2] Socket SO_ERROR [61: Connection refused]
- nw_endpoint_flow_failed_with_error [C4.1.1 ::1.8081 in_progress socket-flow (satisfied (Path is satisfied), viable, interface: lo0)] already failing, returning
- nw_socket_handle_socket_event [C4.1.2:2] Socket SO_ERROR [61: Connection refused]
- nw_endpoint_flow_failed_with_error [C4.1.2 127.0.0.1:8081 in_progress socket-flow (satisfied (Path is satisfied), viable, interface: lo0)] already failing, returning
- nw_endpoint_flow_failed_with_error [C4.1.2 127.0.0.1:8081 cancelled socket-flow ((null))] already failing, returning
- Connection 4: received failure notification
- Connection 4: failed to connect 1:61, reason -1
- Connection 4: encountered error(1:61)
- Task <775D8205-8A89-466B-BE5C-D211CDE85013>.<1> HTTP load failed, 0/0 bytes (error code: -1004 [1:61])
- Task <775D8205-8A89-466B-BE5C-D211CDE85013>.<1> finished with error [-1004] Error Domain=NSURLErrorDomain Code=-1004 "Could not connect to the server." UserInfo={_kCFStreamErrorCodeKey=61, NSUnderlyingError=0x3002b75d0 {Error Domain=kCFErrorDomainCFNetwork Code=-1004 "(null)" UserInfo={_NSURLErrorNWPathKey=satisfied (Path is satisfied), interface: lo0, _kCFStreamErrorCodeKey=61, _kCFStreamErrorDomainKey=1}}, _NSURLErrorFailingURLSessionTaskErrorKey=LocalDataTask <775D8205-8A89-466B-BE5C-D211CDE85013>.<1>, _NSURLErrorRelatedURLSessionTaskErrorKey=(
- "LocalDataTask <775D8205-8A89-466B-BE5C-D211CDE85013>.<1>"
- ), NSLocalizedDescription=Could not connect to the server., NSErrorFailingURLStringKey=http://localhost:8081/status, NSErrorFailingURLKey=http://localhost:8081/status, _kCFStreamErrorDomainKey=1}
- nw_socket_handle_socket_event [C5.1.1:1] Socket SO_ERROR [61: Connection refused]
- nw_endpoint_flow_failed_with_error [C5.1.1 ::1.8081 in_progress socket-flow (satisfied (Path is satisfied), viable, interface: lo0)] already failing, returning
- nw_socket_handle_socket_event [C5.1.2:1] Socket SO_ERROR [61: Connection refused]
- nw_endpoint_flow_failed_with_error [C5.1.2 127.0.0.1:8081 in_progress socket-flow (satisfied (Path is satisfied), viable, interface: lo0)] already failing, returning
- nw_endpoint_flow_failed_with_error [C5.1.2 127.0.0.1:8081 cancelled socket-flow ((null))] already failing, returning
- nw_connection_get_connected_socket_block_invoke [C5] Client called nw_connection_get_connected_socket on unconnected nw_connection
- TCP Conn 0x303dc2d00 Failed : error 0:61 [61]
- 11.3.0 - [FirebaseCrashlytics][I-CLS000000] Failed to download settings. If this is your first time launching the app, make sure you have enabled Crashlytics in the Firebase Console. Error Domain=FIRCLSNetworkError Code=-5 "(null)" UserInfo={status_code=404, type=2, request_id=, content_type=text/html; charset=utf-8}
- 11.3.0 - [FirebaseAnalytics][I-ACS800023] No pending snapshot to activate. SDK name: app_measurement
- 11.3.0 - [FirebaseAnalytics][I-ACS023012] Analytics collection enabled
- 11.3.0 - [FirebaseAnalytics][I-ACS023220] Analytics screen reporting is enabled. Call Analytics.logEvent(AnalyticsEventScreenView, parameters: [...]) to log a screen view event. To disable automatic screen reporting, set the flag FirebaseAutomaticScreenReportingEnabled to NO (boolean) in the Info.plist
- 11.3.0 - [FirebaseInstallations][I-FIS002003] Firebase Installation registration failed for app with name: __FIRAPP_DEFAULT, error:
- The server responded with an error:
- - URL: https://firebaseinstallations.googleapis.com/v1/projects/999999999999/installations/
- - HTTP status code: 400
- - Response body: {
- "error": {
- "code": 400,
- "message": "API key not valid. Please pass a valid API key.",
- "status": "INVALID_ARGUMENT",
- "details": [
- {
- "@type": "type.googleapis.com/google.rpc.ErrorInfo",
- "reason": "API_KEY_INVALID",
- "domain": "googleapis.com",
- "metadata": {
- "service": "firebaseinstallations.googleapis.com"
- }
- },
- {
- "@type": "type.googleapis.com/google.rpc.LocalizedMessage",
- "locale": "en-US",
- "message": "API key not valid. Please pass a valid API key."
- }
- ]
- }
- }
- Please make sure you use valid GoogleService-Info.plist
- 11.3.0 - [FirebaseSessions][I-SES000000] [Settings] Fetching newest settings failed with error: JSONParseError("Failed to parse JSON to dictionary")
- 11.3.0 - [FirebaseAnalytics][I-ACS023130] Configuration not found. Using default configuration
- WARNING: Logging before InitGoogleLogging() is written to STDERR
- W0227 09:14:37.968544 4264973504 InspectorPackagerConnection.cpp:235] Couldn't connect to packager, will silently retry
- nw_path_necp_check_for_updates Failed to copy updated result (22)
- nw_socket_handle_socket_event [C20:1] Socket SO_ERROR [61: Connection refused]
- nw_endpoint_flow_failed_with_error [C20 192.168.1.159:80 in_progress socket-flow (satisfied (Path is satisfied), viable, interface: en0[802.11], ipv4, ipv6, dns, uses wifi)] already failing, returning
- nw_connection_get_connected_socket_block_invoke [C20] Client called nw_connection_get_connected_socket on unconnected nw_connection
- TCP Conn 0x303d5bb60 Failed : error 0:61 [61]
- nw_connection_copy_connected_local_endpoint_block_invoke [C20] Client called nw_connection_copy_connected_local_endpoint on unconnected nw_connection
- nw_connection_copy_connected_remote_endpoint_block_invoke [C20] Client called nw_connection_copy_connected_remote_endpoint on unconnected nw_connection
- nw_socket_handle_socket_event [C21:1] Socket SO_ERROR [61: Connection refused]
- nw_socket_handle_socket_event [C22:1] Socket SO_ERROR [61: Connection refused]
- nw_endpoint_flow_failed_with_error [C21 192.168.1.159:80 in_progress socket-flow (satisfied (Path is satisfied), viable, interface: en0[802.11], ipv4, ipv6, dns, uses wifi)] already failing, returning
- nw_endpoint_flow_failed_with_error [C22 192.168.1.159:80 in_progress socket-flow (satisfied (Path is satisfied), viable, interface: en0[802.11], ipv4, ipv6, dns, uses wifi)] already failing, returning
- nw_connection_get_connected_socket_block_invoke [C21] Client called nw_connection_get_connected_socket on unconnected nw_connection
- TCP Conn 0x303d5b840 Failed : error 0:61 [61]
- nw_connection_get_connected_socket_block_invoke [C22] Client called nw_connection_get_connected_socket on unconnected nw_connection
- TCP Conn 0x303d5bd40 Failed : error 0:61 [61]
- nw_connection_copy_connected_local_endpoint_block_invoke [C21] Client called nw_connection_copy_connected_local_endpoint on unconnected nw_connection
- nw_connection_copy_connected_remote_endpoint_block_invoke [C21] Client called nw_connection_copy_connected_remote_endpoint on unconnected nw_connection
- nw_connection_copy_connected_local_endpoint_block_invoke [C22] Client called nw_connection_copy_connected_local_endpoint on unconnected nw_connection
- nw_connection_copy_connected_remote_endpoint_block_invoke [C22] Client called nw_connection_copy_connected_remote_endpoint on unconnected nw_connection
- nw_path_necp_check_for_updates Failed to copy updated result (22)
- nw_socket_handle_socket_event [C23:1] Socket SO_ERROR [61: Connection refused]
- nw_socket_handle_socket_event [C24:1] Socket SO_ERROR [61: Connection refused]
- nw_endpoint_flow_failed_with_error [C23 192.168.1.159:80 in_progress socket-flow (satisfied (Path is satisfied), viable, interface: en0[802.11], ipv4, ipv6, dns, uses wifi)] already failing, returning
- nw_endpoint_flow_failed_with_error [C24 192.168.1.159:80 in_progress socket-flow (satisfied (Path is satisfied), viable, interface: en0[802.11], ipv4, ipv6, dns, uses wifi)] already failing, returning
- nw_connection_get_connected_socket_block_invoke [C23] Client called nw_connection_get_connected_socket on unconnected nw_connection
- TCP Conn 0x303df92c0 Failed : error 0:61 [61]
- nw_connection_get_connected_socket_block_invoke [C24] Client called nw_connection_get_connected_socket on unconnected nw_connection
- TCP Conn 0x303d5bd40 Failed : error 0:61 [61]
- nw_connection_copy_connected_local_endpoint_block_invoke [C23] Client called nw_connection_copy_connected_local_endpoint on unconnected nw_connection
- nw_connection_copy_connected_remote_endpoint_block_invoke [C23] Client called nw_connection_copy_connected_remote_endpoint on unconnected nw_connection
- nw_connection_copy_connected_local_endpoint_block_invoke [C24] Client called nw_connection_copy_connected_local_endpoint on unconnected nw_connection
- nw_connection_copy_connected_remote_endpoint_block_invoke [C24] Client called nw_connection_copy_connected_remote_endpoint on unconnected nw_connection
- Message from debugger: killed
Advertisement
Add Comment
Please, Sign In to add comment
Advertisement