Guest User

Untitled

a guest
Jan 24th, 2018
233
Never
Not a member of Pastebin yet? Sign Up, it unlocks many cool features!
  1. FAILED (errors=4)
  2. test test_dtrace failed
  3.  
  4. 1 test failed:
  5.     test_dtrace
  6. Re-running failed tests in verbose mode
  7. Re-running test 'test_dtrace' in verbose mode
  8. ERROR
  9. ERROR
  10. ERROR
  11. ERROR
  12.  
  13. ======================================================================
  14. ERROR: setUpClass (test.test_dtrace.DTraceNormalTests)
  15. ----------------------------------------------------------------------
  16. Traceback (most recent call last):
  17.   File "/home/jay/github repo/cpython/cpython/Lib/test/test_dtrace.py", line 110, in setUpClass
  18.     self.backend.assert_usable()
  19.   File "/home/jay/github repo/cpython/cpython/Lib/test/test_dtrace.py", line 80, in assert_usable
  20.     output = self.trace(abspath("assert_usable" + self.EXTENSION))
  21.   File "/home/jay/github repo/cpython/cpython/Lib/test/test_dtrace.py", line 68, in trace
  22.     universal_newlines=True).communicate()
  23.   File "/home/jay/github repo/cpython/cpython/Lib/subprocess.py", line 743, in __init__
  24.     restore_signals, start_new_session)
  25.   File "/home/jay/github repo/cpython/cpython/Lib/subprocess.py", line 1431, in _execute_child
  26.     raise child_exception_type(errno_num, err_msg, err_filename)
  27. NotADirectoryError: [Errno 20] Not a directory: 'dtrace'
  28.  
  29. ======================================================================
  30. ERROR: setUpClass (test.test_dtrace.DTraceOptimizedTests)
  31. ----------------------------------------------------------------------
  32. Traceback (most recent call last):
  33.   File "/home/jay/github repo/cpython/cpython/Lib/test/test_dtrace.py", line 110, in setUpClass
  34.     self.backend.assert_usable()
  35.   File "/home/jay/github repo/cpython/cpython/Lib/test/test_dtrace.py", line 80, in assert_usable
  36.     output = self.trace(abspath("assert_usable" + self.EXTENSION))
  37.   File "/home/jay/github repo/cpython/cpython/Lib/test/test_dtrace.py", line 68, in trace
  38.     universal_newlines=True).communicate()
  39.   File "/home/jay/github repo/cpython/cpython/Lib/subprocess.py", line 743, in __init__
  40.     restore_signals, start_new_session)
  41.   File "/home/jay/github repo/cpython/cpython/Lib/subprocess.py", line 1431, in _execute_child
  42.     raise child_exception_type(errno_num, err_msg, err_filename)
  43. NotADirectoryError: [Errno 20] Not a directory: 'dtrace'
  44.  
  45. ======================================================================
  46. ERROR: setUpClass (test.test_dtrace.SystemTapNormalTests)
  47. ----------------------------------------------------------------------
  48. Traceback (most recent call last):
  49.   File "/home/jay/github repo/cpython/cpython/Lib/test/test_dtrace.py", line 110, in setUpClass
  50.     self.backend.assert_usable()
  51.   File "/home/jay/github repo/cpython/cpython/Lib/test/test_dtrace.py", line 80, in assert_usable
  52.     output = self.trace(abspath("assert_usable" + self.EXTENSION))
  53.   File "/home/jay/github repo/cpython/cpython/Lib/test/test_dtrace.py", line 68, in trace
  54.     universal_newlines=True).communicate()
  55.   File "/home/jay/github repo/cpython/cpython/Lib/subprocess.py", line 743, in __init__
  56.     restore_signals, start_new_session)
  57.   File "/home/jay/github repo/cpython/cpython/Lib/subprocess.py", line 1431, in _execute_child
  58.     raise child_exception_type(errno_num, err_msg, err_filename)
  59. NotADirectoryError: [Errno 20] Not a directory: 'stap'
  60.  
  61. ======================================================================
  62. ERROR: setUpClass (test.test_dtrace.SystemTapOptimizedTests)
  63. ----------------------------------------------------------------------
  64. Traceback (most recent call last):
  65.   File "/home/jay/github repo/cpython/cpython/Lib/test/test_dtrace.py", line 110, in setUpClass
  66.     self.backend.assert_usable()
  67.   File "/home/jay/github repo/cpython/cpython/Lib/test/test_dtrace.py", line 80, in assert_usable
  68.     output = self.trace(abspath("assert_usable" + self.EXTENSION))
  69.   File "/home/jay/github repo/cpython/cpython/Lib/test/test_dtrace.py", line 68, in trace
  70.     universal_newlines=True).communicate()
  71.   File "/home/jay/github repo/cpython/cpython/Lib/subprocess.py", line 743, in __init__
  72.     restore_signals, start_new_session)
  73.   File "/home/jay/github repo/cpython/cpython/Lib/subprocess.py", line 1431, in _execute_child
  74.     raise child_exception_type(errno_num, err_msg, err_filename)
  75. NotADirectoryError: [Errno 20] Not a directory: 'stap'
  76.  
  77. ----------------------------------------------------------------------
  78. Ran 0 tests in 0.009s
  79.  
  80. FAILED (errors=4)
  81. test test_dtrace failed
  82. 1 test failed again:
  83.     test_dtrace
  84.  
  85. Total duration: 275 ms
  86. Tests result: FAILURE
  87. Makefile:1062: recipe for target 'test' failed
  88. make: *** [test] Error 2
RAW Paste Data