daily pastebin goal
31%
SHARE
TWEET

WinkNodeRed

dlaciv12 Feb 4th, 2016 92 Never
Not a member of Pastebin yet? Sign Up, it unlocks many cool features!
  1. 2016-02-04T18:58:58.820-0500[API/0]OUTUpdated app with guid 1c37c29f-0359-494d-b757-c4c553c7ffde ({"state"=>"STOPPED"})
  2. 2016-02-04T18:59:01.771-0500[DEA/60]OUTGot staging request for app with id 1c37c29f-0359-494d-b757-c4c553c7ffde
  3. 2016-02-04T18:59:11.341-0500[API/9]OUTUpdated app with guid 1c37c29f-0359-494d-b757-c4c553c7ffde ({"state"=>"STARTED"})
  4. 2016-02-04T18:59:11.529-0500[STG/60]OUT-----> Downloaded app package (108K)
  5. 2016-02-04T18:59:16.121-0500[STG/60]OUT-----> Downloaded app buildpack cache (79M)
  6. 2016-02-04T18:59:16.879-0500[STG/0]OUT
  7. 2016-02-04T18:59:16.879-0500[STG/0]OUT-----> IBM SDK for Node.js Buildpack v3.0-20160125-1224
  8. 2016-02-04T18:59:16.883-0500[STG/0]OUT Based on Cloud Foundry Node.js Buildpack v1.5.4
  9. 2016-02-04T18:59:16.890-0500[STG/0]OUT-----> Creating runtime environment
  10. 2016-02-04T18:59:16.905-0500[STG/0]OUT NPM_CONFIG_LOGLEVEL=error
  11. 2016-02-04T18:59:16.905-0500[STG/0]OUT NPM_CONFIG_PRODUCTION=true
  12. 2016-02-04T18:59:16.916-0500[STG/0]OUT NODE_RED_USERNAME=dlaciv12@gmail.com
  13. 2016-02-04T18:59:16.919-0500[STG/0]OUT NODE_RED_PASSWORD=4ZYkx9dA
  14. 2016-02-04T18:59:16.919-0500[STG/0]OUT NODE_ENV=production
  15. 2016-02-04T18:59:16.920-0500[STG/0]OUT NODE_MODULES_CACHE=true
  16. 2016-02-04T18:59:16.923-0500[STG/0]OUT-----> Installing binaries
  17. 2016-02-04T18:59:16.950-0500[STG/0]OUT engines.node (package.json): ~4.x
  18. 2016-02-04T18:59:16.950-0500[STG/0]OUT engines.npm (package.json): unspecified (use default)
  19. 2016-02-04T18:59:16.951-0500[STG/0]OUT Resolving node version ~4.x via 'node-version-resolver'
  20. 2016-02-04T18:59:17.150-0500[STG/0]OUT Installing IBM SDK for Node.js (4.2.4) from cache
  21. 2016-02-04T18:59:18.003-0500[STG/0]OUT Using default npm version: 2.14.12
  22. 2016-02-04T18:59:18.251-0500[STG/0]OUT-----> Restoring cache
  23. 2016-02-04T18:59:18.507-0500[STG/0]OUT Skipping cache restore (new runtime signature)
  24. 2016-02-04T18:59:18.508-0500[STG/0]OUT-----> Checking and configuring service extensions before installing dependencies
  25. 2016-02-04T18:59:18.645-0500[STG/0]OUT-----> Building dependencies
  26. 2016-02-04T18:59:18.648-0500[STG/0]OUT Pruning any extraneous modules
  27. 2016-02-04T18:59:19.206-0500[STG/0]OUT Installing node modules (package.json)
  28. 2016-02-04T18:59:32.493-0500[STG/0]OUT WARN engine follow@0.11.4: wanted: {"node":"0.10.x || 0.8.x"} (current: {"node":"4.2.4","npm":"2.14.12"})
  29. 2016-02-04T18:59:36.241-0500[STG/0]OUT WARN engine follow@0.11.4: wanted: {"node":"0.10.x || 0.8.x"} (current: {"node":"4.2.4","npm":"2.14.12"})
  30. 2016-02-04T18:59:37.218-0500[STG/0]OUT > (node-gyp rebuild 2> builderror.log) || (exit 0)
  31. 2016-02-04T18:59:37.218-0500[STG/0]OUT > websocket@1.0.22 install /tmp/staged/app/node_modules/node-red-node-pushbullet/node_modules/pushbullet/node_modules/websocket
  32. 2016-02-04T18:59:38.924-0500[STG/0]OUT make: Entering directory `/tmp/staged/app/node_modules/node-red-node-pushbullet/node_modules/pushbullet/node_modules/websocket/build'
  33. 2016-02-04T18:59:38.926-0500[STG/0]OUT CXX(target) Release/obj.target/bufferutil/src/bufferutil.o
  34. 2016-02-04T18:59:40.051-0500[STG/0]OUT SOLINK_MODULE(target) Release/obj.target/bufferutil.node
  35. 2016-02-04T18:59:40.158-0500[STG/0]OUT COPY Release/bufferutil.node
  36. 2016-02-04T18:59:40.181-0500[STG/0]OUT CXX(target) Release/obj.target/validation/src/validation.o
  37. 2016-02-04T18:59:41.251-0500[STG/0]OUT SOLINK_MODULE(target) Release/obj.target/validation.node
  38. 2016-02-04T18:59:41.317-0500[STG/0]OUT COPY Release/validation.node
  39. 2016-02-04T18:59:41.332-0500[STG/0]OUT make: Leaving directory `/tmp/staged/app/node_modules/node-red-node-pushbullet/node_modules/pushbullet/node_modules/websocket/build'
  40. 2016-02-04T18:59:41.369-0500[STG/0]OUT > kerberos@0.0.11 install /tmp/staged/app/node_modules/mongodb/node_modules/kerberos
  41. 2016-02-04T18:59:41.369-0500[STG/0]OUT > (node-gyp rebuild 2> builderror.log) || (exit 0)
  42. 2016-02-04T18:59:42.277-0500[STG/0]OUT make: Entering directory `/tmp/staged/app/node_modules/mongodb/node_modules/kerberos/build'
  43. 2016-02-04T18:59:42.278-0500[STG/0]OUT CXX(target) Release/obj.target/kerberos/lib/kerberos.o
  44. 2016-02-04T18:59:42.809-0500[STG/0]OUT make: Leaving directory `/tmp/staged/app/node_modules/mongodb/node_modules/kerberos/build'
  45. 2016-02-04T18:59:42.853-0500[STG/0]OUT > bson@0.2.22 install /tmp/staged/app/node_modules/mongodb/node_modules/bson
  46. 2016-02-04T18:59:42.853-0500[STG/0]OUT > (node-gyp rebuild 2> builderror.log) || (exit 0)
  47. 2016-02-04T18:59:43.941-0500[STG/0]OUT make: Entering directory `/tmp/staged/app/node_modules/mongodb/node_modules/bson/build'
  48. 2016-02-04T18:59:43.944-0500[STG/0]OUT CXX(target) Release/obj.target/bson/ext/bson.o
  49. 2016-02-04T18:59:44.733-0500[STG/0]OUT make: Leaving directory `/tmp/staged/app/node_modules/mongodb/node_modules/bson/build'
  50. 2016-02-04T18:59:55.641-0500[STG/0]OUT > websocket@1.0.22 install /tmp/staged/app/node_modules/node-red-bluemix-nodes/node_modules/watson-developer-cloud/node_modules/websocket
  51. 2016-02-04T18:59:55.642-0500[STG/0]OUT > (node-gyp rebuild 2> builderror.log) || (exit 0)
  52. 2016-02-04T18:59:56.664-0500[STG/0]OUT make: Entering directory `/tmp/staged/app/node_modules/node-red-bluemix-nodes/node_modules/watson-developer-cloud/node_modules/websocket/build'
  53. 2016-02-04T18:59:56.665-0500[STG/0]OUT CXX(target) Release/obj.target/bufferutil/src/bufferutil.o
  54. 2016-02-04T18:59:57.801-0500[STG/0]OUT SOLINK_MODULE(target) Release/obj.target/bufferutil.node
  55. 2016-02-04T18:59:57.870-0500[STG/0]OUT COPY Release/bufferutil.node
  56. 2016-02-04T18:59:57.911-0500[STG/0]OUT CXX(target) Release/obj.target/validation/src/validation.o
  57. 2016-02-04T18:59:58.975-0500[STG/0]OUT SOLINK_MODULE(target) Release/obj.target/validation.node
  58. 2016-02-04T18:59:59.042-0500[STG/0]OUT COPY Release/validation.node
  59. 2016-02-04T18:59:59.054-0500[STG/0]OUT make: Leaving directory `/tmp/staged/app/node_modules/node-red-bluemix-nodes/node_modules/watson-developer-cloud/node_modules/websocket/build'
  60. 2016-02-04T19:00:11.198-0500[STG/0]OUT > node installer/driverInstall.js
  61. 2016-02-04T19:00:11.198-0500[STG/0]OUT > ibm_db@0.0.17 install /tmp/staged/app/node_modules/node-red-nodes-cf-sqldb-dashdb/node_modules/ibm_db
  62. 2016-02-04T19:00:11.660-0500[STG/0]OUT Downloading DB2 ODBC CLI Driver from http://public.dhe.ibm.com/ibmdl/export/pub/software/data/db2/drivers/odbc_cli/linuxx64_odbc_cli.tar.gz...
  63. 2016-02-04T19:00:17.361-0500[STG/0]OUT Download and extraction of DB2 ODBC CLI Driver completed successfully ...
  64. 2016-02-04T19:00:19.339-0500[STG/0]OUT make: Entering directory `/tmp/staged/app/node_modules/node-red-nodes-cf-sqldb-dashdb/node_modules/ibm_db/build'
  65. 2016-02-04T19:00:19.339-0500[STG/0]OUT CXX(target) Release/obj.target/odbc_bindings/src/odbc.o
  66. 2016-02-04T19:00:19.340-0500[STG/0]OUT make: Leaving directory `/tmp/staged/app/node_modules/node-red-nodes-cf-sqldb-dashdb/node_modules/ibm_db/build'
  67. 2016-02-04T19:00:19.344-0500[STG/0]OUT { [Error: Command failed: /bin/sh -c node-gyp configure build --IBM_DB_HOME=$IBM_DB_HOME --IS_DOWNLOADED=true
  68. 2016-02-04T19:00:19.350-0500[STG/0]OUT ^
  69. 2016-02-04T19:00:19.350-0500[STG/0]OUT ../node_modules/nan/nan.h:661:35: error: expected ‘,’ or ‘...’ before ‘callback’
  70. 2016-02-04T19:00:19.350-0500[STG/0]OUT from ../src/odbc.cpp:25:
  71. 2016-02-04T19:00:19.350-0500[STG/0]OUT , node::smalloc::FreeCallback callback
  72. 2016-02-04T19:00:19.350-0500[STG/0]OUT NAN_INLINE v8::Local<T> _NanEnsureLocal(v8::Handle<T> val) {
  73. 2016-02-04T19:00:19.350-0500[STG/0]OUT ../node_modules/nan/nan.h:665:50: error: ‘callback’ was not declared in this scope
  74. 2016-02-04T19:00:19.350-0500[STG/0]OUT v8::Isolate::GetCurrent(), data, length, callback, hint);
  75. 2016-02-04T19:00:19.350-0500[STG/0]OUT ^
  76. 2016-02-04T19:00:19.350-0500[STG/0]OUT ../node_modules/nan/nan.h:256:25: error: ‘template<class T> v8::Local<T> _NanEnsureLocal(v8::Handle<T>)’ previously declared here
  77. 2016-02-04T19:00:19.350-0500[STG/0]OUT v8::Isolate::GetCurrent(), data, length, callback, hint);
  78. 2016-02-04T19:00:19.350-0500[STG/0]OUT ../node_modules/nan/nan.h:661:13: error: ‘node::smalloc’ has not been declared
  79. 2016-02-04T19:00:19.350-0500[STG/0]OUT ../node_modules/nan/nan.h:261:25: error: redefinition of ‘template<class T> v8::Local<T> _NanEnsureLocal(v8::Local<T>)’
  80. 2016-02-04T19:00:19.350-0500[STG/0]OUT ^
  81. 2016-02-04T19:00:19.350-0500[STG/0]OUT ^
  82. 2016-02-04T19:00:19.350-0500[STG/0]OUT ^
  83. 2016-02-04T19:00:19.350-0500[STG/0]OUT ^
  84. 2016-02-04T19:00:19.350-0500[STG/0]OUT ../node_modules/nan/nan.h: In function ‘v8::Local<v8::Object> NanNewBufferHandle(char*, size_t, int)’:
  85. 2016-02-04T19:00:19.350-0500[STG/0]OUT In file included from ../src/odbc.h:23:0,
  86. 2016-02-04T19:00:19.350-0500[STG/0]OUT ../node_modules/nan/nan.h:665:60: error: ‘hint’ was not declared in this scope
  87. 2016-02-04T19:00:19.350-0500[STG/0]OUT ../node_modules/nan/nan.h: In function ‘v8::Local<v8::Object> NanNewBufferHandle(const char*, uint32_t)’:
  88. 2016-02-04T19:00:19.358-0500[STG/0]OUT ../node_modules/nan/nan.h: In function ‘v8::Local<v8::Object> NanBufferUse(char*, uint32_t)’:
  89. 2016-02-04T19:00:19.357-0500[STG/0]OUT ../node_modules/nan/nan.h:672:67: error: call of overloaded ‘New(v8::Isolate*, const char*&, uint32_t&)’ is ambiguous
  90. 2016-02-04T19:00:19.360-0500[STG/0]OUT ../src/odbc.cpp: In member function ‘void ODBC::Free()’:
  91. 2016-02-04T19:00:19.357-0500[STG/0]OUT ^
  92. 2016-02-04T19:00:19.361-0500[STG/0]OUT ^
  93. 2016-02-04T19:00:19.359-0500[STG/0]OUT return node::Buffer::Use(v8::Isolate::GetCurrent(), data, size);
  94. 2016-02-04T19:00:19.357-0500[STG/0]OUT from ../src/odbc.cpp:25:
  95. 2016-02-04T19:00:19.357-0500[STG/0]OUT return node::Buffer::New(v8::Isolate::GetCurrent(), data, size);
  96. 2016-02-04T19:00:19.357-0500[STG/0]OUT /home/vcap/.node-gyp/4.2.4/include/node/node_buffer.h:43:40: note: no known conversion for argument 2 from ‘const char*’ to ‘char*’
  97. 2016-02-04T19:00:19.360-0500[STG/0]OUT ../src/odbc.cpp:115:14: warning: converting to non-pointer type ‘SQLHENV {aka int}’ from NULL [-Wconversion-null]
  98. 2016-02-04T19:00:19.357-0500[STG/0]OUT NODE_EXTERN v8::MaybeLocal<v8::Object> New(v8::Isolate* isolate,
  99. 2016-02-04T19:00:19.357-0500[STG/0]OUT /home/vcap/.node-gyp/4.2.4/include/node/node_buffer.h:31:40: note: no known conversion for argument 3 from ‘uint32_t {aka unsigned int}’ to ‘node::encoding’
  100. 2016-02-04T19:00:19.357-0500[STG/0]OUT In file included from ../node_modules/nan/nan.h:25:0,
  101. 2016-02-04T19:00:19.357-0500[STG/0]OUT ../node_modules/nan/nan.h:672:67: note: candidates are:
  102. 2016-02-04T19:00:19.357-0500[STG/0]OUT In file included from ../src/odbc.h:23:0,
  103. 2016-02-04T19:00:19.357-0500[STG/0]OUT from ../src/odbc.cpp:25:
  104. 2016-02-04T19:00:19.357-0500[STG/0]OUT ^
  105. 2016-02-04T19:00:19.359-0500[STG/0]OUT ../node_modules/nan/nan.h:683:12: error: ‘Use’ is not a member of ‘node::Buffer’
  106. 2016-02-04T19:00:19.362-0500[STG/0]OUT dbo->m_hEnv = NULL;
  107. 2016-02-04T19:00:19.357-0500[STG/0]OUT return node::Buffer::New(v8::Isolate::GetCurrent(), size);
  108. 2016-02-04T19:00:19.361-0500[STG/0]OUT ../src/odbc.cpp: In static member function ‘static void ODBC::New(const v8::FunctionCallbackInfo<v8::Value>&)’:
  109. 2016-02-04T19:00:19.357-0500[STG/0]OUT from ../src/odbc.h:23,
  110. 2016-02-04T19:00:19.362-0500[STG/0]OUT ^
  111. 2016-02-04T19:00:19.357-0500[STG/0]OUT /home/vcap/.node-gyp/4.2.4/include/node/node_buffer.h:31:40: note: v8::MaybeLocal<v8::Object> node::Buffer::New(v8::Isolate*, v8::Local<v8::String>, node::encoding) <near match>
  112. 2016-02-04T19:00:19.357-0500[STG/0]OUT /home/vcap/.node-gyp/4.2.4/include/node/node_buffer.h:43:40: note: v8::MaybeLocal<v8::Object> node::Buffer::New(v8::Isolate*, char*, size_t) <near match>
  113. 2016-02-04T19:00:19.357-0500[STG/0]OUT ../node_modules/nan/nan.h:676:61: error: could not convert ‘node::Buffer::New(v8::Isolate::GetCurrent(), ((size_t)size))’ from ‘v8::MaybeLocal<v8::Object>’ to ‘v8::Local<v8::Object>’
  114. 2016-02-04T19:00:19.359-0500[STG/0]OUT ^
  115. 2016-02-04T19:00:19.362-0500[STG/0]OUT ../src/odbc.cpp:129:15: warning: converting to non-pointer type ‘SQLHENV {aka int}’ from NULL [-Wconversion-null]
  116. 2016-02-04T19:00:19.357-0500[STG/0]OUT NODE_EXTERN v8::MaybeLocal<v8::Object> New(v8::Isolate* isolate,
  117. 2016-02-04T19:00:19.357-0500[STG/0]OUT ../node_modules/nan/nan.h: In function ‘v8::Local<v8::Object> NanNewBufferHandle(uint32_t)’:
  118. 2016-02-04T19:00:19.363-0500[STG/0]OUT ../src/odbc.cpp: In static member function ‘static void ODBC::UV_AfterCreateConnection(uv_work_t*, int)’:
  119. 2016-02-04T19:00:19.361-0500[STG/0]OUT m_hEnv = NULL;
  120. 2016-02-04T19:00:19.350-0500[STG/0]OUT NAN_INLINE v8::Local<T> _NanEnsureLocal(v8::Local<T> val) {
  121. 2016-02-04T19:00:19.358-0500[STG/0]OUT ^
  122. 2016-02-04T19:00:19.357-0500[STG/0]OUT ^
  123. 2016-02-04T19:00:19.350-0500[STG/0]OUT , node::smalloc::FreeCallback callback
  124. 2016-02-04T19:00:19.363-0500[STG/0]OUT ../src/odbc.cpp:221:50: warning: cast to pointer from integer of different size [-Wint-to-pointer-cast]
  125. 2016-02-04T19:00:19.364-0500[STG/0]OUT ^
  126. 2016-02-04T19:00:19.364-0500[STG/0]OUT args[0] = NanNew<External>((void*)data->dbo->m_hEnv);
  127. 2016-02-04T19:00:19.365-0500[STG/0]OUT ../src/odbc.cpp:222:45: warning: cast to pointer from integer of different size [-Wint-to-pointer-cast]
  128. 2016-02-04T19:00:19.365-0500[STG/0]OUT args[1] = NanNew<External>((void*)data->hDBC);
  129. 2016-02-04T19:00:19.365-0500[STG/0]OUT ^
  130. 2016-02-04T19:00:19.366-0500[STG/0]OUT ../src/odbc.cpp:233:29: warning: ‘void node::FatalException(const v8::TryCatch&)’ is deprecated (declared at /home/vcap/.node-gyp/4.2.4/include/node/node.h:282): Use FatalException(isolate, ...) [-Wdeprecated-declarations]
  131. 2016-02-04T19:00:19.367-0500[STG/0]OUT ^
  132. 2016-02-04T19:00:19.367-0500[STG/0]OUT FatalException(try_catch);
  133. 2016-02-04T19:00:19.367-0500[STG/0]OUT ../src/odbc.cpp: In static member function ‘static void ODBC::CreateConnectionSync(const v8::FunctionCallbackInfo<v8::Value>&)’:
  134. 2016-02-04T19:00:19.368-0500[STG/0]OUT ../src/odbc.cpp:268:44: warning: cast to pointer from integer of different size [-Wint-to-pointer-cast]
  135. 2016-02-04T19:00:19.368-0500[STG/0]OUT params[0] = NanNew<External>((void*)dbo->m_hEnv);
  136. 2016-02-04T19:00:19.368-0500[STG/0]OUT ^
  137. 2016-02-04T19:00:19.369-0500[STG/0]OUT ../src/odbc.cpp:269:39: warning: cast to pointer from integer of different size [-Wint-to-pointer-cast]
  138. 2016-02-04T19:00:19.369-0500[STG/0]OUT params[1] = NanNew<External>((void*)hDBC);
  139. 2016-02-04T19:00:19.369-0500[STG/0]OUT ^
  140. 2016-02-04T19:00:19.370-0500[STG/0]OUT make: *** [Release/obj.target/odbc_bindings/src/odbc.o] Error 1
  141. 2016-02-04T19:00:19.370-0500[STG/0]OUT gyp ERR! build error
  142. 2016-02-04T19:00:19.371-0500[STG/0]OUT gyp ERR! stack at ChildProcess.onExit (/tmp/staged/app/vendor/node/lib/node_modules/npm/node_modules/node-gyp/lib/build.js:271:23)
  143. 2016-02-04T19:00:19.370-0500[STG/0]OUT gyp ERR! stack Error: `make` failed with exit code: 2
  144. 2016-02-04T19:00:19.371-0500[STG/0]OUT gyp ERR! stack at emitTwo (events.js:87:13)
  145. 2016-02-04T19:00:19.372-0500[STG/0]OUT gyp ERR! stack at ChildProcess.emit (events.js:172:7)
  146. 2016-02-04T19:00:19.372-0500[STG/0]OUT gyp ERR! stack at Process.ChildProcess._handle.onexit (internal/child_process.js:200:12)
  147. 2016-02-04T19:00:19.376-0500[STG/0]OUT gyp ERR! not ok
  148. 2016-02-04T19:00:19.376-0500[STG/0]OUT gyp ERR! node-gyp -v v3.0.3
  149. 2016-02-04T19:00:19.376-0500[STG/0]OUT code: 1,
  150. 2016-02-04T19:00:19.376-0500[STG/0]OUT gyp ERR! command "/tmp/staged/app/vendor/node/bin/node" "/tmp/staged/app/vendor/node/lib/node_modules/npm/node_modules/node-gyp/bin/node-gyp.js" "configure" "build" "--IBM_DB_HOME=/tmp/staged/app/node_modules/node-red-nodes-cf-sqldb-dashdb/node_modules/ibm_db/installer/clidriver" "--IS_DOWNLOADED=true"
  151. 2016-02-04T19:00:19.376-0500[STG/0]OUT gyp ERR! cwd /tmp/staged/app/node_modules/node-red-nodes-cf-sqldb-dashdb/node_modules/ibm_db
  152. 2016-02-04T19:00:19.376-0500[STG/0]OUT ]
  153. 2016-02-04T19:00:19.376-0500[STG/0]OUT cmd: '/bin/sh -c node-gyp configure build --IBM_DB_HOME=$IBM_DB_HOME --IS_DOWNLOADED=true' }
  154. 2016-02-04T19:00:19.376-0500[STG/0]OUT signal: null,
  155. 2016-02-04T19:00:19.376-0500[STG/0]OUT killed: false,
  156. 2016-02-04T19:00:19.376-0500[STG/0]OUT gyp ERR! node -v v4.2.4
  157. 2016-02-04T19:00:19.372-0500[STG/0]OUT gyp ERR! System Linux 3.19.0-25-generic
  158. 2016-02-04T19:00:19.400-0500[STG/0]OUT > bcrypt@0.8.5 install /tmp/staged/app/node_modules/node-red/node_modules/bcrypt
  159. 2016-02-04T19:00:19.400-0500[STG/0]OUT > node-gyp rebuild
  160. 2016-02-04T19:00:20.601-0500[STG/0]OUT make: Entering directory `/tmp/staged/app/node_modules/node-red/node_modules/bcrypt/build'
  161. 2016-02-04T19:00:20.608-0500[STG/0]OUT CXX(target) Release/obj.target/bcrypt_lib/src/blowfish.o
  162. 2016-02-04T19:00:20.977-0500[STG/0]OUT CXX(target) Release/obj.target/bcrypt_lib/src/bcrypt.o
  163. 2016-02-04T19:00:21.216-0500[STG/0]OUT CXX(target) Release/obj.target/bcrypt_lib/src/bcrypt_node.o
  164. 2016-02-04T19:00:23.672-0500[STG/0]OUT SOLINK_MODULE(target) Release/obj.target/bcrypt_lib.node
  165. 2016-02-04T19:00:23.794-0500[STG/0]OUT COPY Release/bcrypt_lib.node
  166. 2016-02-04T19:00:23.835-0500[STG/0]OUT make: Leaving directory `/tmp/staged/app/node_modules/node-red/node_modules/bcrypt/build'
  167. 2016-02-04T19:00:23.852-0500[STG/0]OUT > utf-8-validate@1.2.1 install /tmp/staged/app/node_modules/node-red/node_modules/ws/node_modules/utf-8-validate
  168. 2016-02-04T19:00:23.852-0500[STG/0]OUT > node-gyp rebuild
  169. 2016-02-04T19:00:25.298-0500[STG/0]OUT make: Entering directory `/tmp/staged/app/node_modules/node-red/node_modules/ws/node_modules/utf-8-validate/build'
  170. 2016-02-04T19:00:25.300-0500[STG/0]OUT CXX(target) Release/obj.target/validation/src/validation.o
  171. 2016-02-04T19:00:26.590-0500[STG/0]OUT SOLINK_MODULE(target) Release/obj.target/validation.node
  172. 2016-02-04T19:00:26.684-0500[STG/0]OUT COPY Release/validation.node
  173. 2016-02-04T19:00:26.699-0500[STG/0]OUT make: Leaving directory `/tmp/staged/app/node_modules/node-red/node_modules/ws/node_modules/utf-8-validate/build'
  174. 2016-02-04T19:00:26.745-0500[STG/0]OUT > node-gyp rebuild
  175. 2016-02-04T19:00:26.745-0500[STG/0]OUT > bufferutil@1.2.1 install /tmp/staged/app/node_modules/node-red/node_modules/ws/node_modules/bufferutil
  176. 2016-02-04T19:00:27.887-0500[STG/0]OUT make: Entering directory `/tmp/staged/app/node_modules/node-red/node_modules/ws/node_modules/bufferutil/build'
  177. 2016-02-04T19:00:27.903-0500[STG/0]OUT CXX(target) Release/obj.target/bufferutil/src/bufferutil.o
  178. 2016-02-04T19:00:29.070-0500[STG/0]OUT SOLINK_MODULE(target) Release/obj.target/bufferutil.node
  179. 2016-02-04T19:00:29.156-0500[STG/0]OUT COPY Release/bufferutil.node
  180. 2016-02-04T19:00:29.173-0500[STG/0]OUT make: Leaving directory `/tmp/staged/app/node_modules/node-red/node_modules/ws/node_modules/bufferutil/build'
  181. 2016-02-04T19:00:33.801-0500[STG/0]OUT > serialport@2.0.6 install /tmp/staged/app/node_modules/node-red/node_modules/node-red-node-serialport/node_modules/serialport
  182. 2016-02-04T19:00:33.802-0500[STG/0]OUT > node-pre-gyp install --fallback-to-build
  183. 2016-02-04T19:00:38.003-0500[STG/0]OUT [serialport] Success: "/tmp/staged/app/node_modules/node-red/node_modules/node-red-node-serialport/node_modules/serialport/build/Release/node-v46-linux-x64/serialport.node" is installed via remote
  184. 2016-02-04T19:00:38.056-0500[STG/0]OUT npm ERR! argv "/tmp/staged/app/vendor/node/bin/node" "/tmp/staged/app/vendor/node/bin/npm" "install" "--unsafe-perm" "--userconfig" "/tmp/staged/app/.npmrc"
  185. 2016-02-04T19:00:38.055-0500[STG/0]OUT npm ERR! Linux 3.19.0-25-generic
  186. 2016-02-04T19:00:38.059-0500[STG/0]OUT npm ERR! code ELIFECYCLE
  187. 2016-02-04T19:00:38.062-0500[STG/0]OUT npm ERR! You can get their info via:
  188. 2016-02-04T19:00:38.058-0500[STG/0]OUT npm ERR! node v4.2.4
  189. 2016-02-04T19:00:38.058-0500[STG/0]OUT npm ERR! npm v2.14.12
  190. 2016-02-04T19:00:38.060-0500[STG/0]OUT npm ERR! Exit status 1
  191. 2016-02-04T19:00:38.060-0500[STG/0]OUT npm ERR! ibm_db@0.0.17 install: `node installer/driverInstall.js`
  192. 2016-02-04T19:00:38.062-0500[STG/0]OUT npm ERR! node installer/driverInstall.js
  193. 2016-02-04T19:00:38.062-0500[STG/0]OUT npm ERR! Tell the author that this fails on your system:
  194. 2016-02-04T19:00:38.062-0500[STG/0]OUT npm ERR! This is most likely a problem with the ibm_db package,
  195. 2016-02-04T19:00:38.062-0500[STG/0]OUT npm ERR!
  196. 2016-02-04T19:00:38.063-0500[STG/0]OUT npm ERR! There is likely additional logging output above.
  197. 2016-02-04T19:00:38.062-0500[STG/0]OUT npm ERR! not with npm itself.
  198. 2016-02-04T19:00:38.062-0500[STG/0]OUT npm ERR! npm owner ls ibm_db
  199. 2016-02-04T19:00:38.062-0500[STG/0]OUT npm ERR! Failed at the ibm_db@0.0.17 install script 'node installer/driverInstall.js'.
  200. 2016-02-04T19:00:38.524-0500[STG/0]OUT npm ERR! Please include the following file with any support request:
  201. 2016-02-04T19:00:38.524-0500[STG/0]OUT npm ERR! /tmp/staged/app/npm-debug.log
  202. 2016-02-04T19:00:38.621-0500[STG/0]OUT-----> Build failed
  203. 2016-02-04T19:00:38.645-0500[STG/0]OUT Your build failed!
  204. 2016-02-04T19:00:38.645-0500[STG/0]OUT http://ibm.biz/bluemixcommunitysupport
  205. 2016-02-04T19:00:38.646-0500[STG/0]OUT If you need additional help and your subscription includes support, submit a ticket so we can help:
  206. 2016-02-04T19:00:38.652-0500[STG/0]OUTStaging failed: Buildpack compilation step failed
  207. 2016-02-04T19:00:38.656-0500[STG/0]ERR
  208. 2016-02-04T19:00:38.806-0500[API/9]ERRencountered error: App staging failed in the buildpack compile phase
RAW Paste Data
We use cookies for various purposes including analytics. By continuing to use Pastebin, you agree to our use of cookies as described in the Cookies Policy. OK, I Understand
 
Top