SHARE
TWEET

output pep install

a guest May 17th, 2018 294 Never
Not a member of Pastebin yet? Sign Up, it unlocks many cool features!
  1. In the moment that I installed fiware-pep-proxy I had a problem in the step: npm install
  2.  
  3. I followed this guide: http://fiware-pep-proxy.readthedocs.io/en/latest/admin_guide/#installation-and-administration-guide
  4.  
  5. $ npm install
  6.  
  7. npm WARN package.json fiware-pep-proxy@0.1.0 No license field.
  8.  
  9. > node-expat@2.3.16 install /home/student/course/pep/fiware-pep-proxy-master/node_modules/xml2json/node_modules/node-expat
  10. > node-gyp rebuild
  11.  
  12. make: se ingresa al directorio `/home/student/course/pep/fiware-pep-proxy-master/node_modules/xml2json/node_modules/node-expat/build'
  13.  CC(target) Release/obj.target/expat/deps/libexpat/lib/xmlparse.o
  14.  CC(target) Release/obj.target/expat/deps/libexpat/lib/xmltok.o
  15.  CC(target) Release/obj.target/expat/deps/libexpat/lib/xmlrole.o
  16.  AR(target) Release/obj.target/deps/libexpat/libexpat.a
  17.  COPY Release/libexpat.a
  18.  CXX(target) Release/obj.target/node_expat/node-expat.o
  19. En el fichero incluído de ../node-expat.cc:1:
  20. ../node_modules/nan/nan.h:47:3: error: #error This version of node/NAN/v8 requires a C++11 compiler
  21. In file included from /home/student/.node-gyp/4.2.3/include/node/node.h:42,
  22.                 from ../node_modules/nan/nan.h:51,
  23.                 from ../node-expat.cc:1:
  24. /home/student/.node-gyp/4.2.3/include/node/v8.h:336: error: expected unqualified-id before ‘using’
  25. /home/student/.node-gyp/4.2.3/include/node/v8.h: In constructor ‘v8::MaybeLocal<T>::MaybeLocal()’:
  26. /home/student/.node-gyp/4.2.3/include/node/v8.h:353: error: ‘nullptr’ no se declaró en este ámbito
  27. /home/student/.node-gyp/4.2.3/include/node/v8.h: In member function ‘bool v8::MaybeLocal<T>::IsEmpty() const’:
  28. /home/student/.node-gyp/4.2.3/include/node/v8.h:360: error: ‘nullptr’ no se declaró en este ámbito
  29. /home/student/.node-gyp/4.2.3/include/node/v8.h: In member function ‘bool v8::MaybeLocal<T>::ToLocal(v8::Local<S>*) const’:
  30. /home/student/.node-gyp/4.2.3/include/node/v8.h:364: error: ‘nullptr’ no se declaró en este ámbito
  31. /home/student/.node-gyp/4.2.3/include/node/v8.h: In member function ‘bool v8::WeakCallbackInfo<T>::IsFirstPass() const’:
  32. /home/student/.node-gyp/4.2.3/include/node/v8.h:430: error: ‘nullptr’ no se declaró en este ámbito
  33. /home/student/.node-gyp/4.2.3/include/node/v8.h: At global scope:
  34. /home/student/.node-gyp/4.2.3/include/node/v8.h:469: error: expected unqualified-id before ‘using’
  35. /home/student/.node-gyp/4.2.3/include/node/v8.h: In constructor ‘v8::Global<T>::Global()’:
  36. /home/student/.node-gyp/4.2.3/include/node/v8.h:790: error: ‘nullptr’ no se declaró en este ámbito
  37. /home/student/.node-gyp/4.2.3/include/node/v8.h: In constructor ‘v8::Global<T>::Global(v8::Global<T>&&)’:
  38. /home/student/.node-gyp/4.2.3/include/node/v8.h:815: error: ‘nullptr’ no se declaró en este ámbito
  39. /home/student/.node-gyp/4.2.3/include/node/v8.h: In member function ‘v8::Global<T>& v8::Global<T>::operator=(v8::Global<S>&&)’:
  40. /home/student/.node-gyp/4.2.3/include/node/v8.h:827: error: ‘nullptr’ no se declaró en este ámbito
  41. /home/student/.node-gyp/4.2.3/include/node/v8.h: At global scope:
  42. /home/student/.node-gyp/4.2.3/include/node/v8.h:852: error: expected unqualified-id before ‘using’
  43. /home/student/.node-gyp/4.2.3/include/node/v8.h:1089: error: ‘nullptr’ no se declaró en este ámbito
  44. /home/student/.node-gyp/4.2.3/include/node/v8.h:1095: error: ‘nullptr’ no se declaró en este ámbito
  45. /home/student/.node-gyp/4.2.3/include/node/v8.h: In member function ‘v8::MaybeLocal<v8::Object> v8::Function::NewInstance(v8::Local<v8::Context>) const’:
  46. /home/student/.node-gyp/4.2.3/include/node/v8.h:3205: error: ‘nullptr’ no se declaró en este ámbito
  47. /home/student/.node-gyp/4.2.3/include/node/v8.h: In member function ‘v8::Local<T> v8::MaybeLocal<T>::ToLocalChecked()’:
  48. /home/student/.node-gyp/4.2.3/include/node/v8.h:7164: error: ‘nullptr’ no se declaró en este ámbito
  49. In file included from ../node_modules/nan/nan.h:197,
  50.                 from ../node-expat.cc:1:
  51. ../node_modules/nan/nan_maybe_43_inl.h: At global scope:
  52. ../node_modules/nan/nan_maybe_43_inl.h:13: error: expected unqualified-id before ‘using’
  53. ../node_modules/nan/nan_maybe_43_inl.h:16: error: expected unqualified-id before ‘using’
  54. ../node_modules/nan/nan_maybe_43_inl.h:19: error: expected initializer before ‘<’ token
  55. ../node_modules/nan/nan_maybe_43_inl.h:24: error: expected initializer before ‘<’ token
  56. ../node_modules/nan/nan_maybe_43_inl.h:29: error: expected initializer before ‘<’ token
  57. ../node_modules/nan/nan_maybe_43_inl.h:37: error: expected initializer before ‘<’ token
  58. ../node_modules/nan/nan_maybe_43_inl.h:45: error: expected initializer before ‘<’ token
  59. ../node_modules/nan/nan_maybe_43_inl.h:52: error: expected initializer before ‘<’ token
  60. ../node_modules/nan/nan_maybe_43_inl.h:60: error: expected initializer before ‘<’ token
  61. ../node_modules/nan/nan_maybe_43_inl.h:71: error: expected initializer before ‘<’ token
  62. ../node_modules/nan/nan_maybe_43_inl.h:79: error: expected initializer before ‘<’ token
  63. ../node_modules/nan/nan_maybe_43_inl.h:87: error: expected initializer before ‘<’ token
  64. ../node_modules/nan/nan_maybe_43_inl.h:96: error: expected initializer before ‘<’ token
  65. ../node_modules/nan/nan_maybe_43_inl.h:109: error: expected initializer before ‘<’ token
  66. ../node_modules/nan/nan_maybe_43_inl.h:130: error: expected initializer before ‘<’ token
  67. ../node_modules/nan/nan_maybe_43_inl.h:147: error: expected initializer before ‘<’ token
  68. ../node_modules/nan/nan_maybe_43_inl.h:157: error: expected initializer before ‘<’ token
  69. ../node_modules/nan/nan_maybe_43_inl.h:173: error: expected initializer before ‘<’ token
  70. ../node_modules/nan/nan_maybe_43_inl.h:181: error: expected initializer before ‘<’ token
  71. ../node_modules/nan/nan_maybe_43_inl.h:187: error: expected initializer before ‘<’ token
  72. ../node_modules/nan/nan_maybe_43_inl.h:196: error: expected initializer before ‘<’ token
  73. ../node_modules/nan/nan_maybe_43_inl.h:203: error: expected initializer before ‘<’ token
  74. ../node_modules/nan/nan_maybe_43_inl.h:211: error: expected initializer before ‘<’ token
  75. ../node_modules/nan/nan_maybe_43_inl.h:218: error: expected initializer before ‘<’ token
  76. ../node_modules/nan/nan_maybe_43_inl.h:226: error: expected initializer before ‘<’ token
  77. ../node_modules/nan/nan_maybe_43_inl.h:234: error: expected initializer before ‘<’ token
  78. ../node_modules/nan/nan_maybe_43_inl.h:242: error: expected initializer before ‘<’ token
  79. ../node_modules/nan/nan_maybe_43_inl.h:250: error: expected initializer before ‘<’ token
  80. ../node_modules/nan/nan_maybe_43_inl.h:258: error: expected initializer before ‘<’ token
  81. ../node_modules/nan/nan_maybe_43_inl.h:266: error: expected initializer before ‘<’ token
  82. ../node_modules/nan/nan_maybe_43_inl.h:276: error: expected initializer before ‘<’ token
  83. ../node_modules/nan/nan_maybe_43_inl.h:286: error: expected initializer before ‘<’ token
  84. ../node_modules/nan/nan_maybe_43_inl.h:298: error: expected initializer before ‘<’ token
  85. ../node_modules/nan/nan_maybe_43_inl.h:309: error: expected initializer before ‘<’ token
  86. ../node_modules/nan/nan_maybe_43_inl.h:316: error: expected initializer before ‘<’ token
  87. ../node_modules/nan/nan_maybe_43_inl.h:322: error: expected initializer before ‘<’ token
  88. ../node_modules/nan/nan_maybe_43_inl.h:328: error: expected initializer before ‘<’ token
  89. ../node_modules/nan/nan_maybe_43_inl.h:334: error: expected initializer before ‘<’ token
  90. ../node_modules/nan/nan_maybe_43_inl.h:358: error: expected initializer before ‘<’ token
  91. In file included from ../node_modules/nan/nan.h:202,
  92.                 from ../node-expat.cc:1:
  93. ../node_modules/nan/nan_converters.h:14: error: ISO C++ prohíbe la declaración de ‘MaybeLocal’ sin tipo
  94. ../node_modules/nan/nan_converters.h:14: error: expected ‘;’ before ‘<’ token
  95. ../node_modules/nan/nan_converters.h:16: error: ISO C++ prohíbe la declaración de ‘Maybe’ sin tipo
  96. ../node_modules/nan/nan_converters.h:16: error: expected ‘;’ before ‘<’ token
  97. ../node_modules/nan/nan_converters.h:22: error: ‘return_t’ no nombra a un tipo
  98. ../node_modules/nan/nan_converters.h:34: error: ‘return_t’ no nombra a un tipo
  99. ../node_modules/nan/nan_converters.h:35: error: ‘return_t’ no nombra a un tipo
  100. ../node_modules/nan/nan_converters.h:36: error: ‘return_t’ no nombra a un tipo
  101. ../node_modules/nan/nan_converters.h:37: error: ‘return_t’ no nombra a un tipo
  102. ../node_modules/nan/nan_converters.h:38: error: ‘return_t’ no nombra a un tipo
  103. ../node_modules/nan/nan_converters.h:39: error: ‘return_t’ no nombra a un tipo
  104. ../node_modules/nan/nan_converters.h:40: error: ‘return_t’ no nombra a un tipo
  105. ../node_modules/nan/nan_converters.h:50: error: ‘return_t’ no nombra a un tipo
  106. ../node_modules/nan/nan_converters.h:51: error: ‘return_t’ no nombra a un tipo
  107. ../node_modules/nan/nan_converters.h:52: error: ‘return_t’ no nombra a un tipo
  108. ../node_modules/nan/nan_converters.h:53: error: ‘return_t’ no nombra a un tipo
  109. ../node_modules/nan/nan_converters.h:54: error: ‘return_t’ no nombra a un tipo
  110. In file included from ../node_modules/nan/nan_converters.h:67,
  111.                 from ../node_modules/nan/nan.h:202,
  112.                 from ../node-expat.cc:1:
  113. ../node_modules/nan/nan_converters_43_inl.h:22: error: ‘return_t’ en la clase ‘Nan::imp::ToFactory<v8::Boolean>’ no nombra un tipo
  114. ../node_modules/nan/nan_converters_43_inl.h:23: error: ‘return_t’ en la clase ‘Nan::imp::ToFactory<v8::Number>’ no nombra un tipo
  115. ../node_modules/nan/nan_converters_43_inl.h:24: error: ‘return_t’ en la clase ‘Nan::imp::ToFactory<v8::String>’ no nombra un tipo
  116. ../node_modules/nan/nan_converters_43_inl.h:25: error: ‘return_t’ en la clase ‘Nan::imp::ToFactory<v8::Object>’ no nombra un tipo
  117. ../node_modules/nan/nan_converters_43_inl.h:26: error: ‘return_t’ en la clase ‘Nan::imp::ToFactory<v8::Integer>’ no nombra un tipo
  118. ../node_modules/nan/nan_converters_43_inl.h:27: error: ‘return_t’ en la clase ‘Nan::imp::ToFactory<v8::Uint32>’ no nombra un tipo
  119. ../node_modules/nan/nan_converters_43_inl.h:28: error: ‘return_t’ en la clase ‘Nan::imp::ToFactory<v8::Int32>’ no nombra un tipo
  120. ../node_modules/nan/nan_converters_43_inl.h:40: error: ‘return_t’ en la clase ‘Nan::imp::ToFactory<bool>’ no nombra un tipo
  121. ../node_modules/nan/nan_converters_43_inl.h:41: error: ‘return_t’ en la clase ‘Nan::imp::ToFactory<double>’ no nombra un tipo
  122. ../node_modules/nan/nan_converters_43_inl.h:42: error: ‘return_t’ en la clase ‘Nan::imp::ToFactory<long int>’ no nombra un tipo
  123. ../node_modules/nan/nan_converters_43_inl.h:43: error: ‘return_t’ en la clase ‘Nan::imp::ToFactory<unsigned int>’ no nombra un tipo
  124. ../node_modules/nan/nan_converters_43_inl.h:44: error: ‘return_t’ en la clase ‘Nan::imp::ToFactory<int>’ no nombra un tipo
  125. In file included from ../node_modules/nan/nan.h:203,
  126.                 from ../node-expat.cc:1:
  127. ../node_modules/nan/nan_new.h: In function ‘v8::Local<T> Nan::imp::To(v8::Local<v8::Integer>) [with T = v8::Integer]’:
  128. ../node_modules/nan/nan_new.h:21: error: no hay una función coincidente para la llamada a ‘To(v8::Local<v8::Integer>&)’
  129. ../node_modules/nan/nan_new.h: In function ‘v8::Local<T> Nan::imp::To(v8::Local<v8::Integer>) [with T = v8::Int32]’:
  130. ../node_modules/nan/nan_new.h:28: error: no hay una función coincidente para la llamada a ‘To(v8::Local<v8::Integer>&)’
  131. ../node_modules/nan/nan_new.h: In function ‘v8::Local<T> Nan::imp::To(v8::Local<v8::Integer>) [with T = v8::Uint32]’:
  132. ../node_modules/nan/nan_new.h:35: error: no hay una función coincidente para la llamada a ‘To(v8::Local<v8::Integer>&)’
  133. ../node_modules/nan/nan_new.h: At global scope:
  134. ../node_modules/nan/nan_new.h:43: error: ISO C++ prohíbe la declaración de ‘MaybeLocal’ sin tipo
  135. ../node_modules/nan/nan_new.h:43: error: expected ‘;’ before ‘<’ token
  136. ../node_modules/nan/nan_new.h:75: error: ‘return_t’ no nombra a un tipo
  137. ../node_modules/nan/nan_new.h:141: error: ‘return_t’ no nombra a un tipo
  138. ../node_modules/nan/nan_new.h:147: error: ‘return_t’ no nombra a un tipo
  139. ../node_modules/nan/nan_new.h:148: error: ‘return_t’ no nombra a un tipo
  140. ../node_modules/nan/nan_new.h:160: error: ‘return_t’ no nombra a un tipo
  141. ../node_modules/nan/nan_new.h:161: error: ‘return_t’ no nombra a un tipo
  142. ../node_modules/nan/nan_new.h:162: error: ‘return_t’ no nombra a un tipo
  143. ../node_modules/nan/nan_new.h:163: error: ‘return_t’ no nombra a un tipo
  144. ../node_modules/nan/nan_new.h:165: error: ‘return_t’ no nombra a un tipo
  145. ../node_modules/nan/nan_new.h:166: error: ‘return_t’ no nombra a un tipo
  146. ../node_modules/nan/nan_new.h:182: error: ‘return_t’ no nombra a un tipo
  147. ../node_modules/nan/nan_new.h:183: error: ‘return_t’ no nombra a un tipo
  148. In file included from ../node_modules/nan/nan_new.h:189,
  149.                 from ../node_modules/nan/nan.h:203,
  150.                 from ../node-expat.cc:1:
  151. ../node_modules/nan/nan_implementation_12_inl.h:61: error: ‘return_t’ en la clase ‘Nan::imp::Factory<v8::Date>’ no nombra un tipo
  152. ../node_modules/nan/nan_implementation_12_inl.h: In static member function ‘static v8::Local<v8::Function> Nan::imp::Factory<v8::Function>::New(void (*)(const Nan::FunctionCallbackInfo<v8::Value>&), v8::Local<v8::Value>)’:
  153. ../node_modules/nan/nan_implementation_12_inl.h:91: error: ‘NewInstance’ no se declaró en este ámbito
  154. ../node_modules/nan/nan_implementation_12_inl.h: In static member function ‘static v8::Local<v8::FunctionTemplate> Nan::imp::Factory<v8::FunctionTemplate>::New(void (*)(const Nan::FunctionCallbackInfo<v8::Value>&), v8::Local<v8::Value>, v8::Local<v8::Signature>)’:
  155. ../node_modules/nan/nan_implementation_12_inl.h:119: error: ‘NewInstance’ no se declaró en este ámbito
  156. ../node_modules/nan/nan_implementation_12_inl.h: At global scope:
  157. ../node_modules/nan/nan_implementation_12_inl.h:198: error: ‘return_t’ en la clase ‘Nan::imp::Factory<v8::RegExp>’ no nombra un tipo
  158. ../node_modules/nan/nan_implementation_12_inl.h:221: error: ‘return_t’ en la clase ‘Nan::imp::Factory<v8::Script>’ no nombra un tipo
  159. ../node_modules/nan/nan_implementation_12_inl.h:231: error: ‘return_t’ en la clase ‘Nan::imp::Factory<v8::Script>’ no nombra un tipo
  160. ../node_modules/nan/nan_implementation_12_inl.h:265: error: ‘return_t’ en la clase ‘Nan::imp::Factory<v8::String>’ no nombra un tipo
  161. ../node_modules/nan/nan_implementation_12_inl.h:272: error: ‘return_t’ en la clase ‘Nan::imp::Factory<v8::String>’ no nombra un tipo
  162. ../node_modules/nan/nan_implementation_12_inl.h:278: error: ‘return_t’ en la clase ‘Nan::imp::Factory<v8::String>’ no nombra un tipo
  163. ../node_modules/nan/nan_implementation_12_inl.h:285: error: ‘return_t’ en la clase ‘Nan::imp::Factory<v8::String>’ no nombra un tipo
  164. ../node_modules/nan/nan_implementation_12_inl.h:291: error: ‘return_t’ en la clase ‘Nan::imp::Factory<v8::String>’ no nombra un tipo
  165. ../node_modules/nan/nan_implementation_12_inl.h:296: error: ‘return_t’ en la clase ‘Nan::imp::Factory<v8::String>’ no nombra un tipo
  166. ../node_modules/nan/nan_implementation_12_inl.h:344: error: ‘return_t’ en la clase ‘Nan::imp::Factory<v8::UnboundScript>’ no nombra un tipo
  167. ../node_modules/nan/nan_implementation_12_inl.h:351: error: ‘return_t’ en la clase ‘Nan::imp::Factory<v8::UnboundScript>’ no nombra un tipo
  168. In file included from ../node_modules/nan/nan.h:203,
  169.                 from ../node-expat.cc:1:
  170. ../node_modules/nan/nan_new.h:293: error: ‘return_t’ en la clase ‘Nan::imp::Factory<v8::String>’ no nombra un tipo
  171. ../node_modules/nan/nan_new.h:299: error: ‘return_t’ en la clase ‘Nan::imp::Factory<v8::String>’ no nombra un tipo
  172. ../node_modules/nan/nan_new.h:305: error: ‘return_t’ en la clase ‘Nan::imp::Factory<v8::String>’ no nombra un tipo
  173. ../node_modules/nan/nan_new.h:311: error: ‘return_t’ en la clase ‘Nan::imp::Factory<v8::String>’ no nombra un tipo
  174. ../node_modules/nan/nan_new.h:317: error: ‘return_t’ en la clase ‘Nan::imp::Factory<v8::String>’ no nombra un tipo
  175. ../node_modules/nan/nan_new.h:323: error: ‘return_t’ en la clase ‘Nan::imp::Factory<v8::String>’ no nombra un tipo
  176. ../node_modules/nan/nan_new.h:329: error: ‘return_t’ en la clase ‘Nan::imp::Factory<v8::String>’ no nombra un tipo
  177. ../node_modules/nan/nan_new.h:335: error: ‘return_t’ en la clase ‘Nan::imp::Factory<v8::RegExp>’ no nombra un tipo
  178. In file included from ../node-expat.cc:1:
  179. ../node_modules/nan/nan.h:517: error: ISO C++ prohíbe la declaración de ‘MaybeLocal’ sin tipo
  180. ../node_modules/nan/nan.h:517: error: ‘MaybeLocal’ se declaró como field ‘inline’
  181. ../node_modules/nan/nan.h:517: error: expected ‘;’ before ‘<’ token
  182. ../node_modules/nan/nan.h:530: error: expected ‘;’ before ‘inline’
  183. ../node_modules/nan/nan.h:530: error: ISO C++ prohíbe la declaración de ‘MaybeLocal’ sin tipo
  184. ../node_modules/nan/nan.h:530: error: ‘MaybeLocal’ se declaró como field ‘inline’
  185. ../node_modules/nan/nan.h:530: error: expected ‘;’ before ‘<’ token
  186. ../node_modules/nan/nan.h:543: error: expected ‘;’ before ‘inline’
  187. ../node_modules/nan/nan.h:543: error: ISO C++ prohíbe la declaración de ‘MaybeLocal’ sin tipo
  188. ../node_modules/nan/nan.h:543: error: ‘MaybeLocal’ se declaró como field ‘inline’
  189. ../node_modules/nan/nan.h:543: error: expected ‘;’ before ‘<’ token
  190. ../node_modules/nan/nan.h:556: error: expected ‘;’ before ‘private’
  191. ../node_modules/nan/nan.h: In function ‘v8::Local<v8::Value> Nan::Error(const char*)’:
  192. ../node_modules/nan/nan.h:769: error: ‘class v8::Local<v8::Boolean>’ no tiene un miembro llamado ‘ToLocalChecked’
  193. ../node_modules/nan/nan.h: In function ‘void Nan::ThrowError(const char*)’:
  194. ../node_modules/nan/nan.h:769: error: ‘class v8::Local<v8::Boolean>’ no tiene un miembro llamado ‘ToLocalChecked’
  195. ../node_modules/nan/nan.h: In function ‘v8::Local<v8::Value> Nan::RangeError(const char*)’:
  196. ../node_modules/nan/nan.h:770: error: ‘class v8::Local<v8::Boolean>’ no tiene un miembro llamado ‘ToLocalChecked’
  197. ../node_modules/nan/nan.h: In function ‘void Nan::ThrowRangeError(const char*)’:
  198. ../node_modules/nan/nan.h:770: error: ‘class v8::Local<v8::Boolean>’ no tiene un miembro llamado ‘ToLocalChecked’
  199. ../node_modules/nan/nan.h: In function ‘v8::Local<v8::Value> Nan::ReferenceError(const char*)’:
  200. ../node_modules/nan/nan.h:771: error: ‘class v8::Local<v8::Boolean>’ no tiene un miembro llamado ‘ToLocalChecked’
  201. ../node_modules/nan/nan.h: In function ‘void Nan::ThrowReferenceError(const char*)’:
  202. ../node_modules/nan/nan.h:771: error: ‘class v8::Local<v8::Boolean>’ no tiene un miembro llamado ‘ToLocalChecked’
  203. ../node_modules/nan/nan.h: In function ‘v8::Local<v8::Value> Nan::SyntaxError(const char*)’:
  204. ../node_modules/nan/nan.h:772: error: ‘class v8::Local<v8::Boolean>’ no tiene un miembro llamado ‘ToLocalChecked’
  205. ../node_modules/nan/nan.h: In function ‘void Nan::ThrowSyntaxError(const char*)’:
  206. ../node_modules/nan/nan.h:772: error: ‘class v8::Local<v8::Boolean>’ no tiene un miembro llamado ‘ToLocalChecked’
  207. ../node_modules/nan/nan.h: In function ‘v8::Local<v8::Value> Nan::TypeError(const char*)’:
  208. ../node_modules/nan/nan.h:773: error: ‘class v8::Local<v8::Boolean>’ no tiene un miembro llamado ‘ToLocalChecked’
  209. ../node_modules/nan/nan.h: In function ‘void Nan::ThrowTypeError(const char*)’:
  210. ../node_modules/nan/nan.h:773: error: ‘class v8::Local<v8::Boolean>’ no tiene un miembro llamado ‘ToLocalChecked’
  211. ../node_modules/nan/nan.h: At global scope:
  212. ../node_modules/nan/nan.h:781: error: expected initializer before ‘<’ token
  213. ../node_modules/nan/nan.h:803: error: expected initializer before ‘<’ token
  214. ../node_modules/nan/nan.h:818: error: expected initializer before ‘<’ token
  215. ../node_modules/nan/nan.h:830: error: expected initializer before ‘<’ token
  216. ../node_modules/nan/nan.h:846: error: expected initializer before ‘<’ token
  217. ../node_modules/nan/nan.h:852: error: expected initializer before ‘<’ token
  218. ../node_modules/nan/nan.h:864: error: expected initializer before ‘<’ token
  219. ../node_modules/nan/nan.h:875: error: expected initializer before ‘<’ token
  220. ../node_modules/nan/nan.h:885: error: expected initializer before ‘<’ token
  221. ../node_modules/nan/nan.h:1555: error: ISO C++ prohíbe la declaración de ‘MaybeLocal’ sin tipo
  222. ../node_modules/nan/nan.h:1555: error: ‘MaybeLocal’ se declaró como field ‘inline’
  223. ../node_modules/nan/nan.h:1555: error: expected ‘;’ before ‘<’ token
  224. ../node_modules/nan/nan.h:1562: error: expected ‘;’ before ‘inline’
  225. ../node_modules/nan/nan.h:1562: error: ISO C++ prohíbe la declaración de ‘MaybeLocal’ sin tipo
  226. ../node_modules/nan/nan.h:1562: error: ‘MaybeLocal’ se declaró como field ‘inline’
  227. ../node_modules/nan/nan.h:1562: error: expected ‘;’ before ‘<’ token
  228. ../node_modules/nan/nan.h:1571: error: expected ‘;’ before ‘inline’
  229. ../node_modules/nan/nan.h:1637: error: ISO C++ prohíbe la declaración de ‘MaybeLocal’ sin tipo
  230. ../node_modules/nan/nan.h:1637: error: ‘MaybeLocal’ se declaró como field ‘inline’
  231. ../node_modules/nan/nan.h:1637: error: expected ‘;’ before ‘<’ token
  232. ../node_modules/nan/nan.h:1653: error: expected ‘;’ before ‘inline’
  233. ../node_modules/nan/nan.h:1653: error: ISO C++ prohíbe la declaración de ‘MaybeLocal’ sin tipo
  234. ../node_modules/nan/nan.h:1653: error: ‘MaybeLocal’ se declaró como field ‘inline’
  235. ../node_modules/nan/nan.h:1653: error: expected ‘;’ before ‘<’ token
  236. ../node_modules/nan/nan.h:1669: error: expected ‘;’ before ‘private’
  237. ../node_modules/nan/nan.h:1729: error: expected initializer before ‘<’ token
  238. ../node_modules/nan/nan.h:1737: error: expected initializer before ‘<’ token
  239. ../node_modules/nan/nan.h:1755: error: expected initializer before ‘<’ token
  240. ../node_modules/nan/nan.h:1769: error: expected initializer before ‘<’ token
  241. ../node_modules/nan/nan.h: In member function ‘void Nan::AsyncWorker::SaveToPersistent(const char*, const v8::Local<v8::Value>&)’:
  242. ../node_modules/nan/nan.h:1818: error: ‘class v8::Local<v8::Boolean>’ no tiene un miembro llamado ‘ToLocalChecked’
  243. ../node_modules/nan/nan.h: In member function ‘v8::Local<v8::Value> Nan::AsyncWorker::GetFromPersistent(const char*) const’:
  244. ../node_modules/nan/nan.h:1836: error: ‘class v8::Local<v8::Boolean>’ no tiene un miembro llamado ‘ToLocalChecked’
  245. ../node_modules/nan/nan.h: In member function ‘virtual void Nan::AsyncWorker::HandleOKCallback()’:
  246. ../node_modules/nan/nan.h:1866: error: no se encontró una función coincidente para la llamada a ‘Nan::Callback::Call(int, NULL, Nan::AsyncResource*&)’
  247. ../node_modules/nan/nan.h:1596: nota: los candidatos son: v8::Local<v8::Value> Nan::Callback::Call(v8::Local<v8::Object>, int, v8::Local<v8::Value>*) const
  248. ../node_modules/nan/nan.h:1618: nota:                     v8::Local<v8::Value> Nan::Callback::Call(int, v8::Local<v8::Value>*) const
  249. ../node_modules/nan/nan.h: In member function ‘virtual void Nan::AsyncWorker::HandleErrorCallback()’:
  250. ../node_modules/nan/nan.h:1873: error: no hay una función coincidente para la llamada a ‘New(const char*)’
  251. ../node_modules/nan/nan.h:1875: error: no se encontró una función coincidente para la llamada a ‘Nan::Callback::Call(int, v8::Local<v8::Value> [1], Nan::AsyncResource*&)’
  252. ../node_modules/nan/nan.h:1596: nota: los candidatos son: v8::Local<v8::Value> Nan::Callback::Call(v8::Local<v8::Object>, int, v8::Local<v8::Value>*) const
  253. ../node_modules/nan/nan.h:1618: nota:                     v8::Local<v8::Value> Nan::Callback::Call(int, v8::Local<v8::Value>*) const
  254. ../node_modules/nan/nan.h: In function ‘void Nan::imp::SetMethodAux(T, v8::Local<v8::String>, v8::Local<v8::FunctionTemplate>, ...)’:
  255. ../node_modules/nan/nan.h:2337: error: no hay argumentos para ‘GetFunction’ que dependan de un parámetro de plantilla, por lo cual una declaración de ‘GetFunction’ debe estar disponible
  256. ../node_modules/nan/nan.h:2337: nota: (si utiliza ‘-fpermissive’, G++ aceptará su código, pero permitir el uso de un nombre sin declarar es obsoleto)
  257. ../node_modules/nan/nan.h: In function ‘void Nan::SetMethod(HandleType<T>, const char*, void (*)(const Nan::FunctionCallbackInfo<v8::Value>&))’:
  258. ../node_modules/nan/nan.h:2349: error: ‘class v8::Local<v8::Boolean>’ no tiene un miembro llamado ‘ToLocalChecked’
  259. ../node_modules/nan/nan.h: In function ‘void Nan::SetPrototypeMethod(v8::Local<v8::FunctionTemplate>, const char*, void (*)(const Nan::FunctionCallbackInfo<v8::Value>&))’:
  260. ../node_modules/nan/nan.h:2364: error: ‘class v8::Local<v8::Boolean>’ no tiene un miembro llamado ‘ToLocalChecked’
  261. ../node_modules/nan/nan.h: In function ‘void Nan::SetAccessor(v8::Local<v8::ObjectTemplate>, v8::Local<v8::String>, void (*)(v8::Local<v8::String>, const Nan::PropertyCallbackInfo<v8::Value>&), void (*)(v8::Local<v8::String>, v8::Local<v8::Value>, const Nan::PropertyCallbackInfo<void>&), v8::Local<v8::Value>, v8::AccessControl, v8::PropertyAttribute, Nan::imp::Sig)’:
  262. ../node_modules/nan/nan.h:2389: error: ‘NewInstance’ no se declaró en este ámbito
  263. ../node_modules/nan/nan.h: In function ‘bool Nan::SetAccessor(v8::Local<v8::Object>, v8::Local<v8::String>, void (*)(v8::Local<v8::String>, const Nan::PropertyCallbackInfo<v8::Value>&), void (*)(v8::Local<v8::String>, v8::Local<v8::Value>, const Nan::PropertyCallbackInfo<void>&), v8::Local<v8::Value>, v8::AccessControl, v8::PropertyAttribute)’:
  264. ../node_modules/nan/nan.h:2432: error: ‘NewInstance’ no se declaró en este ámbito
  265. ../node_modules/nan/nan.h: In function ‘void Nan::SetNamedPropertyHandler(v8::Local<v8::ObjectTemplate>, void (*)(v8::Local<v8::String>, const Nan::PropertyCallbackInfo<v8::Value>&), void (*)(v8::Local<v8::String>, v8::Local<v8::Value>, const Nan::PropertyCallbackInfo<v8::Value>&), void (*)(v8::Local<v8::String>, const Nan::PropertyCallbackInfo<v8::Integer>&), void (*)(v8::Local<v8::String>, const Nan::PropertyCallbackInfo<v8::Boolean>&), void (*)(const Nan::PropertyCallbackInfo<v8::Array>&), v8::Local<v8::Value>)’:
  266. ../node_modules/nan/nan.h:2491: error: ‘NewInstance’ no se declaró en este ámbito
  267. ../node_modules/nan/nan.h: In function ‘void Nan::SetIndexedPropertyHandler(v8::Local<v8::ObjectTemplate>, void (*)(uint32_t, const Nan::PropertyCallbackInfo<v8::Value>&), void (*)(uint32_t, v8::Local<v8::Value>, const Nan::PropertyCallbackInfo<v8::Value>&), void (*)(uint32_t, const Nan::PropertyCallbackInfo<v8::Integer>&), void (*)(uint32_t, const Nan::PropertyCallbackInfo<v8::Boolean>&), void (*)(const Nan::PropertyCallbackInfo<v8::Array>&), v8::Local<v8::Value>)’:
  268. ../node_modules/nan/nan.h:2561: error: ‘NewInstance’ no se declaró en este ámbito
  269. ../node_modules/nan/nan.h: In function ‘void Nan::SetCallHandler(v8::Local<v8::FunctionTemplate>, void (*)(const Nan::FunctionCallbackInfo<v8::Value>&), v8::Local<v8::Value>)’:
  270. ../node_modules/nan/nan.h:2616: error: ‘NewInstance’ no se declaró en este ámbito
  271. ../node_modules/nan/nan.h: In function ‘void Nan::SetCallAsFunctionHandler(v8::Local<v8::ObjectTemplate>, void (*)(const Nan::FunctionCallbackInfo<v8::Value>&), v8::Local<v8::Value>)’:
  272. ../node_modules/nan/nan.h:2638: error: ‘NewInstance’ no se declaró en este ámbito
  273. In file included from ../node_modules/nan/nan.h:2661,
  274.                 from ../node-expat.cc:1:
  275. ../node_modules/nan/nan_private.h: At global scope:
  276. ../node_modules/nan/nan_private.h:12: error: expected initializer before ‘<’ token
  277. ../node_modules/nan/nan_private.h:25: error: expected initializer before ‘<’ token
  278. ../node-expat.cc:498: error: expected ‘}’ at end of input
  279. make: *** [Release/obj.target/node_expat/node-expat.o] Error 1
  280. make: se sale del directorio `/home/student/course/pep/fiware-pep-proxy-master/node_modules/xml2json/node_modules/node-expat/build'
  281. gyp ERR! build error
  282. gyp ERR! stack Error: `make` failed with exit code: 2
  283. gyp ERR! stack     at ChildProcess.onExit (/usr/local/lib/node_modules/npm/node_modules/node-gyp/lib/build.js:270:23)
  284. gyp ERR! stack     at emitTwo (events.js:87:13)
  285. gyp ERR! stack     at ChildProcess.emit (events.js:172:7)
  286. gyp ERR! stack     at Process.ChildProcess._handle.onexit (internal/child_process.js:200:12)
  287. gyp ERR! System Linux 2.6.32-573.12.1.el6.x86_64
  288. gyp ERR! command "/usr/local/bin/node" "/usr/local/lib/node_modules/npm/node_modules/node-gyp/bin/node-gyp.js" "rebuild"
  289. gyp ERR! cwd /home/student/course/pep/fiware-pep-proxy-master/node_modules/xml2json/node_modules/node-expat
  290. gyp ERR! node -v v4.2.3
  291. gyp ERR! node-gyp -v v3.0.3
  292. gyp ERR! not ok
  293. npm ERR! Linux 2.6.32-573.12.1.el6.x86_64
  294. npm ERR! argv "/usr/local/bin/node" "/usr/local/bin/npm" "install"
  295. npm ERR! node v4.2.3
  296. npm ERR! npm  v2.14.7
  297. npm ERR! code ELIFECYCLE
  298.  
  299. npm ERR! node-expat@2.3.16 install: `node-gyp rebuild`
  300. npm ERR! Exit status 1
  301. npm ERR!
  302. npm ERR! Failed at the node-expat@2.3.16 install script 'node-gyp rebuild'.
  303. npm ERR! This is most likely a problem with the node-expat package,
  304. npm ERR! not with npm itself.
  305. npm ERR! Tell the author that this fails on your system:
  306. npm ERR!     node-gyp rebuild
  307. npm ERR! You can get their info via:
  308. npm ERR!     npm owner ls node-expat
  309. npm ERR! There is likely additional logging output above.
  310.  
  311. npm ERR! Please include the following file with any support request:
  312. npm ERR!     /home/student/course/pep/fiware-pep-proxy-master/npm-debug.log
RAW Paste Data
We use cookies for various purposes including analytics. By continuing to use Pastebin, you agree to our use of cookies as described in the Cookies Policy. OK, I Understand
Top