Advertisement
silver2row

Native_SDK error?

Jan 28th, 2022
1,481
0
Never
Not a member of Pastebin yet? Sign Up, it unlocks many cool features!
Bash 0.34 KB | None | 0 0
  1. collect2: error: ld returned 1 exit status
  2. gmake[2]: *** [examples/OpenGLES/PVRScopeExample/CMakeFiles/OpenGLESPVRScopeExample.dir/build.make:177: bin/OpenGLESPVRScopeExample] Error 1
  3. gmake[1]: *** [CMakeFiles/Makefile2:3738: examples/OpenGLES/PVRScopeExample/CMakeFiles/OpenGLESPVRScopeExample.dir/all] Error 2
  4. gmake: *** [Makefile:149: all] Error 2
Advertisement
Add Comment
Please, Sign In to add comment
Advertisement