dominus

Untitled

Sep 28th, 2020
110
Never
Not a member of Pastebin yet? Sign Up, it unlocks many cool features!
  1. dtk@DTK mame % make -j1 SDL_INSTALL_ROOT=/opt/arm VERBOSE=1 macosx_arm64_clang
  2. Clang 12.0.0 detected
  3. /Applications/Xcode-beta.app/Contents/Developer/usr/bin/make -R verbose=1 -C build/projects/sdl/mame/gmake-osx-clang config=release64 precompile
  4. /Applications/Xcode-beta.app/Contents/Developer/usr/bin/make -R verbose=1 -C build/projects/sdl/mame/gmake-osx-clang config=release64
  5. Compiling src/osd/modules/input/input_common.cpp...
  6. clang++ -MMD -MP -MP -DPTR64=1 -DNDEBUG -DCRLF=2 -DLSB_FIRST -DFLAC__NO_DLL -DPUGIXML_HEADER_ONLY -DMAME_NOASM -DLUA_COMPAT_ALL -DLUA_COMPAT_5_1 -DLUA_COMPAT_5_2 -DSDLMAME_NO_X11 -DUSE_XINPUT=0 -DUSE_XINPUT_WII_LIGHTGUN_HACK=0 -DSDLMAME_SDL2=1 -DOSD_SDL -DSDLMAME_UNIX -DSDLMAME_MACOSX -DSDLMAME_DARWIN -DUSE_OPENGL=1 -D__STDC_LIMIT_MACROS -D__STDC_FORMAT_MACROS -D__STDC_CONSTANT_MACROS -DIMGUI_DISABLE_OBSOLETE_FUNCTIONS -DUSE_QTDEBUG=0 -I"../../../../../3rdparty/bx/include/compat/osx" -I"../../../../../3rdparty/asio/include" -I"../../../../../3rdparty/bgfx/examples/common" -I"../../../../../3rdparty/bgfx/include" -I"../../../../../3rdparty/bgfx/3rdparty" -I"../../../../../3rdparty/bgfx/3rdparty/khronos" -I"../../../../../3rdparty/bx/include" -I"../../../../../3rdparty/rapidjson/include" -I"../../../../../3rdparty/portaudio/include" -I"../../../../../3rdparty/portmidi/pm_common" -I"../../../../../src/emu" -I"../../../../../src/devices" -I"../../../../../src/osd" -I"../../../../../src/lib" -I"../../../../../src/lib/util" -I"../../../../../src/osd/modules/file" -I"../../../../../src/osd/modules/render" -I"../../../../../3rdparty" -I"../../../../../src/osd/sdl" -m64 -arch arm64 -pipe -Werror -O3 -fno-strict-aliasing -Wno-unknown-pragmas -Wall -Wcast-align -Wundef -Wformat-security -Wwrite-strings -Wno-sign-compare -Wno-conversion -Wno-error=deprecated-declarations -Wno-cast-align -Wno-tautological-compare -Wno-unused-value -Wno-constant-logical-operand -fdiagnostics-show-note-include-stack -Wno-unknown-warning-option -Wno-extern-c-compat -Wno-unknown-attributes -Wno-ignored-qualifiers -Wno-pragma-pack -m64 -DHAVE_IMMINTRIN_H=1 -F/Library/Frameworks/ -std=c++14 -Woverloaded-virtual -include /Users/dtk/code/mame/src/osd/sdl/sdlprefix.h -o "../../../../osx_clang/obj/x64/Release/osd_sdl/src/osd/modules/input/input_common.o" -c "../../../../../src/osd/modules/input/input_common.cpp"
  7. ../../../../../src/osd/modules/input/input_common.cpp:36:10: error: 'SDL2/SDL.h' file not found with <angled>
  8. include; use "quotes" instead
  9. #include <SDL2/SDL.h>
  10. ^~~~~~~~~~~~
  11. "SDL2/SDL.h"
  12. In file included from ../../../../../src/osd/modules/input/input_common.cpp:36:
  13. In file included from ../../../../../src/osd/modules/input/SDL2/SDL.h:38:
  14. In file included from ../../../../../src/osd/modules/input/SDL2/SDL_cpuinfo.h:86:
  15. In file included from /Applications/Xcode-beta.app/Contents/Developer/Toolchains/XcodeDefault.xctoolchain/usr/lib/clang/12.0.0/include/immintrin.h:14:
  16. /Applications/Xcode-beta.app/Contents/Developer/Toolchains/XcodeDefault.xctoolchain/usr/lib/clang/12.0.0/include/mmintrin.h:33:5: error:
  17. use of undeclared identifier '__builtin_ia32_emms'; did you mean '__builtin_isless'?
  18. __builtin_ia32_emms();
  19. ^
  20. In file included from ../../../../../src/osd/modules/input/input_common.cpp:11:
  21. In file included from ../../../../../src/osd/modules/input/input_module.h:12:
  22. In file included from ../../../../../src/osd/osdepend.h:16:
  23. In file included from ../../../../../src/emu/emucore.h:17:
  24. In file included from /Applications/Xcode-beta.app/Contents/Developer/Toolchains/XcodeDefault.xctoolchain/usr/bin/../include/c++/v1/cassert:20:
  25. In file included from /Applications/xcode-beta.app/contents/developer/Platforms/MacOSX.platform/Developer/SDKs/MacOSX.sdk/usr/include/assert.h:44:
  26. In file included from /Applications/Xcode-beta.app/Contents/Developer/Toolchains/XcodeDefault.xctoolchain/usr/bin/../include/c++/v1/stdlib.h:100:
  27. /Applications/Xcode-beta.app/Contents/Developer/Toolchains/XcodeDefault.xctoolchain/usr/bin/../include/c++/v1/math.h:647:12: note:
  28. '__builtin_isless' declared here
  29. return isless(__lcpp_x, __lcpp_y);
  30. ^
  31. In file included from ../../../../../src/osd/modules/input/input_common.cpp:11:
  32. In file included from ../../../../../src/osd/modules/input/input_module.h:12:
  33. In file included from ../../../../../src/osd/osdepend.h:16:
  34. In file included from ../../../../../src/emu/emucore.h:17:
  35. In file included from /Applications/Xcode-beta.app/Contents/Developer/Toolchains/XcodeDefault.xctoolchain/usr/bin/../include/c++/v1/cassert:20:
  36. In file included from /Applications/xcode-beta.app/contents/developer/Platforms/MacOSX.platform/Developer/SDKs/MacOSX.sdk/usr/include/assert.h:44:
  37. In file included from /Applications/Xcode-beta.app/Contents/Developer/Toolchains/XcodeDefault.xctoolchain/usr/bin/../include/c++/v1/stdlib.h:100:
  38. In file included from /Applications/Xcode-beta.app/Contents/Developer/Toolchains/XcodeDefault.xctoolchain/usr/bin/../include/c++/v1/math.h:303:
  39. /Applications/xcode-beta.app/contents/developer/Platforms/MacOSX.platform/Developer/SDKs/MacOSX.sdk/usr/include/math.h:545:22: note:
  40. expanded from macro 'isless'
  41. #define isless(x, y) __builtin_isless((x),(y))
  42. ^
  43. In file included from ../../../../../src/osd/modules/input/input_common.cpp:36:
  44. In file included from ../../../../../src/osd/modules/input/SDL2/SDL.h:38:
  45. In file included from ../../../../../src/osd/modules/input/SDL2/SDL_cpuinfo.h:86:
  46. In file included from /Applications/Xcode-beta.app/Contents/Developer/Toolchains/XcodeDefault.xctoolchain/usr/lib/clang/12.0.0/include/immintrin.h:14:
  47. /Applications/Xcode-beta.app/Contents/Developer/Toolchains/XcodeDefault.xctoolchain/usr/lib/clang/12.0.0/include/mmintrin.h:33:25: error:
  48. too few arguments to function call, expected 2, have 0
  49. __builtin_ia32_emms();
  50. ^
  51. /Applications/Xcode-beta.app/Contents/Developer/Toolchains/XcodeDefault.xctoolchain/usr/lib/clang/12.0.0/include/mmintrin.h:50:19: error:
  52. use of undeclared identifier '__builtin_ia32_vec_init_v2si'
  53. return (__m64)__builtin_ia32_vec_init_v2si(__i, 0);
  54. ^
  55. /Applications/Xcode-beta.app/Contents/Developer/Toolchains/XcodeDefault.xctoolchain/usr/lib/clang/12.0.0/include/mmintrin.h:67:12: error:
  56. use of undeclared identifier '__builtin_ia32_vec_ext_v2si'
  57. return __builtin_ia32_vec_ext_v2si((__v2si)__m, 0);
  58. ^
  59. /Applications/Xcode-beta.app/Contents/Developer/Toolchains/XcodeDefault.xctoolchain/usr/lib/clang/12.0.0/include/mmintrin.h:129:19: error:
  60. use of undeclared identifier '__builtin_ia32_packsswb'
  61. return (__m64)__builtin_ia32_packsswb((__v4hi)__m1, (__v4hi)__m2);
  62. ^
  63. /Applications/Xcode-beta.app/Contents/Developer/Toolchains/XcodeDefault.xctoolchain/usr/lib/clang/12.0.0/include/mmintrin.h:159:19: error:
  64. use of undeclared identifier '__builtin_ia32_packssdw'
  65. return (__m64)__builtin_ia32_packssdw((__v2si)__m1, (__v2si)__m2);
  66. ^
  67. /Applications/Xcode-beta.app/Contents/Developer/Toolchains/XcodeDefault.xctoolchain/usr/lib/clang/12.0.0/include/mmintrin.h:189:19: error:
  68. use of undeclared identifier '__builtin_ia32_packuswb'
  69. return (__m64)__builtin_ia32_packuswb((__v4hi)__m1, (__v4hi)__m2);
  70. ^
  71. /Applications/Xcode-beta.app/Contents/Developer/Toolchains/XcodeDefault.xctoolchain/usr/lib/clang/12.0.0/include/mmintrin.h:216:19: error:
  72. use of undeclared identifier '__builtin_ia32_punpckhbw'
  73. return (__m64)__builtin_ia32_punpckhbw((__v8qi)__m1, (__v8qi)__m2);
  74. ^
  75. /Applications/Xcode-beta.app/Contents/Developer/Toolchains/XcodeDefault.xctoolchain/usr/lib/clang/12.0.0/include/mmintrin.h:239:19: error:
  76. use of undeclared identifier '__builtin_ia32_punpckhwd'
  77. return (__m64)__builtin_ia32_punpckhwd((__v4hi)__m1, (__v4hi)__m2);
  78. ^
  79. /Applications/Xcode-beta.app/Contents/Developer/Toolchains/XcodeDefault.xctoolchain/usr/lib/clang/12.0.0/include/mmintrin.h:260:19: error:
  80. use of undeclared identifier '__builtin_ia32_punpckhdq'
  81. return (__m64)__builtin_ia32_punpckhdq((__v2si)__m1, (__v2si)__m2);
  82. ^
  83. /Applications/Xcode-beta.app/Contents/Developer/Toolchains/XcodeDefault.xctoolchain/usr/lib/clang/12.0.0/include/mmintrin.h:287:19: error:
  84. use of undeclared identifier '__builtin_ia32_punpcklbw'
  85. return (__m64)__builtin_ia32_punpcklbw((__v8qi)__m1, (__v8qi)__m2);
  86. ^
  87. /Applications/Xcode-beta.app/Contents/Developer/Toolchains/XcodeDefault.xctoolchain/usr/lib/clang/12.0.0/include/mmintrin.h:310:19: error:
  88. use of undeclared identifier '__builtin_ia32_punpcklwd'
  89. return (__m64)__builtin_ia32_punpcklwd((__v4hi)__m1, (__v4hi)__m2);
  90. ^
  91. /Applications/Xcode-beta.app/Contents/Developer/Toolchains/XcodeDefault.xctoolchain/usr/lib/clang/12.0.0/include/mmintrin.h:331:19: error:
  92. use of undeclared identifier '__builtin_ia32_punpckldq'
  93. return (__m64)__builtin_ia32_punpckldq((__v2si)__m1, (__v2si)__m2);
  94. ^
  95. /Applications/Xcode-beta.app/Contents/Developer/Toolchains/XcodeDefault.xctoolchain/usr/lib/clang/12.0.0/include/mmintrin.h:352:19: error:
  96. use of undeclared identifier '__builtin_ia32_paddb'; did you mean '__builtin_arm_addg'?
  97. return (__m64)__builtin_ia32_paddb((__v8qi)__m1, (__v8qi)__m2);
  98. ^
  99. /Applications/Xcode-beta.app/Contents/Developer/Toolchains/XcodeDefault.xctoolchain/usr/lib/clang/12.0.0/include/mmintrin.h:352:19: note:
  100. '__builtin_arm_addg' declared here
  101. /Applications/Xcode-beta.app/Contents/Developer/Toolchains/XcodeDefault.xctoolchain/usr/lib/clang/12.0.0/include/mmintrin.h:352:19: error:
  102. first argument of MTE builtin function must be a pointer ('__v8qi' (vector of 8 'char' values) invalid)
  103. return (__m64)__builtin_ia32_paddb((__v8qi)__m1, (__v8qi)__m2);
  104. ^ ~~~~~~~~~~~~
  105. /Applications/Xcode-beta.app/Contents/Developer/Toolchains/XcodeDefault.xctoolchain/usr/lib/clang/12.0.0/include/mmintrin.h:373:19: error:
  106. use of undeclared identifier '__builtin_ia32_paddw'; did you mean '__builtin_arm_addg'?
  107. return (__m64)__builtin_ia32_paddw((__v4hi)__m1, (__v4hi)__m2);
  108. ^
  109. /Applications/Xcode-beta.app/Contents/Developer/Toolchains/XcodeDefault.xctoolchain/usr/lib/clang/12.0.0/include/mmintrin.h:352:19: note:
  110. '__builtin_arm_addg' declared here
  111. return (__m64)__builtin_ia32_paddb((__v8qi)__m1, (__v8qi)__m2);
  112. ^
  113. /Applications/Xcode-beta.app/Contents/Developer/Toolchains/XcodeDefault.xctoolchain/usr/lib/clang/12.0.0/include/mmintrin.h:373:19: error:
  114. first argument of MTE builtin function must be a pointer ('__v4hi' (vector of 4 'short' values) invalid)
  115. return (__m64)__builtin_ia32_paddw((__v4hi)__m1, (__v4hi)__m2);
  116. ^ ~~~~~~~~~~~~
  117. /Applications/Xcode-beta.app/Contents/Developer/Toolchains/XcodeDefault.xctoolchain/usr/lib/clang/12.0.0/include/mmintrin.h:394:19: error:
  118. use of undeclared identifier '__builtin_ia32_paddd'; did you mean '__builtin_arm_addg'?
  119. return (__m64)__builtin_ia32_paddd((__v2si)__m1, (__v2si)__m2);
  120. ^
  121. /Applications/Xcode-beta.app/Contents/Developer/Toolchains/XcodeDefault.xctoolchain/usr/lib/clang/12.0.0/include/mmintrin.h:352:19: note:
  122. '__builtin_arm_addg' declared here
  123. return (__m64)__builtin_ia32_paddb((__v8qi)__m1, (__v8qi)__m2);
  124. ^
  125. fatal error: too many errors emitted, stopping now [-ferror-limit=]
  126. 20 errors generated.
  127. make[2]: *** [../../../../osx_clang/obj/x64/Release/osd_sdl/src/osd/modules/input/input_common.o] Error 1
  128. make[1]: *** [osd_sdl] Error 2
  129. make: *** [macosx_arm64_clang] Error 2
  130.  
RAW Paste Data