darash

Untitled

Oct 27th, 2018
132
Never
Not a member of Pastebin yet? Sign Up, it unlocks many cool features!
  1. This file contains any messages produced by compilers while
  2. running configure, to aid debugging if configure makes a mistake.
  3.  
  4. It was created by GNU C Runtime Library configure 1.0, which was
  5. generated by GNU Autoconf 2.64. Invocation command line was
  6.  
  7. $ /tmp/yaourt-tmp-karel/aur-gcc47/src/gcc-4.7.4/libgcc/configure --cache-file=./config.cache --prefix=/usr --libdir=/usr/lib --libexecdir=/usr/lib --mandir=/usr/share/man --infodir=/usr/share/info --with-bugurl=https://bugs.archlinux.org/ --enable-shared --enable-threads=posix --with-system-zlib --enable-__cxa_atexit --disable-libunwind-exceptions --enable-clocale=gnu --disable-libstdcxx-pch --enable-libstdcxx-time --enable-gnu-unique-object --enable-linker-build-id --with-ppl --enable-cloog-backend=isl --disable-ppl-version-check --disable-cloog-version-check --enable-lto --enable-gold --enable-ld=default --enable-plugin --with-plugin-ld=ld.gold --disable-libmudflap --disable-libquadmath --disable-libitm --with-linker-hash-style=gnu --disable-multilib --disable-libssp --disable-build-with-cxx --disable-build-poststage1-with-cxx --enable-version-specific-runtime-libs --enable-checking=release --enable-languages=c,c++,lto --program-transform-name=s&$&-4.7& --disable-option-checking --with-target-subdir=x86_64-unknown-linux-gnu --build=x86_64-unknown-linux-gnu --host=x86_64-unknown-linux-gnu --target=x86_64-unknown-linux-gnu --srcdir=/tmp/yaourt-tmp-karel/aur-gcc47/src/gcc-4.7.4/libgcc --disable-intermodule --enable-checking=release,types --disable-coverage --enable-languages=c,lto
  8.  
  9. ## --------- ##
  10. ## Platform. ##
  11. ## --------- ##
  12.  
  13. hostname = karel-macbook
  14. uname -m = x86_64
  15. uname -r = 4.18.12-arch1-1-ARCH
  16. uname -s = Linux
  17. uname -v = #1 SMP PREEMPT Thu Oct 4 01:01:27 UTC 2018
  18.  
  19. /usr/bin/uname -p = unknown
  20. /bin/uname -X = unknown
  21.  
  22. /bin/arch = unknown
  23. /usr/bin/arch -k = unknown
  24. /usr/convex/getsysinfo = unknown
  25. /usr/bin/hostinfo = unknown
  26. /bin/machine = unknown
  27. /usr/bin/oslevel = unknown
  28. /bin/universe = unknown
  29.  
  30. PATH: /home/karel/working/chease/scripts_for_bin
  31. PATH: /home/karel/.local/bin/
  32. PATH: /home/karel/usr/local/bin
  33. PATH: /home/karel/working/chease/scripts_for_bin
  34. PATH: /home/karel/.local/bin/
  35. PATH: /home/karel/usr/local/bin
  36. PATH: /usr/local/sbin
  37. PATH: /usr/local/bin
  38. PATH: /usr/bin
  39. PATH: /usr/lib/jvm/default/bin
  40. PATH: /usr/bin/site_perl
  41. PATH: /usr/bin/vendor_perl
  42. PATH: /usr/bin/core_perl
  43. PATH: /usr/NX/bin
  44. PATH: /opt/cuda/bin/
  45. PATH: /opt/intel/bin
  46. PATH: /usr/NX/bin
  47. PATH: /opt/cuda/bin/
  48. PATH: /opt/intel/bin
  49.  
  50.  
  51. ## ----------- ##
  52. ## Core tests. ##
  53. ## ----------- ##
  54.  
  55. configure:1968: loading cache ./config.cache
  56. configure:2144: checking build system type
  57. configure:2158: result: x86_64-unknown-linux-gnu
  58. configure:2178: checking host system type
  59. configure:2191: result: x86_64-unknown-linux-gnu
  60. configure:2289: checking for --enable-version-specific-runtime-libs
  61. configure:2302: result: yes
  62. configure:2350: checking for a BSD-compatible install
  63. configure:2418: result: /usr/bin/install -c
  64. configure:2434: checking for gawk
  65. configure:2461: result: gawk
  66. configure:2561: checking for x86_64-unknown-linux-gnu-ar
  67. configure:2588: result: ar
  68. configure:2653: checking for x86_64-unknown-linux-gnu-lipo
  69. configure:2680: result: lipo
  70. configure:2745: checking for x86_64-unknown-linux-gnu-nm
  71. configure:2772: result: /tmp/yaourt-tmp-karel/aur-gcc47/src/./gcc/nm
  72. configure:2837: checking for x86_64-unknown-linux-gnu-ranlib
  73. configure:2864: result: ranlib
  74. configure:2929: checking for x86_64-unknown-linux-gnu-strip
  75. configure:2956: result: strip
  76. configure:3018: checking whether ln -s works
  77. configure:3022: result: yes
  78. configure:3039: checking for x86_64-unknown-linux-gnu-gcc
  79. configure:3066: result: /tmp/yaourt-tmp-karel/aur-gcc47/src/./gcc/xgcc -B/tmp/yaourt-tmp-karel/aur-gcc47/src/./gcc/ -B/usr/x86_64-unknown-linux-gnu/bin/ -B/usr/x86_64-unknown-linux-gnu/lib/ -isystem /usr/x86_64-unknown-linux-gnu/include -isystem /usr/x86_64-unknown-linux-gnu/sys-include
  80. configure:3335: checking for C compiler version
  81. configure:3344: /tmp/yaourt-tmp-karel/aur-gcc47/src/./gcc/xgcc -B/tmp/yaourt-tmp-karel/aur-gcc47/src/./gcc/ -B/usr/x86_64-unknown-linux-gnu/bin/ -B/usr/x86_64-unknown-linux-gnu/lib/ -isystem /usr/x86_64-unknown-linux-gnu/include -isystem /usr/x86_64-unknown-linux-gnu/sys-include --version >&5
  82. xgcc (GCC) 4.7.4
  83. Copyright (C) 2012 Free Software Foundation, Inc.
  84. This is free software; see the source for copying conditions. There is NO
  85. warranty; not even for MERCHANTABILITY or FITNESS FOR A PARTICULAR PURPOSE.
  86.  
  87. configure:3355: $? = 0
  88. configure:3344: /tmp/yaourt-tmp-karel/aur-gcc47/src/./gcc/xgcc -B/tmp/yaourt-tmp-karel/aur-gcc47/src/./gcc/ -B/usr/x86_64-unknown-linux-gnu/bin/ -B/usr/x86_64-unknown-linux-gnu/lib/ -isystem /usr/x86_64-unknown-linux-gnu/include -isystem /usr/x86_64-unknown-linux-gnu/sys-include -v >&5
  89. Reading specs from /tmp/yaourt-tmp-karel/aur-gcc47/src/./gcc/specs
  90. COLLECT_GCC=/tmp/yaourt-tmp-karel/aur-gcc47/src/./gcc/xgcc
  91. COLLECT_LTO_WRAPPER=/tmp/yaourt-tmp-karel/aur-gcc47/src/./gcc/lto-wrapper
  92. Target: x86_64-unknown-linux-gnu
  93. Configured with: /tmp/yaourt-tmp-karel/aur-gcc47/src/gcc-4.7.4/configure --prefix=/usr --libdir=/usr/lib --libexecdir=/usr/lib --mandir=/usr/share/man --infodir=/usr/share/info --with-bugurl=https://bugs.archlinux.org/ --enable-languages=c,c++ --enable-shared --enable-threads=posix --with-system-zlib --enable-__cxa_atexit --disable-libunwind-exceptions --enable-clocale=gnu --disable-libstdcxx-pch --enable-libstdcxx-time --enable-gnu-unique-object --enable-linker-build-id --with-ppl --enable-cloog-backend=isl --disable-ppl-version-check --disable-cloog-version-check --enable-lto --enable-gold --enable-ld=default --enable-plugin --with-plugin-ld=ld.gold --disable-libmudflap --disable-libquadmath --disable-libitm --with-linker-hash-style=gnu --disable-multilib --disable-libssp --disable-build-with-cxx --disable-build-poststage1-with-cxx --program-suffix=-4.7 --enable-version-specific-runtime-libs --enable-checking=release : (reconfigured) /tmp/yaourt-tmp-karel/aur-gcc47/src/gcc-4.7.4/configure --prefix=/usr --libdir=/usr/lib --libexecdir=/usr/lib --mandir=/usr/share/man --infodir=/usr/share/info --with-bugurl=https://bugs.archlinux.org/ --enable-languages=c,c++ --enable-shared --enable-threads=posix --with-system-zlib --enable-__cxa_atexit --disable-libunwind-exceptions --enable-clocale=gnu --disable-libstdcxx-pch --enable-libstdcxx-time --enable-gnu-unique-object --enable-linker-build-id --with-ppl --enable-cloog-backend=isl --disable-ppl-version-check --disable-cloog-version-check --enable-lto --enable-gold --enable-ld=default --enable-plugin --with-plugin-ld=ld.gold --disable-libmudflap --disable-libquadmath --disable-libitm --with-linker-hash-style=gnu --disable-multilib --disable-libssp --disable-build-with-cxx --disable-build-poststage1-with-cxx --program-suffix=-4.7 --enable-version-specific-runtime-libs --enable-checking=release
  94. Thread model: posix
  95. gcc version 4.7.4 (GCC)
  96. configure:3355: $? = 0
  97. configure:3344: /tmp/yaourt-tmp-karel/aur-gcc47/src/./gcc/xgcc -B/tmp/yaourt-tmp-karel/aur-gcc47/src/./gcc/ -B/usr/x86_64-unknown-linux-gnu/bin/ -B/usr/x86_64-unknown-linux-gnu/lib/ -isystem /usr/x86_64-unknown-linux-gnu/include -isystem /usr/x86_64-unknown-linux-gnu/sys-include -V >&5
  98. xgcc: error: unrecognized command line option '-V'
  99. xgcc: fatal error: no input files
  100. compilation terminated.
  101. configure:3355: $? = 1
  102. configure:3344: /tmp/yaourt-tmp-karel/aur-gcc47/src/./gcc/xgcc -B/tmp/yaourt-tmp-karel/aur-gcc47/src/./gcc/ -B/usr/x86_64-unknown-linux-gnu/bin/ -B/usr/x86_64-unknown-linux-gnu/lib/ -isystem /usr/x86_64-unknown-linux-gnu/include -isystem /usr/x86_64-unknown-linux-gnu/sys-include -qversion >&5
  103. xgcc: error: unrecognized command line option '-qversion'
  104. xgcc: fatal error: no input files
  105. compilation terminated.
  106. configure:3355: $? = 1
  107. configure:3371: /tmp/yaourt-tmp-karel/aur-gcc47/src/./gcc/xgcc -B/tmp/yaourt-tmp-karel/aur-gcc47/src/./gcc/ -B/usr/x86_64-unknown-linux-gnu/bin/ -B/usr/x86_64-unknown-linux-gnu/lib/ -isystem /usr/x86_64-unknown-linux-gnu/include -isystem /usr/x86_64-unknown-linux-gnu/sys-include -o conftest -g -march=x86-64 -mtune=generic -O2 -fstack-protector -fno-plt conftest.c >&5
  108. xgcc: error: unrecognized command line option '-fno-plt'
  109. configure:3374: $? = 1
  110. configure:3562: checking for suffix of object files
  111. configure:3584: /tmp/yaourt-tmp-karel/aur-gcc47/src/./gcc/xgcc -B/tmp/yaourt-tmp-karel/aur-gcc47/src/./gcc/ -B/usr/x86_64-unknown-linux-gnu/bin/ -B/usr/x86_64-unknown-linux-gnu/lib/ -isystem /usr/x86_64-unknown-linux-gnu/include -isystem /usr/x86_64-unknown-linux-gnu/sys-include -c -g -march=x86-64 -mtune=generic -O2 -fstack-protector -fno-plt conftest.c >&5
  112. xgcc: error: unrecognized command line option '-fno-plt'
  113. configure:3588: $? = 1
  114. configure: failed program was:
  115. | /* confdefs.h */
  116. | #define PACKAGE_NAME "GNU C Runtime Library"
  117. | #define PACKAGE_TARNAME "libgcc"
  118. | #define PACKAGE_VERSION "1.0"
  119. | #define PACKAGE_STRING "GNU C Runtime Library 1.0"
  120. | #define PACKAGE_BUGREPORT ""
  121. | #define PACKAGE_URL "http://www.gnu.org/software/libgcc/"
  122. | /* end confdefs.h. */
  123. |
  124. | int
  125. | main ()
  126. | {
  127. |
  128. | ;
  129. | return 0;
  130. | }
  131. configure:3602: error: in `/tmp/yaourt-tmp-karel/aur-gcc47/src/x86_64-unknown-linux-gnu/libgcc':
  132. configure:3605: error: cannot compute suffix of object files: cannot compile
  133. See `config.log' for more details.
  134.  
  135. ## ---------------- ##
  136. ## Cache variables. ##
  137. ## ---------------- ##
  138.  
  139. ac_cv_build=x86_64-unknown-linux-gnu
  140. ac_cv_env_CC_set=set
  141. ac_cv_env_CC_value='/tmp/yaourt-tmp-karel/aur-gcc47/src/./gcc/xgcc -B/tmp/yaourt-tmp-karel/aur-gcc47/src/./gcc/ -B/usr/x86_64-unknown-linux-gnu/bin/ -B/usr/x86_64-unknown-linux-gnu/lib/ -isystem /usr/x86_64-unknown-linux-gnu/include -isystem /usr/x86_64-unknown-linux-gnu/sys-include '
  142. ac_cv_env_CFLAGS_set=set
  143. ac_cv_env_CFLAGS_value='-g -march=x86-64 -mtune=generic -O2 -fstack-protector -fno-plt'
  144. ac_cv_env_CPPFLAGS_set=set
  145. ac_cv_env_CPPFLAGS_value=
  146. ac_cv_env_CPP_set=
  147. ac_cv_env_CPP_value=
  148. ac_cv_env_LDFLAGS_set=set
  149. ac_cv_env_LDFLAGS_value=
  150. ac_cv_env_LIBS_set=
  151. ac_cv_env_LIBS_value=
  152. ac_cv_env_build_alias_set=set
  153. ac_cv_env_build_alias_value=x86_64-unknown-linux-gnu
  154. ac_cv_env_host_alias_set=set
  155. ac_cv_env_host_alias_value=x86_64-unknown-linux-gnu
  156. ac_cv_env_target_alias_set=set
  157. ac_cv_env_target_alias_value=x86_64-unknown-linux-gnu
  158. ac_cv_host=x86_64-unknown-linux-gnu
  159. ac_cv_prog_AR=ar
  160. ac_cv_prog_AWK=gawk
  161. ac_cv_prog_CC='/tmp/yaourt-tmp-karel/aur-gcc47/src/./gcc/xgcc -B/tmp/yaourt-tmp-karel/aur-gcc47/src/./gcc/ -B/usr/x86_64-unknown-linux-gnu/bin/ -B/usr/x86_64-unknown-linux-gnu/lib/ -isystem /usr/x86_64-unknown-linux-gnu/include -isystem /usr/x86_64-unknown-linux-gnu/sys-include '
  162. ac_cv_prog_LIPO=lipo
  163. ac_cv_prog_NM=/tmp/yaourt-tmp-karel/aur-gcc47/src/./gcc/nm
  164. ac_cv_prog_RANLIB=ranlib
  165. ac_cv_prog_STRIP=strip
  166.  
  167. ## ----------------- ##
  168. ## Output variables. ##
  169. ## ----------------- ##
  170.  
  171. AR='ar'
  172. AWK='gawk'
  173. CC='/tmp/yaourt-tmp-karel/aur-gcc47/src/./gcc/xgcc -B/tmp/yaourt-tmp-karel/aur-gcc47/src/./gcc/ -B/usr/x86_64-unknown-linux-gnu/bin/ -B/usr/x86_64-unknown-linux-gnu/lib/ -isystem /usr/x86_64-unknown-linux-gnu/include -isystem /usr/x86_64-unknown-linux-gnu/sys-include '
  174. CFLAGS='-g -march=x86-64 -mtune=generic -O2 -fstack-protector -fno-plt'
  175. CPP=''
  176. CPPFLAGS=''
  177. DEFS=''
  178. ECHO_C=''
  179. ECHO_N='-n'
  180. ECHO_T=''
  181. EXEEXT=''
  182. INSTALL_DATA='/usr/bin/install -c -m 644'
  183. INSTALL_PROGRAM='/usr/bin/install -c'
  184. INSTALL_SCRIPT='/usr/bin/install -c'
  185. LDFLAGS=''
  186. LIBOBJS=''
  187. LIBS=''
  188. LIPO='lipo'
  189. LN_S='ln -s'
  190. LTLIBOBJS=''
  191. MAINT='#'
  192. NM='/tmp/yaourt-tmp-karel/aur-gcc47/src/./gcc/nm'
  193. OBJEXT=''
  194. PACKAGE_BUGREPORT=''
  195. PACKAGE_NAME='GNU C Runtime Library'
  196. PACKAGE_STRING='GNU C Runtime Library 1.0'
  197. PACKAGE_TARNAME='libgcc'
  198. PACKAGE_URL='http://www.gnu.org/software/libgcc/'
  199. PACKAGE_VERSION='1.0'
  200. PATH_SEPARATOR=':'
  201. PICFLAG='-fpic'
  202. RANLIB='ranlib'
  203. SHELL='/bin/sh'
  204. STRIP='strip'
  205. ac_ct_CC=''
  206. asm_hidden_op=''
  207. bindir='${exec_prefix}/bin'
  208. build='x86_64-unknown-linux-gnu'
  209. build_alias='x86_64-unknown-linux-gnu'
  210. build_cpu='x86_64'
  211. build_libsubdir='build-x86_64-unknown-linux-gnu'
  212. build_os='linux-gnu'
  213. build_subdir='build-x86_64-unknown-linux-gnu'
  214. build_vendor='unknown'
  215. cpu_type=''
  216. datadir='${datarootdir}'
  217. datarootdir='${prefix}/share'
  218. decimal_float=''
  219. docdir='${datarootdir}/doc/${PACKAGE_TARNAME}'
  220. double_type_size=''
  221. dvidir='${docdir}'
  222. enable_decimal_float=''
  223. enable_shared='yes'
  224. exec_prefix='NONE'
  225. extra_parts=''
  226. fixed_point=''
  227. host='x86_64-unknown-linux-gnu'
  228. host_alias='x86_64-unknown-linux-gnu'
  229. host_cpu='x86_64'
  230. host_noncanonical='x86_64-unknown-linux-gnu'
  231. host_os='linux-gnu'
  232. host_subdir='.'
  233. host_vendor='unknown'
  234. htmldir='${docdir}'
  235. includedir='${prefix}/include'
  236. infodir='/usr/share/info'
  237. libdir='/usr/lib'
  238. libexecdir='/usr/lib'
  239. libgcc_topdir='/tmp/yaourt-tmp-karel/aur-gcc47/src/gcc-4.7.4/libgcc/..'
  240. localedir='${datarootdir}/locale'
  241. localstatedir='${prefix}/var'
  242. long_double_type_size=''
  243. mandir='/usr/share/man'
  244. oldincludedir='/usr/include'
  245. pdfdir='${docdir}'
  246. prefix='/usr'
  247. program_transform_name='s&$&-4.7&'
  248. psdir='${docdir}'
  249. sbindir='${exec_prefix}/sbin'
  250. set_have_cc_tls=''
  251. set_use_emutls=''
  252. sfp_machine_header=''
  253. sharedstatedir='${prefix}/com'
  254. slibdir='$(libsubdir)'
  255. sysconfdir='${prefix}/etc'
  256. target_alias='x86_64-unknown-linux-gnu'
  257. target_noncanonical='x86_64-unknown-linux-gnu'
  258. target_subdir='x86_64-unknown-linux-gnu'
  259. tm_defines=''
  260. tm_file=''
  261. tmake_file=''
  262. toolexecdir='$(libdir)/gcc/$(target_noncanonical)'
  263. toolexeclibdir='$(toolexecdir)/$(gcc_version)$(MULTISUBDIR)'
  264. vis_hide=''
  265.  
  266. ## ----------- ##
  267. ## confdefs.h. ##
  268. ## ----------- ##
  269.  
  270. /* confdefs.h */
  271. #define PACKAGE_NAME "GNU C Runtime Library"
  272. #define PACKAGE_TARNAME "libgcc"
  273. #define PACKAGE_VERSION "1.0"
  274. #define PACKAGE_STRING "GNU C Runtime Library 1.0"
  275. #define PACKAGE_BUGREPORT ""
  276. #define PACKAGE_URL "http://www.gnu.org/software/libgcc/"
  277.  
  278. configure: exit 1
RAW Paste Data