Advertisement
Guest User

Untitled

a guest
Nov 20th, 2016
176
0
Never
Not a member of Pastebin yet? Sign Up, it unlocks many cool features!
text 8.29 KB | None | 0 0
  1. DKMS make.log for nvidia-375.20 for kernel 4.8.0-1-amd64 (x86_64)
  2. Вс ноя 20 12:52:18 MSK 2016
  3. make "CC=cc" KBUILD_OUTPUT=/lib/modules/4.8.0-1-amd64/build KBUILD_VERBOSE= -C /lib/modules/4.8.0-1-amd64/source M=/var/lib/dkms/nvidia/375.20/build ARCH=x86_64 NV_KERNEL_SOURCES=/lib/modules/4.8.0-1-amd64/source NV_KERNEL_OUTPUT=/lib/modules/4.8.0-1-amd64/build NV_KERNEL_MODULES="nvidia nvidia-uvm nvidia-modeset nvidia-drm" INSTALL_MOD_DIR=kernel/drivers/video modules
  4. make[1]: вход в каталог «/usr/src/linux-headers-4.8.0-1-common»
  5. make[2]: вход в каталог «/usr/src/linux-headers-4.8.0-1-amd64»
  6. SYMLINK /var/lib/dkms/nvidia/375.20/build/nvidia/nv-kernel.o
  7. SYMLINK /var/lib/dkms/nvidia/375.20/build/nvidia-modeset/nv-modeset-kernel.o
  8. CONFTEST: INIT_WORK
  9. CONFTEST: remap_pfn_range
  10. CONFTEST: follow_pfn
  11. CONFTEST: vmap
  12. CONFTEST: set_pages_uc
  13. CONFTEST: set_memory_uc
  14. CONFTEST: set_memory_array_uc
  15. CONFTEST: change_page_attr
  16. CONFTEST: pci_get_class
  17. CONFTEST: pci_choose_state
  18. CONFTEST: vm_insert_page
  19. CONFTEST: console_lock
  20. CONFTEST: acpi_device_id
  21. CONFTEST: acquire_console_sem
  22. CONFTEST: kmem_cache_create
  23. CONFTEST: on_each_cpu
  24. CONFTEST: smp_call_function
  25. CONFTEST: acpi_evaluate_integer
  26. CONFTEST: ioremap_cache
  27. CONFTEST: ioremap_wc
  28. CONFTEST: acpi_walk_namespace
  29. CONFTEST: pci_domain_nr
  30. CONFTEST: pci_dma_mapping_error
  31. CONFTEST: sg_alloc_table
  32. CONFTEST: sg_init_table
  33. CONFTEST: pci_get_domain_bus_and_slot
  34. CONFTEST: get_num_physpages
  35. CONFTEST: efi_enabled
  36. CONFTEST: proc_create_data
  37. CONFTEST: pde_data
  38. CONFTEST: proc_remove
  39. CONFTEST: pm_vt_switch_required
  40. CONFTEST: drm_driver_has_set_busid
  41. CONFTEST: drm_driver_has_gem_prime_res_obj
  42. CONFTEST: xen_ioemu_inject_msi
  43. CONFTEST: phys_to_dma
  44. CONFTEST: get_dma_ops
  45. CONFTEST: write_cr4
  46. CONFTEST: of_parse_phandle
  47. CONFTEST: for_each_online_node
  48. CONFTEST: node_end_pfn
  49. CONFTEST: pci_bus_address
  50. CONFTEST: pci_stop_and_remove_bus_device
  51. CONFTEST: pci_remove_bus_device
  52. CONFTEST: request_threaded_irq
  53. CONFTEST: remap_page_range
  54. CONFTEST: address_space_init_once
  55. CONFTEST: kbasename
  56. CONFTEST: fatal_signal_pending
  57. CONFTEST: list_cut_position
  58. CONFTEST: vzalloc
  59. CONFTEST: wait_on_bit_lock_argument_count
  60. CONFTEST: bitmap_clear
  61. CONFTEST: usleep_range
  62. CONFTEST: radix_tree_empty
  63. CONFTEST: drm_reinit_primary_mode_group
  64. CONFTEST: drm_dev_unref
  65. CONFTEST: drm_atomic_set_mode_for_crtc
  66. CONFTEST: drm_atomic_clean_old_fb
  67. CONFTEST: get_user_pages_remote
  68. CONFTEST: drm_gem_object_lookup
  69. CONFTEST: i2c_adapter
  70. CONFTEST: pm_message_t
  71. CONFTEST: irq_handler_t
  72. CONFTEST: acpi_device_ops
  73. CONFTEST: acpi_op_remove
  74. CONFTEST: outer_flush_all
  75. CONFTEST: proc_dir_entry
  76. CONFTEST: scatterlist
  77. CONFTEST: sg_table
  78. CONFTEST: file_operations
  79. CONFTEST: vm_operations_struct
  80. CONFTEST: atomic_long_type
  81. CONFTEST: pci_save_state
  82. CONFTEST: file_inode
  83. CONFTEST: task_struct
  84. CONFTEST: kuid_t
  85. CONFTEST: dma_ops
  86. CONFTEST: dma_map_ops
  87. CONFTEST: noncoherent_swiotlb_dma_ops
  88. CONFTEST: fault_flags
  89. CONFTEST: atomic64_type
  90. CONFTEST: address_space
  91. CONFTEST: backing_dev_info
  92. CONFTEST: kernel_write
  93. CONFTEST: strnstr
  94. CONFTEST: iterate_dir
  95. CONFTEST: kstrtoull
  96. CONFTEST: mm_context_t
  97. CONFTEST: drm_bus_present
  98. CONFTEST: drm_bus_has_bus_type
  99. CONFTEST: drm_bus_has_get_irq
  100. CONFTEST: drm_bus_has_get_name
  101. CONFTEST: drm_driver_has_legacy_dev_list
  102. CONFTEST: drm_crtc_state_has_connectors_changed
  103. CONFTEST: drm_init_functions_have_name_arg
  104. CONFTEST: drm_mode_connector_list_update_has_merge_type_bits_arg
  105. CONFTEST: drm_helper_mode_fill_fb_struct_has_const_mode_cmd_arg
  106. CONFTEST: drm_master_drop_has_from_release_arg
  107. CONFTEST: drm_mode_config_funcs_has_atomic_state_alloc
  108. CONFTEST: dom0_kernel_present
  109. CONFTEST: nvidia_vgpu_kvm_build
  110. CONFTEST: drm_available
  111. CONFTEST: nvidia_grid_build
  112. CONFTEST: drm_atomic_available
  113. CONFTEST: drm_atomic_modeset_nonblocking_commit_available
  114. CC [M] /var/lib/dkms/nvidia/375.20/build/nvidia/nv-frontend.o
  115. CC [M] /var/lib/dkms/nvidia/375.20/build/nvidia/nv-instance.o
  116. CC [M] /var/lib/dkms/nvidia/375.20/build/nvidia/nv.o
  117. /var/lib/dkms/nvidia/375.20/build/nvidia/nv-frontend.c:1:0: error: code model kernel does not support PIC mode
  118. /* _NVRM_COPYRIGHT_BEGIN_
  119.  
  120. CC [M] /var/lib/dkms/nvidia/375.20/build/nvidia/nv-acpi.o
  121. /var/lib/dkms/nvidia/375.20/build/nvidia/nv-instance.c:1:0: error: code model kernel does not support PIC mode
  122. /* _NVRM_COPYRIGHT_BEGIN_
  123.  
  124. CC [M] /var/lib/dkms/nvidia/375.20/build/nvidia/nv-dma.o
  125. /var/lib/dkms/nvidia/375.20/build/nvidia/nv.c:1:0: error: code model kernel does not support PIC mode
  126. /* _NVRM_COPYRIGHT_BEGIN_
  127.  
  128. CC [M] /var/lib/dkms/nvidia/375.20/build/nvidia/nv-chrdev.o
  129. CC [M] /var/lib/dkms/nvidia/375.20/build/nvidia/nv-cray.o
  130. CC [M] /var/lib/dkms/nvidia/375.20/build/nvidia/nv-gvi.o
  131. /var/lib/dkms/nvidia/375.20/build/nvidia/nv-acpi.c:1:0: error: code model kernel does not support PIC mode
  132. /* _NVRM_COPYRIGHT_BEGIN_
  133.  
  134. /usr/src/linux-headers-4.8.0-1-common/scripts/Makefile.build:294: ошибка выполнения рецепта для цели «/var/lib/dkms/nvidia/375.20/build/nvidia/nv-frontend.o»
  135. make[3]: *** [/var/lib/dkms/nvidia/375.20/build/nvidia/nv-frontend.o] Ошибка 1
  136. make[3]: *** Ожидание завершения заданий…
  137. /var/lib/dkms/nvidia/375.20/build/nvidia/nv-chrdev.c:1:0: error: code model kernel does not support PIC mode
  138. /* _NVRM_COPYRIGHT_BEGIN_
  139.  
  140. /usr/src/linux-headers-4.8.0-1-common/scripts/Makefile.build:294: ошибка выполнения рецепта для цели «/var/lib/dkms/nvidia/375.20/build/nvidia/nv-instance.o»
  141. make[3]: *** [/var/lib/dkms/nvidia/375.20/build/nvidia/nv-instance.o] Ошибка 1
  142. /var/lib/dkms/nvidia/375.20/build/nvidia/nv-cray.c:1:0: error: code model kernel does not support PIC mode
  143. /* _NVRM_COPYRIGHT_BEGIN_
  144.  
  145. /usr/src/linux-headers-4.8.0-1-common/scripts/Makefile.build:294: ошибка выполнения рецепта для цели «/var/lib/dkms/nvidia/375.20/build/nvidia/nv-acpi.o»
  146. make[3]: *** [/var/lib/dkms/nvidia/375.20/build/nvidia/nv-acpi.o] Ошибка 1
  147. /var/lib/dkms/nvidia/375.20/build/nvidia/nv-gvi.c:1:0: error: code model kernel does not support PIC mode
  148.  
  149.  
  150. /usr/src/linux-headers-4.8.0-1-common/scripts/Makefile.build:294: ошибка выполнения рецепта для цели «/var/lib/dkms/nvidia/375.20/build/nvidia/nv-cray.o»
  151. make[3]: *** [/var/lib/dkms/nvidia/375.20/build/nvidia/nv-cray.o] Ошибка 1
  152. /usr/src/linux-headers-4.8.0-1-common/scripts/Makefile.build:294: ошибка выполнения рецепта для цели «/var/lib/dkms/nvidia/375.20/build/nvidia/nv.o»
  153. make[3]: *** [/var/lib/dkms/nvidia/375.20/build/nvidia/nv.o] Ошибка 1
  154. /var/lib/dkms/nvidia/375.20/build/nvidia/nv-dma.c:1:0: error: code model kernel does not support PIC mode
  155. /* _NVRM_COPYRIGHT_BEGIN_
  156.  
  157. /usr/src/linux-headers-4.8.0-1-common/scripts/Makefile.build:294: ошибка выполнения рецепта для цели «/var/lib/dkms/nvidia/375.20/build/nvidia/nv-dma.o»
  158. make[3]: *** [/var/lib/dkms/nvidia/375.20/build/nvidia/nv-dma.o] Ошибка 1
  159. /usr/src/linux-headers-4.8.0-1-common/scripts/Makefile.build:294: ошибка выполнения рецепта для цели «/var/lib/dkms/nvidia/375.20/build/nvidia/nv-chrdev.o»
  160. make[3]: *** [/var/lib/dkms/nvidia/375.20/build/nvidia/nv-chrdev.o] Ошибка 1
  161. /usr/src/linux-headers-4.8.0-1-common/scripts/Makefile.build:294: ошибка выполнения рецепта для цели «/var/lib/dkms/nvidia/375.20/build/nvidia/nv-gvi.o»
  162. make[3]: *** [/var/lib/dkms/nvidia/375.20/build/nvidia/nv-gvi.o] Ошибка 1
  163. /usr/src/linux-headers-4.8.0-1-common/Makefile:1488: ошибка выполнения рецепта для цели «_module_/var/lib/dkms/nvidia/375.20/build»
  164. make[2]: *** [_module_/var/lib/dkms/nvidia/375.20/build] Ошибка 2
  165. make[2]: выход из каталога «/usr/src/linux-headers-4.8.0-1-amd64»
  166. Makefile:150: ошибка выполнения рецепта для цели «sub-make»
  167. make[1]: *** [sub-make] Ошибка 2
  168. make[1]: выход из каталога «/usr/src/linux-headers-4.8.0-1-common»
  169. Makefile:81: ошибка выполнения рецепта для цели «modules»
  170. make: *** [modules] Ошибка 2
Advertisement
Add Comment
Please, Sign In to add comment
Advertisement