Advertisement
qwexzcwasdsadasd

Untitled

Mar 15th, 2020
878
Never
Not a member of Pastebin yet? Sign Up, it unlocks many cool features!
  1. ====================[ Build | Interpreter | Debug ]=============================
  2. /snap/clion/103/bin/cmake/linux/bin/cmake --build /home/wasd/github/Mini-Java-Compiler/cmake-build-debug --target Interpreter -- -j 4
  3. [  2%] Linking CXX executable Interpreter
  4. CMakeFiles/Interpreter.dir/interpreter/parser.cpp.o:(.data.rel.ro._ZTVN2yy6parserE[_ZTVN2yy6parserE]+0x28): undefined reference to `yy::parser::error(yy::location const&, std::__cxx11::basic_string<char, std::char_traits<char>, std::allocator<char> > const&)'
  5. collect2: error: ld returned 1 exit status
  6. CMakeFiles/Interpreter.dir/build.make:545: recipe for target 'Interpreter' failed
  7. make[3]: *** [Interpreter] Error 1
  8. CMakeFiles/Makefile2:75: recipe for target 'CMakeFiles/Interpreter.dir/all' failed
  9. make[2]: *** [CMakeFiles/Interpreter.dir/all] Error 2
  10. CMakeFiles/Makefile2:82: recipe for target 'CMakeFiles/Interpreter.dir/rule' failed
  11. make[1]: *** [CMakeFiles/Interpreter.dir/rule] Error 2
  12. Makefile:118: recipe for target 'Interpreter' failed
  13. make: *** [Interpreter] Error 2
Advertisement
RAW Paste Data Copied
Advertisement