SameSite

package_automated_make

Feb 5th, 2025
136
0
Never
Not a member of Pastebin yet? Sign Up, it unlocks many cool features!
text 12.14 KB | None | 0 0
  1. ==> Making package: paru 2.0.4-1 (Wed 05 Feb 2025 04:13:51 PM CET)
  2. ==> Checking runtime dependencies...
  3. ==> Checking buildtime dependencies...
  4. ==> Retrieving sources...
  5. -> Downloading paru-2.0.4.tar.gz...
  6. % Total % Received % Xferd Average Speed Time Time Time Current
  7. Dload Upload Total Spent Left Speed
  8.  
  9. 0 0 0 0 0 0 0 0 --:--:-- --:--:-- --:--:-- 0
  10. 0 0 0 0 0 0 0 0 --:--:-- --:--:-- --:--:-- 0
  11.  
  12. 0 0 0 0 0 0 0 0 --:--:-- --:--:-- --:--:-- 0
  13. 100 7644k 0 7644k 0 0 5076k 0 --:--:-- 0:00:01 --:--:-- 7729k
  14. 100 8064k 0 8064k 0 0 5246k 0 --:--:-- 0:00:01 --:--:-- 7914k
  15. ==> Validating source files with sha256sums...
  16. paru-2.0.4.tar.gz ... Passed
  17. ==> Extracting sources...
  18. -> Extracting paru-2.0.4.tar.gz with bsdtar
  19. ==> Starting prepare()...
  20. warning: Patch `alpm v3.0.4 (https://github.com/archlinux/alpm.rs?rev=306342#306342ef)` was not used in the crate graph.
  21. Patch `aur-depends v3.0.0 (https://github.com/Morganamilo/aur-depends?rev=30c2c1#30c2c150)` was not used in the crate graph.
  22. Check that the patched package version and available features are compatible
  23. with the dependency requirements. If the patch has a different version from
  24. what is locked in the Cargo.lock file, run `cargo update` to use the new
  25. version. This may also occur with an optional dependency that is not enabled.
  26. ==> Starting build()...
  27. warning: Patch `alpm v3.0.4 (https://github.com/archlinux/alpm.rs?rev=306342#306342ef)` was not used in the crate graph.
  28. Patch `aur-depends v3.0.0 (https://github.com/Morganamilo/aur-depends?rev=30c2c1#30c2c150)` was not used in the crate graph.
  29. Check that the patched package version and available features are compatible
  30. with the dependency requirements. If the patch has a different version from
  31. what is locked in the Cargo.lock file, run `cargo update` to use the new
  32. version. This may also occur with an optional dependency that is not enabled.
  33. Compiling proc-macro2 v1.0.86
  34. Compiling unicode-ident v1.0.13
  35. Compiling libc v0.2.158
  36. Compiling memchr v2.7.4
  37. Compiling autocfg v1.3.0
  38. Compiling cfg-if v1.0.0
  39. Compiling pkg-config v0.3.30
  40. Compiling byteorder v1.5.0
  41. Compiling shlex v1.3.0
  42. Compiling siphasher v0.3.11
  43. Compiling cc v1.1.21
  44. Compiling quote v1.0.37
  45. Compiling getrandom v0.2.15
  46. Compiling once_cell v1.19.0
  47. Compiling syn v2.0.77
  48. Compiling rand_core v0.6.4
  49. Compiling pin-project-lite v0.2.14
  50. Compiling serde v1.0.210
  51. Compiling bitflags v2.6.0
  52. Compiling log v0.4.22
  53. Compiling futures-core v0.3.30
  54. Compiling itoa v1.0.11
  55. Compiling bytes v1.7.2
  56. Compiling slab v0.4.9
  57. Compiling vcpkg v0.2.15
  58. Compiling signal-hook-registry v1.4.2
  59. Compiling futures-sink v0.3.30
  60. Compiling mio v1.0.2
  61. Compiling socket2 v0.5.7
  62. Compiling phf_shared v0.11.2
  63. Compiling phf_shared v0.10.0
  64. Compiling openssl-sys v0.9.103
  65. Compiling futures-channel v0.3.30
  66. Compiling futures-io v0.3.30
  67. Compiling futures-task v0.3.30
  68. Compiling pin-utils v0.1.0
  69. Compiling alpm-sys v4.0.0
  70. Compiling equivalent v1.0.1
  71. Compiling hashbrown v0.14.5
  72. Compiling aho-corasick v1.1.3
  73. Compiling adler2 v2.0.0
  74. Compiling regex-syntax v0.8.4
  75. Compiling fnv v1.0.7
  76. Compiling smallvec v1.13.2
  77. warning: [email protected]: cc: error: unrecognized command-line option ‘-j6’
  78. error: failed to run custom build command for `openssl-sys v0.9.103`
  79.  
  80. Caused by:
  81. process didn't exit successfully: `/mnt/hdd/aur/paru/src/paru-2.0.4/target/release/build/openssl-sys-da5414794a91a933/build-script-main` (exit status: 101)
  82. --- stdout
  83. cargo:rustc-check-cfg=cfg(osslconf, values("OPENSSL_NO_OCB", "OPENSSL_NO_SM4", "OPENSSL_NO_SEED", "OPENSSL_NO_CHACHA", "OPENSSL_NO_CAST", "OPENSSL_NO_IDEA", "OPENSSL_NO_CAMELLIA", "OPENSSL_NO_RC4", "OPENSSL_NO_BF", "OPENSSL_NO_PSK", "OPENSSL_NO_DEPRECATED_3_0", "OPENSSL_NO_SCRYPT", "OPENSSL_NO_SM3", "OPENSSL_NO_RMD160", "OPENSSL_NO_EC2M", "OPENSSL_NO_OCSP", "OPENSSL_NO_CMS", "OPENSSL_NO_COMP", "OPENSSL_NO_SOCK", "OPENSSL_NO_STDIO"))
  84. cargo:rustc-check-cfg=cfg(openssl)
  85. cargo:rustc-check-cfg=cfg(libressl)
  86. cargo:rustc-check-cfg=cfg(boringssl)
  87. cargo:rustc-check-cfg=cfg(libressl250)
  88. cargo:rustc-check-cfg=cfg(libressl251)
  89. cargo:rustc-check-cfg=cfg(libressl252)
  90. cargo:rustc-check-cfg=cfg(libressl261)
  91. cargo:rustc-check-cfg=cfg(libressl270)
  92. cargo:rustc-check-cfg=cfg(libressl271)
  93. cargo:rustc-check-cfg=cfg(libressl273)
  94. cargo:rustc-check-cfg=cfg(libressl280)
  95. cargo:rustc-check-cfg=cfg(libressl281)
  96. cargo:rustc-check-cfg=cfg(libressl291)
  97. cargo:rustc-check-cfg=cfg(libressl310)
  98. cargo:rustc-check-cfg=cfg(libressl321)
  99. cargo:rustc-check-cfg=cfg(libressl332)
  100. cargo:rustc-check-cfg=cfg(libressl340)
  101. cargo:rustc-check-cfg=cfg(libressl350)
  102. cargo:rustc-check-cfg=cfg(libressl360)
  103. cargo:rustc-check-cfg=cfg(libressl361)
  104. cargo:rustc-check-cfg=cfg(libressl370)
  105. cargo:rustc-check-cfg=cfg(libressl380)
  106. cargo:rustc-check-cfg=cfg(libressl381)
  107. cargo:rustc-check-cfg=cfg(libressl382)
  108. cargo:rustc-check-cfg=cfg(libressl390)
  109. cargo:rustc-check-cfg=cfg(libressl400)
  110. cargo:rustc-check-cfg=cfg(ossl101)
  111. cargo:rustc-check-cfg=cfg(ossl102)
  112. cargo:rustc-check-cfg=cfg(ossl102f)
  113. cargo:rustc-check-cfg=cfg(ossl102h)
  114. cargo:rustc-check-cfg=cfg(ossl110)
  115. cargo:rustc-check-cfg=cfg(ossl110f)
  116. cargo:rustc-check-cfg=cfg(ossl110g)
  117. cargo:rustc-check-cfg=cfg(ossl110h)
  118. cargo:rustc-check-cfg=cfg(ossl111)
  119. cargo:rustc-check-cfg=cfg(ossl111b)
  120. cargo:rustc-check-cfg=cfg(ossl111c)
  121. cargo:rustc-check-cfg=cfg(ossl111d)
  122. cargo:rustc-check-cfg=cfg(ossl300)
  123. cargo:rustc-check-cfg=cfg(ossl310)
  124. cargo:rustc-check-cfg=cfg(ossl320)
  125. cargo:rustc-check-cfg=cfg(ossl330)
  126. cargo:rerun-if-env-changed=X86_64_UNKNOWN_LINUX_GNU_OPENSSL_LIB_DIR
  127. X86_64_UNKNOWN_LINUX_GNU_OPENSSL_LIB_DIR unset
  128. cargo:rerun-if-env-changed=OPENSSL_LIB_DIR
  129. OPENSSL_LIB_DIR unset
  130. cargo:rerun-if-env-changed=X86_64_UNKNOWN_LINUX_GNU_OPENSSL_INCLUDE_DIR
  131. X86_64_UNKNOWN_LINUX_GNU_OPENSSL_INCLUDE_DIR unset
  132. cargo:rerun-if-env-changed=OPENSSL_INCLUDE_DIR
  133. OPENSSL_INCLUDE_DIR unset
  134. cargo:rerun-if-env-changed=X86_64_UNKNOWN_LINUX_GNU_OPENSSL_DIR
  135. X86_64_UNKNOWN_LINUX_GNU_OPENSSL_DIR unset
  136. cargo:rerun-if-env-changed=OPENSSL_DIR
  137. OPENSSL_DIR unset
  138. cargo:rerun-if-env-changed=OPENSSL_NO_PKG_CONFIG
  139. cargo:rerun-if-env-changed=PKG_CONFIG_x86_64-unknown-linux-gnu
  140. cargo:rerun-if-env-changed=PKG_CONFIG_x86_64_unknown_linux_gnu
  141. cargo:rerun-if-env-changed=HOST_PKG_CONFIG
  142. cargo:rerun-if-env-changed=PKG_CONFIG
  143. cargo:rerun-if-env-changed=OPENSSL_STATIC
  144. cargo:rerun-if-env-changed=OPENSSL_DYNAMIC
  145. cargo:rerun-if-env-changed=PKG_CONFIG_ALL_STATIC
  146. cargo:rerun-if-env-changed=PKG_CONFIG_ALL_DYNAMIC
  147. cargo:rerun-if-env-changed=PKG_CONFIG_PATH_x86_64-unknown-linux-gnu
  148. cargo:rerun-if-env-changed=PKG_CONFIG_PATH_x86_64_unknown_linux_gnu
  149. cargo:rerun-if-env-changed=HOST_PKG_CONFIG_PATH
  150. cargo:rerun-if-env-changed=PKG_CONFIG_PATH
  151. cargo:rerun-if-env-changed=PKG_CONFIG_LIBDIR_x86_64-unknown-linux-gnu
  152. cargo:rerun-if-env-changed=PKG_CONFIG_LIBDIR_x86_64_unknown_linux_gnu
  153. cargo:rerun-if-env-changed=HOST_PKG_CONFIG_LIBDIR
  154. cargo:rerun-if-env-changed=PKG_CONFIG_LIBDIR
  155. cargo:rerun-if-env-changed=PKG_CONFIG_SYSROOT_DIR_x86_64-unknown-linux-gnu
  156. cargo:rerun-if-env-changed=PKG_CONFIG_SYSROOT_DIR_x86_64_unknown_linux_gnu
  157. cargo:rerun-if-env-changed=HOST_PKG_CONFIG_SYSROOT_DIR
  158. cargo:rerun-if-env-changed=PKG_CONFIG_SYSROOT_DIR
  159. cargo:rerun-if-env-changed=PKG_CONFIG_SYSROOT_DIR
  160. cargo:rerun-if-env-changed=SYSROOT
  161. cargo:rerun-if-env-changed=OPENSSL_STATIC
  162. cargo:rerun-if-env-changed=OPENSSL_DYNAMIC
  163. cargo:rerun-if-env-changed=PKG_CONFIG_ALL_STATIC
  164. cargo:rerun-if-env-changed=PKG_CONFIG_ALL_DYNAMIC
  165. cargo:rustc-link-lib=ssl
  166. cargo:rustc-link-lib=crypto
  167. cargo:rerun-if-env-changed=PKG_CONFIG_x86_64-unknown-linux-gnu
  168. cargo:rerun-if-env-changed=PKG_CONFIG_x86_64_unknown_linux_gnu
  169. cargo:rerun-if-env-changed=HOST_PKG_CONFIG
  170. cargo:rerun-if-env-changed=PKG_CONFIG
  171. cargo:rerun-if-env-changed=OPENSSL_STATIC
  172. cargo:rerun-if-env-changed=OPENSSL_DYNAMIC
  173. cargo:rerun-if-env-changed=PKG_CONFIG_ALL_STATIC
  174. cargo:rerun-if-env-changed=PKG_CONFIG_ALL_DYNAMIC
  175. cargo:rerun-if-env-changed=PKG_CONFIG_PATH_x86_64-unknown-linux-gnu
  176. cargo:rerun-if-env-changed=PKG_CONFIG_PATH_x86_64_unknown_linux_gnu
  177. cargo:rerun-if-env-changed=HOST_PKG_CONFIG_PATH
  178. cargo:rerun-if-env-changed=PKG_CONFIG_PATH
  179. cargo:rerun-if-env-changed=PKG_CONFIG_LIBDIR_x86_64-unknown-linux-gnu
  180. cargo:rerun-if-env-changed=PKG_CONFIG_LIBDIR_x86_64_unknown_linux_gnu
  181. cargo:rerun-if-env-changed=HOST_PKG_CONFIG_LIBDIR
  182. cargo:rerun-if-env-changed=PKG_CONFIG_LIBDIR
  183. cargo:rerun-if-env-changed=PKG_CONFIG_SYSROOT_DIR_x86_64-unknown-linux-gnu
  184. cargo:rerun-if-env-changed=PKG_CONFIG_SYSROOT_DIR_x86_64_unknown_linux_gnu
  185. cargo:rerun-if-env-changed=HOST_PKG_CONFIG_SYSROOT_DIR
  186. cargo:rerun-if-env-changed=PKG_CONFIG_SYSROOT_DIR
  187. cargo:rerun-if-changed=build/expando.c
  188. OPT_LEVEL = Some(3)
  189. TARGET = Some(x86_64-unknown-linux-gnu)
  190. OUT_DIR = Some(/mnt/hdd/aur/paru/src/paru-2.0.4/target/release/build/openssl-sys-df19c3e1a72e6ee0/out)
  191. HOST = Some(x86_64-unknown-linux-gnu)
  192. cargo:rerun-if-env-changed=CC_x86_64-unknown-linux-gnu
  193. CC_x86_64-unknown-linux-gnu = None
  194. cargo:rerun-if-env-changed=CC_x86_64_unknown_linux_gnu
  195. CC_x86_64_unknown_linux_gnu = None
  196. cargo:rerun-if-env-changed=HOST_CC
  197. HOST_CC = None
  198. cargo:rerun-if-env-changed=CC
  199. CC = None
  200. cargo:rerun-if-env-changed=CC_ENABLE_DEBUG_OUTPUT
  201. RUSTC_WRAPPER = None
  202. cargo:rerun-if-env-changed=CRATE_CC_NO_DEFAULTS
  203. CRATE_CC_NO_DEFAULTS = None
  204. DEBUG = Some(false)
  205. CARGO_CFG_TARGET_FEATURE = Some(fxsr,sse,sse2)
  206. cargo:rerun-if-env-changed=CFLAGS_x86_64-unknown-linux-gnu
  207. CFLAGS_x86_64-unknown-linux-gnu = None
  208. cargo:rerun-if-env-changed=CFLAGS_x86_64_unknown_linux_gnu
  209. CFLAGS_x86_64_unknown_linux_gnu = None
  210. cargo:rerun-if-env-changed=HOST_CFLAGS
  211. HOST_CFLAGS = None
  212. cargo:rerun-if-env-changed=CFLAGS
  213. CFLAGS = Some(-march=x86-64 -mtune=generic -O2 -j6 -pipe -fno-plt -fexceptions -Wp,-D_FORTIFY_SOURCE=3 -Wformat -Werror=format-security -fstack-clash-protection -fcf-protection -fno-omit-frame-pointer -mno-omit-leaf-frame-pointer -g -ffile-prefix-map=/mnt/hdd/aur/paru/src=/usr/src/debug/paru -flto=auto)
  214. cargo:rerun-if-env-changed=CC_SHELL_ESCAPED_FLAGS
  215. CC_SHELL_ESCAPED_FLAGS = None
  216. cargo:warning=cc: error: unrecognized command-line option ‘-j6’
  217.  
  218. --- stderr
  219. thread 'main' panicked at /home/mirco/.cargo/registry/src/index.crates.io-6f17d22bba15001f/openssl-sys-0.9.103/build/main.rs:263:13:
  220.  
  221. Header expansion error:
  222. Error { kind: ToolExecError, message: "Command \"cc\" \"-O3\" \"-ffunction-sections\" \"-fdata-sections\" \"-fPIC\" \"-m64\" \"-I\" \"/usr/include\" \"-march=x86-64\" \"-mtune=generic\" \"-O2\" \"-j6\" \"-pipe\" \"-fno-plt\" \"-fexceptions\" \"-Wp,-D_FORTIFY_SOURCE=3\" \"-Wformat\" \"-Werror=format-security\" \"-fstack-clash-protection\" \"-fcf-protection\" \"-fno-omit-frame-pointer\" \"-mno-omit-leaf-frame-pointer\" \"-g\" \"-ffile-prefix-map=/mnt/hdd/aur/paru/src=/usr/src/debug/paru\" \"-flto=auto\" \"-E\" \"build/expando.c\" with args cc did not execute successfully (status code exit status: 1)." }
  223.  
  224. Failed to find OpenSSL development headers.
  225.  
  226. You can try fixing this setting the `OPENSSL_DIR` environment variable
  227. pointing to your OpenSSL installation or installing OpenSSL headers package
  228. specific to your distribution:
  229.  
  230. # On Ubuntu
  231. sudo apt-get install pkg-config libssl-dev
  232. # On Arch Linux
  233. sudo pacman -S pkgconf openssl
  234. # On Fedora
  235. sudo dnf install pkgconf perl-FindBin perl-IPC-Cmd openssl-devel
  236. # On Alpine Linux
  237. apk add pkgconf openssl-dev
  238.  
  239. See rust-openssl documentation for more information:
  240.  
  241. https://docs.rs/openssl
  242.  
  243. note: run with `RUST_BACKTRACE=1` environment variable to display a backtrace
  244. warning: build failed, waiting for other jobs to finish...
  245. ==> ERROR: A failure occurred in build().
  246. Aborting...
Advertisement
Add Comment
Please, Sign In to add comment