Guest User

Untitled

a guest
Dec 6th, 2020
243
0
Never
Not a member of Pastebin yet? Sign Up, it unlocks many cool features!
text 50.99 KB | None | 0 0
  1. +0000><<U+0000><U+0000><U+0000><U+0000><U+0000><U+0000><U+0000><U+0000><U+0000><U+0000><U+0000><U+0000><U+0000><U+0000><U+0000><U+0001><U+0000><U+0000><U+0000><98><U+0000><U+0000><U+0000><<U+0000><U+0000><U+0015>com.apple.quarantine<U+0000>q/0081;5fcd4ffe;Chrome;AA7E4432-765C-4D39-8B59-788415BC3068
  2.  
  3.  
  4.  
  5.  
  6.  
  7.  
  8.  
  9.  
  10.  
  11.  
  12.  
  13.  
  14.  
  15.  
  16.  
  17.  
  18.  
  19.  
  20. ^  
  21. While building module 'UIKit' imported from Tweak.xm:1:  
  22. While building module 'Darwin' imported from /var/mobile/theos/sdks/iPhoneOS11.2.sdk/System/Library/Frameworks/UIKit.framework/Headers/UIKitDefines.h:8:  
  23. In file included from <module-includes>:242:  
  24. /var/mobile/theos/sdks/iPhoneOS11.2.sdk/usr/include/_types/.__uint16_t.h:1:2: error: expected unqualified-id  
  25. <U+0000><U+0005><U+0016><U+0007><U+0000><U+0002><U+0000><U+0000>Mac OS X <U+0000><U+0002><U+0000><U+0000><U+0000> <U+0000><U+0000><U+0000>2<U+0000><U+0000><U+0000><A2><U+0000><U+0000><U+0000><U+0002><U+0000><U+0000><U+0000><D4><U+0000><U+0000><U+0000><U+0000><U+0000><U+0000><U+0000><U+0000><U+0000><U+0000><U+0000><U+0000><U+0000><U+0000><U+0000><U+0000><U+0000><U+0000><U+0000><U+0000><U+0000><U+0000><U+0000><U+0000><U+0000><U+0000><U+0000><U+0000><U+0000><U+0000><U+0000><U+0000><U+0000><U+0000><U+0000><U+0000><U+0000><U+0000>ATTR<U+0000><U+0000><U+0000><U+0000><U+0000><U+0000><U+0000><D4><U+0000><U+0000><U+0000><98><U+0000><U+0000><U+0000><<U+0000><U+0000><U+0000><U+0000><U+0000><U+0000><U+0000><U+0000><U+0000><U+0000><U+0000><U+0000><U+0000><U+0000><U+0000><U+0001><U+0000><U+0000><U+0000><98><U+0000><U+0000><U+0000><<U+0000><U+0000><U+0015>com.apple.quarantine<U+0000>q/0081;5fcd4ffe;Chrome;AA7E4432-765C-4D39-8B59-788415BC3068
  26. ^  
  27. /var/mobile/theos/sdks/iPhoneOS11.2.sdk/usr/include/_types/.__uint16_t.h:1:38: error: source file is not valid UTF-8  
  28. <U+0000><U+0005><U+0016><U+0007><U+0000><U+0002><U+0000><U+0000>Mac OS X <U+0000><U+0002><U+0000><U+0000><U+0000> <U+0000><U+0000><U+0000>2<U+0000><U+0000><U+0000><A2><U+0000><U+0000><U+0000><U+0002><U+0000><U+0000><U+0000><D4><U+0000><U+0000><U+0000><U+0000><U+0000><U+0000><U+0000><U+0000><U+0000><U+0000><U+0000><U+0000><U+0000><U+0000><U+0000><U+0000><U+0000><U+0000><U+0000><U+0000><U+0000><U+0000><U+0000><U+0000><U+0000><U+0000><U+0000><U+0000><U+0000><U+0000><U+0000><U+0000><U+0000><U+0000><U+0000><U+0000><U+0000><U+0000>ATTR<U+0000><U+0000><U+0000><U+0000><U+0000><U+0000><U+0000><D4><U+0000><U+0000><U+0000><98><U+0000><U+0000><U+0000><<U+0000><U+0000><U+0000><U+0000><U+0000><U+0000><U+0000><U+0000><U+0000><U+0000><U+0000><U+0000><U+0000><U+0000><U+0000><U+0001><U+0000><U+0000><U+0000><98><U+0000><U+0000><U+0000><<U+0000><U+0000><U+0015>com.apple.quarantine<U+0000>q/0081;5fcd4ffe;Chrome;AA7E4432-765C-4D39-8B59-788415BC3068
  29.  
  30.  
  31.  
  32. ^  
  33. /var/mobile/theos/sdks/iPhoneOS11.2.sdk/usr/include/_types/.__uint16_t.h:1:46: error: source file is not valid UTF-8  
  34. <U+0000><U+0005><U+0016><U+0007><U+0000><U+0002><U+0000><U+0000>Mac OS X <U+0000><U+0002><U+0000><U+0000><U+0000> <U+0000><U+0000><U+0000>2<U+0000><U+0000><U+0000><A2><U+0000><U+0000><U+0000><U+0002><U+0000><U+0000><U+0000><D4><U+0000><U+0000><U+0000><U+0000><U+0000><U+0000><U+0000><U+0000><U+0000><U+0000><U+0000><U+0000><U+0000><U+0000><U+0000><U+0000><U+0000><U+0000><U+0000><U+0000><U+0000><U+0000><U+0000><U+0000><U+0000><U+0000><U+0000><U+0000><U+0000><U+0000><U+0000><U+0000><U+0000><U+0000><U+0000><U+0000><U+0000><U+0000>ATTR<U+0000><U+0000><U+0000><U+0000><U+0000><U+0000><U+0000><D4><U+0000><U+0000><U+0000><98><U+0000><U+0000><U+0000><<U+0000><U+0000><U+0000><U+0000><U+0000><U+0000><U+0000><U+0000><U+0000><U+0000><U+0000><U+0000><U+0000><U+0000><U+0000><U+0001><U+0000><U+0000><U+0000><98><U+0000><U+0000><U+0000><<U+0000><U+0000><U+0015>com.apple.quarantine<U+0000>q/0081;5fcd4ffe;Chrome;AA7E4432-765C-4D39-8B59-788415BC3068
  35.  
  36.  
  37.  
  38.  
  39. ^  
  40. /var/mobile/theos/sdks/iPhoneOS11.2.sdk/usr/include/_types/.__uint16_t.h:1:96: error: source file is not valid UTF-8  
  41. <U+0000><U+0005><U+0016><U+0007><U+0000><U+0002><U+0000><U+0000>Mac OS X <U+0000><U+0002><U+0000><U+0000><U+0000> <U+0000><U+0000><U+0000>2<U+0000><U+0000><U+0000><A2><U+0000><U+0000><U+0000><U+0002><U+0000><U+0000><U+0000><D4><U+0000><U+0000><U+0000><U+0000><U+0000><U+0000><U+0000><U+0000><U+0000><U+0000><U+0000><U+0000><U+0000><U+0000><U+0000><U+0000><U+0000><U+0000><U+0000><U+0000><U+0000><U+0000><U+0000><U+0000><U+0000><U+0000><U+0000><U+0000><U+0000><U+0000><U+0000><U+0000><U+0000><U+0000><U+0000><U+0000><U+0000><U+0000>ATTR<U+0000><U+0000><U+0000><U+0000><U+0000><U+0000><U+0000><D4><U+0000><U+0000><U+0000><98><U+0000><U+0000><U+0000><<U+0000><U+0000><U+0000><U+0000><U+0000><U+0000><U+0000><U+0000><U+0000><U+0000><U+0000><U+0000><U+0000><U+0000><U+0000><U+0001><U+0000><U+0000><U+0000><98><U+0000><U+0000><U+0000><<U+0000><U+0000><U+0015>com.apple.quarantine<U+0000>q/0081;5fcd4ffe;Chrome;AA7E4432-765C-4D39-8B59-788415BC3068
  42.  
  43.  
  44.  
  45.  
  46.  
  47.  
  48.  
  49.  
  50.  
  51.  
  52.  
  53.  
  54. ^  
  55. /var/mobile/theos/sdks/iPhoneOS11.2.sdk/usr/include/_types/.__uint16_t.h:1:100: error: source file is not valid UTF-8  
  56. <U+0000><U+0005><U+0016><U+0007><U+0000><U+0002><U+0000><U+0000>Mac OS X <U+0000><U+0002><U+0000><U+0000><U+0000> <U+0000><U+0000><U+0000>2<U+0000><U+0000><U+0000><A2><U+0000><U+0000><U+0000><U+0002><U+0000><U+0000><U+0000><D4><U+0000><U+0000><U+0000><U+0000><U+0000><U+0000><U+0000><U+0000><U+0000><U+0000><U+0000><U+0000><U+0000><U+0000><U+0000><U+0000><U+0000><U+0000><U+0000><U+0000><U+0000><U+0000><U+0000><U+0000><U+0000><U+0000><U+0000><U+0000><U+0000><U+0000><U+0000><U+0000><U+0000><U+0000><U+0000><U+0000><U+0000><U+0000>ATTR<U+0000><U+0000><U+0000><U+0000><U+0000><U+0000><U+0000><D4><U+0000><U+0000><U+0000><98><U+0000><U+0000><U+0000><<U+0000><U+0000><U+0000><U+0000><U+0000><U+0000><U+0000><U+0000><U+0000><U+0000><U+0000><U+0000><U+0000><U+0000><U+0000><U+0001><U+0000><U+0000><U+0000><98><U+0000><U+0000><U+0000><<U+0000><U+0000><U+0015>com.apple.quarantine<U+0000>q/0081;5fcd4ffe;Chrome;AA7E4432-765C-4D39-8B59-788415BC3068
  57.  
  58.  
  59.  
  60.  
  61.  
  62.  
  63.  
  64.  
  65.  
  66.  
  67.  
  68.  
  69. ^  
  70. /var/mobile/theos/sdks/iPhoneOS11.2.sdk/usr/include/_types/.__uint16_t.h:1:124: error: source file is not valid UTF-8  
  71. <U+0000><U+0005><U+0016><U+0007><U+0000><U+0002><U+0000><U+0000>Mac OS X <U+0000><U+0002><U+0000><U+0000><U+0000> <U+0000><U+0000><U+0000>2<U+0000><U+0000><U+0000><A2><U+0000><U+0000><U+0000><U+0002><U+0000><U+0000><U+0000><D4><U+0000><U+0000><U+0000><U+0000><U+0000><U+0000><U+0000><U+0000><U+0000><U+0000><U+0000><U+0000><U+0000><U+0000><U+0000><U+0000><U+0000><U+0000><U+0000><U+0000><U+0000><U+0000><U+0000><U+0000><U+0000><U+0000><U+0000><U+0000><U+0000><U+0000><U+0000><U+0000><U+0000><U+0000><U+0000><U+0000><U+0000><U+0000>ATTR<U+0000><U+0000><U+0000><U+0000><U+0000><U+0000><U+0000><D4><U+0000><U+0000><U+0000><98><U+0000><U+0000><U+0000><<U+0000><U+0000><U+0000><U+0000><U+0000><U+0000><U+0000><U+0000><U+0000><U+0000><U+0000><U+0000><U+0000><U+0000><U+0000><U+0001><U+0000><U+0000><U+0000><98><U+0000><U+0000><U+0000><<U+0000><U+0000><U+0015>com.apple.quarantine<U+0000>q/0081;5fcd4ffe;Chrome;AA7E4432-765C-4D39-8B59-788415BC3068
  72.  
  73.  
  74.  
  75.  
  76.  
  77.  
  78.  
  79.  
  80.  
  81.  
  82.  
  83.  
  84.  
  85.  
  86.  
  87.  
  88. ^  
  89. /var/mobile/theos/sdks/iPhoneOS11.2.sdk/usr/include/_types/.__uint16_t.h:1:160: error: expected unqualified-id  
  90. <U+0000><U+0005><U+0016><U+0007><U+0000><U+0002><U+0000><U+0000>Mac OS X <U+0000><U+0002><U+0000><U+0000><U+0000> <U+0000><U+0000><U+0000>2<U+0000><U+0000><U+0000><A2><U+0000><U+0000><U+0000><U+0002><U+0000><U+0000><U+0000><D4><U+0000><U+0000><U+0000><U+0000><U+0000><U+0000><U+0000><U+0000><U+0000><U+0000><U+0000><U+0000><U+0000><U+0000><U+0000><U+0000><U+0000><U+0000><U+0000><U+0000><U+0000><U+0000><U+0000><U+0000><U+0000><U+0000><U+0000><U+0000><U+0000><U+0000><U+0000><U+0000><U+0000><U+0000><U+0000><U+0000><U+0000><U+0000>ATTR<U+0000><U+0000><U+0000><U+0000><U+0000><U+0000><U+0000><D4><U+0000><U+0000><U+0000><98><U+0000><U+0000><U+0000><<U+0000><U+0000><U+0000><U+0000><U+0000><U+0000><U+0000><U+0000><U+0000><U+0000><U+0000><U+0000><U+0000><U+0000><U+0000><U+0001><U+0000><U+0000><U+0000><98><U+0000><U+0000><U+0000><<U+0000><U+0000><U+0015>com.apple.quarantine<U+0000>q/0081;5fcd4ffe;Chrome;AA7E4432-765C-4D39-8B59-788415BC3068
  91.  
  92.  
  93.  
  94.  
  95.  
  96.  
  97.  
  98.  
  99.  
  100.  
  101.  
  102.  
  103.  
  104.  
  105.  
  106.  
  107.  
  108. ^ 
  109. /var/mobile/theos/sdks/iPhoneOS11.2.sdk/usr/include/_types/.__uint16_t.h:1:169: error: C++ requires
  110. a type specifier for all declarations  
  111. <U+0000><U+0005><U+0016><U+0007><U+0000><U+0002><U+0000><U+0000>Mac OS X <U+0000><U+0002><U+0000><U+0000><U+0000> <U+0000><U+0000><U+0000>2<U+0000><U+0000><U+0000><A2><U+0000><U+0000><U+0000><U+0002><U+0000><U+0000><U+0000><D4><U+0000><U+0000><U+0000><U+0000><U+0000><U+0000><U+0000><U+0000><U+0000><U+0000><U+0000><U+0000><U+0000><U+0000><U+0000><U+0000><U+0000><U+0000><U+0000><U+0000><U+0000><U+0000><U+0000><U+0000><U+0000><U+0000><U+0000><U+0000><U+0000><U+0000><U+0000><U+0000><U+0000><U+0000><U+0000><U+0000><U+0000><U+0000>ATTR<U+0000><U+0000><U+0000><U+0000><U+0000><U+0000><U+0000><D4><U+0000><U+0000><U+0000><98><U+0000><U+0000><U+0000><<U+0000><U+0000><U+0000><U+0000><U+0000><U+0000><U+0000><U+0000><U+0000><U+0000><U+0000><U+0000><U+0000><U+0000><U+0000><U+0001><U+0000><U+0000><U+0000><98><U+0000><U+0000><U+0000><<U+0000><U+0000><U+0015>com.apple.quarantine<U+0000>q/0081;5fcd4ffe;Chrome;AA7E4432-765C-4D39-8B59-788415BC3068
  112.  
  113.  
  114.  
  115.  
  116.  
  117.  
  118.  
  119.  
  120.  
  121.  
  122.  
  123.  
  124.  
  125.  
  126.  
  127.  
  128.  
  129.  
  130. ^  
  131. /var/mobile/theos/sdks/iPhoneOS11.2.sdk/usr/include/_types/.__uint16_t.h:1:176: error: unknown type
  132. name 'AA7E4432'  
  133. <U+0000><U+0005><U+0016><U+0007><U+0000><U+0002><U+0000><U+0000>Mac OS X <U+0000><U+0002><U+0000><U+0000><U+0000> <U+0000><U+0000><U+0000>2<U+0000><U+0000><U+0000><A2><U+0000><U+0000><U+0000><U+0002><U+0000><U+0000><U+0000><D4><U+0000><U+0000><U+0000><U+0000><U+0000><U+0000><U+0000><U+0000><U+0000><U+0000><U+0000><U+0000><U+0000><U+0000><U+0000><U+0000><U+0000><U+0000><U+0000><U+0000><U+0000><U+0000><U+0000><U+0000><U+0000><U+0000><U+0000><U+0000><U+0000><U+0000><U+0000><U+0000><U+0000><U+0000><U+0000><U+0000><U+0000><U+0000>ATTR<U+0000><U+0000><U+0000><U+0000><U+0000><U+0000><U+0000><D4><U+0000><U+0000><U+0000><98><U+0000><U+0000><U+0000><<U+0000><U+0000><U+0000><U+0000><U+0000><U+0000><U+0000><U+0000><U+0000><U+0000><U+0000><U+0000><U+0000><U+0000><U+0000><U+0001><U+0000><U+0000><U+0000><98><U+0000><U+0000><U+0000><<U+0000><U+0000><U+0015>com.apple.quarantine<U+0000>q/0081;5fcd4ffe;Chrome;AA7E4432-765C-4D39-8B59-788415BC3068
  134.  
  135.  
  136.  
  137.  
  138.  
  139.  
  140.  
  141.  
  142.  
  143.  
  144.  
  145.  
  146.  
  147.  
  148.  
  149.  
  150.  
  151.  
  152. ^  
  153. fatal error: too many errors emitted, stopping now [-ferror-limit=]  
  154. While building module 'UIKit' imported from Tweak.xm:1:  
  155. In file included from <module-includes>:2:  
  156. In file included from /var/mobile/theos/sdks/iPhoneOS11.2.sdk/System/Library/Frameworks/UIKit.framework/Headers/UIKit.h:8:  
  157. /var/mobile/theos/sdks/iPhoneOS11.2.sdk/System/Library/Frameworks/UIKit.framework/Headers/UIKitDefines.h:8:9: fatal error: could not build module 'Darwin'  
  158. #import <Availability.h>  
  159. ~~~~~~~^  
  160. While building module 'UIKit' imported from Tweak.xm:1:  
  161. While building module 'Foundation' imported from /var/mobile/theos/sdks/iPhoneOS11.2.sdk/System/Library/Frameworks/UIKit.framework/Headers/UIAccelerometer.h:8:  
  162. While building module 'CoreFoundation' imported from /var/mobile/theos/sdks/iPhoneOS11.2.sdk/System/Library/Frameworks/Foundation.framework/Headers/Foundation.h:6:  
  163. In file included from <module-includes>:2:  
  164. /var/mobile/theos/sdks/iPhoneOS11.2.sdk/System/Library/Frameworks/CoreFoundation.framework/Headers/CoreFoundation.h:16:10: fatal error: could not build module 'Darwin'  
  165. #include <sys/types.h>  
  166. ~~~~~~~~^  
  167. While building module 'UIKit' imported from Tweak.xm:1:  
  168. While building module 'Foundation' imported from /var/mobile/theos/sdks/iPhoneOS11.2.sdk/System/Library/Frameworks/UIKit.framework/Headers/UIAccelerometer.h:8:  
  169. While building module 'CoreFoundation' imported from /var/mobile/theos/sdks/iPhoneOS11.2.sdk/System/Library/Frameworks/Foundation.framework/Headers/Foundation.h:6:  
  170. While building module 'Dispatch' imported from /var/mobile/theos/sdks/iPhoneOS11.2.sdk/System/Library/Frameworks/CoreFoundation.framework/Headers/CFStream.h:20:  
  171. In file included from <module-includes>:2:  
  172. /var/mobile/theos/sdks/iPhoneOS11.2.sdk/usr/include/dispatch/dispatch.h:25:10: fatal error: could not build module 'Darwin'  
  173. #include <Availability.h>  
  174. ~~~~~~~~^  
  175. While building module 'UIKit' imported from Tweak.xm:1:  
  176. While building module 'Foundation' imported from /var/mobile/theos/sdks/iPhoneOS11.2.sdk/System/Library/Frameworks/UIKit.framework/Headers/UIAccelerometer.h:8:  
  177. While building module 'CoreFoundation' imported from /var/mobile/theos/sdks/iPhoneOS11.2.sdk/System/Library/Frameworks/Foundation.framework/Headers/Foundation.h:6:  
  178. While building module 'Dispatch' imported from /var/mobile/theos/sdks/iPhoneOS11.2.sdk/System/Library/Frameworks/CoreFoundation.framework/Headers/CFStream.h:20:  
  179. While building module 'os_object' imported from /var/mobile/theos/sdks/iPhoneOS11.2.sdk/usr/include/dispatch/dispatch.h:59:  
  180. In file included from <module-includes>:2:  
  181. /var/mobile/theos/sdks/iPhoneOS11.2.sdk/usr/include/os/object.h:25:10: fatal error: could not build
  182. module 'Darwin'  
  183. #include <Availability.h>  
  184. ~~~~~~~~^  
  185. While building module 'UIKit' imported from Tweak.xm:1:  
  186. While building module 'Foundation' imported from /var/mobile/theos/sdks/iPhoneOS11.2.sdk/System/Library/Frameworks/UIKit.framework/Headers/UIAccelerometer.h:8:  
  187. In file included from <module-includes>:2:  
  188. /var/mobile/theos/sdks/iPhoneOS11.2.sdk/System/Library/Frameworks/Foundation.framework/Headers/Foundation.h:6:10: fatal error: could not build module
  189. 'CoreFoundation'  
  190. #include <CoreFoundation/CoreFoundation.h>  
  191. ~~~~~~~~^  
  192. While building module 'UIKit' imported from Tweak.xm:1:  
  193. While building module 'Foundation' imported from /var/mobile/theos/sdks/iPhoneOS11.2.sdk/System/Library/Frameworks/UIKit.framework/Headers/UIAccelerometer.h:8:  
  194. While building module 'ObjectiveC' imported from /var/mobile/theos/sdks/iPhoneOS11.2.sdk/System/Library/Frameworks/Foundation.framework/Headers/NSObject.h:6:  
  195. In file included from <module-includes>:2:  
  196. In file included from /var/mobile/theos/sdks/iPhoneOS11.2.sdk/usr/include/objc/./objc-exception.h:27:  
  197. /var/mobile/theos/sdks/iPhoneOS11.2.sdk/usr/include/objc/objc.h:31:10: fatal error: could not build
  198. module 'Darwin'  
  199. #include <sys/types.h> // for __DARWIN_NULL 
  200. ~~~~~~~~^  
  201. While building module 'UIKit' imported from Tweak.xm:1:  
  202. While building module 'Foundation' imported from /var/mobile/theos/sdks/iPhoneOS11.2.sdk/System/Library/Frameworks/UIKit.framework/Headers/UIAccelerometer.h:8:  
  203. While building module 'Security' imported from /var/mobile/theos/sdks/iPhoneOS11.2.sdk/System/Library/Frameworks/Foundation.framework/Headers/NSURLCredential.h:9:  
  204. In file included from <module-includes>:2:  
  205. In file included from /var/mobile/theos/sdks/iPhoneOS11.2.sdk/System/Library/Frameworks/Security.framework/Headers/Security.h:27:  
  206. /var/mobile/theos/sdks/iPhoneOS11.2.sdk/System/Library/Frameworks/Security.framework/Headers/SecBase.h:27:10: fatal error: could not build module 'Darwin'  
  207. #include <TargetConditionals.h>  
  208. ~~~~~~~~^  
  209. While building module 'UIKit' imported from Tweak.xm:1:  
  210. While building module 'CoreGraphics' imported from /var/mobile/theos/sdks/iPhoneOS11.2.sdk/System/Library/Frameworks/UIKit.framework/Headers/UIAccessibility.h:9:  
  211. In file included from <module-includes>:2:  
  212. In file included from /var/mobile/theos/sdks/iPhoneOS11.2.sdk/System/Library/Frameworks/CoreGraphics.framework/Headers/CoreGraphics.h:8:  
  213. /var/mobile/theos/sdks/iPhoneOS11.2.sdk/System/Library/Frameworks/CoreGraphics.framework/Headers/CGBase.h:8:10: fatal error: could not build module 'Darwin'  
  214. #include <stdbool.h>  
  215. ~~~~~~~~^  
  216. While building module 'UIKit' imported from Tweak.xm:1:  
  217. While building module 'QuartzCore' imported from /var/mobile/theos/sdks/iPhoneOS11.2.sdk/System/Library/Frameworks/UIKit.framework/Headers/UIView.h:9:  
  218. In file included from <module-includes>:1:  
  219. In file included from /var/mobile/theos/sdks/iPhoneOS11.2.sdk/System/Library/Frameworks/QuartzCore.framework/Headers/QuartzCore.h:9:  
  220. In file included from /var/mobile/theos/sdks/iPhoneOS11.2.sdk/System/Library/Frameworks/QuartzCore.framework/Headers/CoreAnimation.h:9:  
  221. /var/mobile/theos/sdks/iPhoneOS11.2.sdk/System/Library/Frameworks/QuartzCore.framework/Headers/CABase.h:11:10: fatal error: could not build module 'Darwin'  
  222. #include <stdbool.h>  
  223. ~~~~~~~~^  
  224. While building module 'UIKit' imported from Tweak.xm:1:  
  225. While building module 'QuartzCore' imported from /var/mobile/theos/sdks/iPhoneOS11.2.sdk/System/Library/Frameworks/UIKit.framework/Headers/UIView.h:9:  
  226. While building module 'OpenGLES' imported from /var/mobile/theos/sdks/iPhoneOS11.2.sdk/System/Library/Frameworks/QuartzCore.framework/Headers/CAEAGLLayer.h:7:  
  227. In file included from <module-includes>:2:  
  228. /var/mobile/theos/sdks/iPhoneOS11.2.sdk/System/Library/Frameworks/OpenGLES.framework/Headers/._gltypes.h:1:2: error: expected unqualified-id  
  229. <U+0000><U+0005><U+0016><U+0007><U+0000><U+0002><U+0000><U+0000>Mac OS X <U+0000><U+0002><U+0000><U+0000><U+0000> <U+0000><U+0000><U+0000>2<U+0000><U+0000><U+0000><A2><U+0000><U+0000><U+0000><U+0002><U+0000><U+0000><U+0000><D4><U+0000><U+0000><U+0000><U+0000><U+0000><U+0000><U+0000><U+0000><U+0000><U+0000><U+0000><U+0000><U+0000><U+0000><U+0000><U+0000><U+0000><U+0000><U+0000><U+0000><U+0000><U+0000><U+0000><U+0000><U+0000><U+0000><U+0000><U+0000><U+0000><U+0000><U+0000><U+0000><U+0000><U+0000><U+0000><U+0000><U+0000><U+0000>ATTR<U+0000><U+0000><U+0000><U+0000><U+0000><U+0000><U+0000><D4><U+0000><U+0000><U+0000><98><U+0000><U+0000><U+0000><<U+0000><U+0000><U+0000><U+0000><U+0000><U+0000><U+0000><U+0000><U+0000><U+0000><U+0000><U+0000><U+0000><U+0000><U+0000><U+0001><U+0000><U+0000><U+0000><98><U+0000><U+0000><U+0000><<U+0000><U+0000><U+0015>com.apple.quarantine<U+0000>q/0081;5fcd4ffe;Chrome;AA7E4432-765C-4D39-8B59-788415BC3068
  230. ^  
  231. /var/mobile/theos/sdks/iPhoneOS11.2.sdk/System/Library/Frameworks/OpenGLES.framework/Headers/._gltypes.h:1:38: error: source file is not valid UTF-8 
  232. <U+0000><U+0005><U+0016><U+0007><U+0000><U+0002><U+0000><U+0000>Mac OS X <U+0000><U+0002><U+0000><U+0000><U+0000> <U+0000><U+0000><U+0000>2<U+0000><U+0000><U+0000><A2><U+0000><U+0000><U+0000><U+0002><U+0000><U+0000><U+0000><D4><U+0000><U+0000><U+0000><U+0000><U+0000><U+0000><U+0000><U+0000><U+0000><U+0000><U+0000><U+0000><U+0000><U+0000><U+0000><U+0000><U+0000><U+0000><U+0000><U+0000><U+0000><U+0000><U+0000><U+0000><U+0000><U+0000><U+0000><U+0000><U+0000><U+0000><U+0000><U+0000><U+0000><U+0000><U+0000><U+0000><U+0000><U+0000>ATTR<U+0000><U+0000><U+0000><U+0000><U+0000><U+0000><U+0000><D4><U+0000><U+0000><U+0000><98><U+0000><U+0000><U+0000><<U+0000><U+0000><U+0000><U+0000><U+0000><U+0000><U+0000><U+0000><U+0000><U+0000><U+0000><U+0000><U+0000><U+0000><U+0000><U+0001><U+0000><U+0000><U+0000><98><U+0000><U+0000><U+0000><<U+0000><U+0000><U+0015>com.apple.quarantine<U+0000>q/0081;5fcd4ffe;Chrome;AA7E4432-765C-4D39-8B59-788415BC3068
  233.  
  234.  
  235.  
  236. ^  
  237. /var/mobile/theos/sdks/iPhoneOS11.2.sdk/System/Library/Frameworks/OpenGLES.framework/Headers/._gltypes.h:1:46: error: source file is not valid UTF-8 
  238. <U+0000><U+0005><U+0016><U+0007><U+0000><U+0002><U+0000><U+0000>Mac OS X <U+0000><U+0002><U+0000><U+0000><U+0000> <U+0000><U+0000><U+0000>2<U+0000><U+0000><U+0000><A2><U+0000><U+0000><U+0000><U+0002><U+0000><U+0000><U+0000><D4><U+0000><U+0000><U+0000><U+0000><U+0000><U+0000><U+0000><U+0000><U+0000><U+0000><U+0000><U+0000><U+0000><U+0000><U+0000><U+0000><U+0000><U+0000><U+0000><U+0000><U+0000><U+0000><U+0000><U+0000><U+0000><U+0000><U+0000><U+0000><U+0000><U+0000><U+0000><U+0000><U+0000><U+0000><U+0000><U+0000><U+0000><U+0000>ATTR<U+0000><U+0000><U+0000><U+0000><U+0000><U+0000><U+0000><D4><U+0000><U+0000><U+0000><98><U+0000><U+0000><U+0000><<U+0000><U+0000><U+0000><U+0000><U+0000><U+0000><U+0000><U+0000><U+0000><U+0000><U+0000><U+0000><U+0000><U+0000><U+0000><U+0001><U+0000><U+0000><U+0000><98><U+0000><U+0000><U+0000><<U+0000><U+0000><U+0015>com.apple.quarantine<U+0000>q/0081;5fcd4ffe;Chrome;AA7E4432-765C-4D39-8B59-788415BC3068
  239.  
  240.  
  241.  
  242.  
  243. ^  
  244. /var/mobile/theos/sdks/iPhoneOS11.2.sdk/System/Library/Frameworks/OpenGLES.framework/Headers/._gltypes.h:1:96: error: source file is not valid UTF-8 
  245. <U+0000><U+0005><U+0016><U+0007><U+0000><U+0002><U+0000><U+0000>Mac OS X <U+0000><U+0002><U+0000><U+0000><U+0000> <U+0000><U+0000><U+0000>2<U+0000><U+0000><U+0000><A2><U+0000><U+0000><U+0000><U+0002><U+0000><U+0000><U+0000><D4><U+0000><U+0000><U+0000><U+0000><U+0000><U+0000><U+0000><U+0000><U+0000><U+0000><U+0000><U+0000><U+0000><U+0000><U+0000><U+0000><U+0000><U+0000><U+0000><U+0000><U+0000><U+0000><U+0000><U+0000><U+0000><U+0000><U+0000><U+0000><U+0000><U+0000><U+0000><U+0000><U+0000><U+0000><U+0000><U+0000><U+0000><U+0000>ATTR<U+0000><U+0000><U+0000><U+0000><U+0000><U+0000><U+0000><D4><U+0000><U+0000><U+0000><98><U+0000><U+0000><U+0000><<U+0000><U+0000><U+0000><U+0000><U+0000><U+0000><U+0000><U+0000><U+0000><U+0000><U+0000><U+0000><U+0000><U+0000><U+0000><U+0001><U+0000><U+0000><U+0000><98><U+0000><U+0000><U+0000><<U+0000><U+0000><U+0015>com.apple.quarantine<U+0000>q/0081;5fcd4ffe;Chrome;AA7E4432-765C-4D39-8B59-788415BC3068
  246.  
  247.  
  248.  
  249.  
  250.  
  251.  
  252.  
  253.  
  254.  
  255.  
  256.  
  257.  
  258. ^  
  259. /var/mobile/theos/sdks/iPhoneOS11.2.sdk/System/Library/Frameworks/OpenGLES.framework/Headers/._gltypes.h:1:100: error: source file is not valid UTF-8
  260. <U+0000><U+0005><U+0016><U+0007><U+0000><U+0002><U+0000><U+0000>Mac OS X <U+0000><U+0002><U+0000><U+0000><U+0000> <U+0000><U+0000><U+0000>2<U+0000><U+0000><U+0000><A2><U+0000><U+0000><U+0000><U+0002><U+0000><U+0000><U+0000><D4><U+0000><U+0000><U+0000><U+0000><U+0000><U+0000><U+0000><U+0000><U+0000><U+0000><U+0000><U+0000><U+0000><U+0000><U+0000><U+0000><U+0000><U+0000><U+0000><U+0000><U+0000><U+0000><U+0000><U+0000><U+0000><U+0000><U+0000><U+0000><U+0000><U+0000><U+0000><U+0000><U+0000><U+0000><U+0000><U+0000><U+0000><U+0000>ATTR<U+0000><U+0000><U+0000><U+0000><U+0000><U+0000><U+0000><D4><U+0000><U+0000><U+0000><98><U+0000><U+0000><U+0000><<U+0000><U+0000><U+0000><U+0000><U+0000><U+0000><U+0000><U+0000><U+0000><U+0000><U+0000><U+0000><U+0000><U+0000><U+0000><U+0001><U+0000><U+0000><U+0000><98><U+0000><U+0000><U+0000><<U+0000><U+0000><U+0015>com.apple.quarantine<U+0000>q/0081;5fcd4ffe;Chrome;AA7E4432-765C-4D39-8B59-788415BC3068
  261.  
  262.  
  263.  
  264.  
  265.  
  266.  
  267.  
  268.  
  269.  
  270.  
  271.  
  272.  
  273. ^  
  274. /var/mobile/theos/sdks/iPhoneOS11.2.sdk/System/Library/Frameworks/OpenGLES.framework/Headers/._gltypes.h:1:124: error: source file is not valid UTF-8
  275. <U+0000><U+0005><U+0016><U+0007><U+0000><U+0002><U+0000><U+0000>Mac OS X <U+0000><U+0002><U+0000><U+0000><U+0000> <U+0000><U+0000><U+0000>2<U+0000><U+0000><U+0000><A2><U+0000><U+0000><U+0000><U+0002><U+0000><U+0000><U+0000><D4><U+0000><U+0000><U+0000><U+0000><U+0000><U+0000><U+0000><U+0000><U+0000><U+0000><U+0000><U+0000><U+0000><U+0000><U+0000><U+0000><U+0000><U+0000><U+0000><U+0000><U+0000><U+0000><U+0000><U+0000><U+0000><U+0000><U+0000><U+0000><U+0000><U+0000><U+0000><U+0000><U+0000><U+0000><U+0000><U+0000><U+0000><U+0000>ATTR<U+0000><U+0000><U+0000><U+0000><U+0000><U+0000><U+0000><D4><U+0000><U+0000><U+0000><98><U+0000><U+0000><U+0000><<U+0000><U+0000><U+0000><U+0000><U+0000><U+0000><U+0000><U+0000><U+0000><U+0000><U+0000><U+0000><U+0000><U+0000><U+0000><U+0001><U+0000><U+0000><U+0000><98><U+0000><U+0000><U+0000><<U+0000><U+0000><U+0015>com.apple.quarantine<U+0000>q/0081;5fcd4ffe;Chrome;AA7E4432-765C-4D39-8B59-788415BC3068
  276.  
  277.  
  278.  
  279.  
  280.  
  281.  
  282.  
  283.  
  284.  
  285.  
  286.  
  287.  
  288.  
  289.  
  290.  
  291.  
  292. ^  
  293. /var/mobile/theos/sdks/iPhoneOS11.2.sdk/System/Library/Frameworks/OpenGLES.framework/Headers/._gltypes.h:1:160: error: expected unqualified-id  
  294. <U+0000><U+0005><U+0016><U+0007><U+0000><U+0002><U+0000><U+0000>Mac OS X <U+0000><U+0002><U+0000><U+0000><U+0000> <U+0000><U+0000><U+0000>2<U+0000><U+0000><U+0000><A2><U+0000><U+0000><U+0000><U+0002><U+0000><U+0000><U+0000><D4><U+0000><U+0000><U+0000><U+0000><U+0000><U+0000><U+0000><U+0000><U+0000><U+0000><U+0000><U+0000><U+0000><U+0000><U+0000><U+0000><U+0000><U+0000><U+0000><U+0000><U+0000><U+0000><U+0000><U+0000><U+0000><U+0000><U+0000><U+0000><U+0000><U+0000><U+0000><U+0000><U+0000><U+0000><U+0000><U+0000><U+0000><U+0000>ATTR<U+0000><U+0000><U+0000><U+0000><U+0000><U+0000><U+0000><D4><U+0000><U+0000><U+0000><98><U+0000><U+0000><U+0000><<U+0000><U+0000><U+0000><U+0000><U+0000><U+0000><U+0000><U+0000><U+0000><U+0000><U+0000><U+0000><U+0000><U+0000><U+0000><U+0001><U+0000><U+0000><U+0000><98><U+0000><U+0000><U+0000><<U+0000><U+0000><U+0015>com.apple.quarantine<U+0000>q/0081;5fcd4ffe;Chrome;AA7E4432-765C-4D39-8B59-788415BC3068
  295.  
  296.  
  297.  
  298.  
  299.  
  300.  
  301.  
  302.  
  303.  
  304.  
  305.  
  306.  
  307.  
  308.  
  309.  
  310.  
  311.  
  312. ^ 
  313. /var/mobile/theos/sdks/iPhoneOS11.2.sdk/System/Library/Frameworks/OpenGLES.framework/Headers/._gltypes.h:1:169: error: C++ requires a type specifier for all declarations  
  314. <U+0000><U+0005><U+0016><U+0007><U+0000><U+0002><U+0000><U+0000>Mac OS X <U+0000><U+0002><U+0000><U+0000><U+0000> <U+0000><U+0000><U+0000>2<U+0000><U+0000><U+0000><A2><U+0000><U+0000><U+0000><U+0002><U+0000><U+0000><U+0000><D4><U+0000><U+0000><U+0000><U+0000><U+0000><U+0000><U+0000><U+0000><U+0000><U+0000><U+0000><U+0000><U+0000><U+0000><U+0000><U+0000><U+0000><U+0000><U+0000><U+0000><U+0000><U+0000><U+0000><U+0000><U+0000><U+0000><U+0000><U+0000><U+0000><U+0000><U+0000><U+0000><U+0000><U+0000><U+0000><U+0000><U+0000><U+0000>ATTR<U+0000><U+0000><U+0000><U+0000><U+0000><U+0000><U+0000><D4><U+0000><U+0000><U+0000><98><U+0000><U+0000><U+0000><<U+0000><U+0000><U+0000><U+0000><U+0000><U+0000><U+0000><U+0000><U+0000><U+0000><U+0000><U+0000><U+0000><U+0000><U+0000><U+0001><U+0000><U+0000><U+0000><98><U+0000><U+0000><U+0000><<U+0000><U+0000><U+0015>com.apple.quarantine<U+0000>q/0081;5fcd4ffe;Chrome;AA7E4432-765C-4D39-8B59-788415BC3068
  315.  
  316.  
  317.  
  318.  
  319.  
  320.  
  321.  
  322.  
  323.  
  324.  
  325.  
  326.  
  327.  
  328.  
  329.  
  330.  
  331.  
  332.  
  333. ^  
  334. /var/mobile/theos/sdks/iPhoneOS11.2.sdk/System/Library/Frameworks/OpenGLES.framework/Headers/._gltypes.h:1:176: error: unknown type name 'AA7E4432'  
  335. <U+0000><U+0005><U+0016><U+0007><U+0000><U+0002><U+0000><U+0000>Mac OS X <U+0000><U+0002><U+0000><U+0000><U+0000> <U+0000><U+0000><U+0000>2<U+0000><U+0000><U+0000><A2><U+0000><U+0000><U+0000><U+0002><U+0000><U+0000><U+0000><D4><U+0000><U+0000><U+0000><U+0000><U+0000><U+0000><U+0000><U+0000><U+0000><U+0000><U+0000><U+0000><U+0000><U+0000><U+0000><U+0000><U+0000><U+0000><U+0000><U+0000><U+0000><U+0000><U+0000><U+0000><U+0000><U+0000><U+0000><U+0000><U+0000><U+0000><U+0000><U+0000><U+0000><U+0000><U+0000><U+0000><U+0000><U+0000>ATTR<U+0000><U+0000><U+0000><U+0000><U+0000><U+0000><U+0000><D4><U+0000><U+0000><U+0000><98><U+0000><U+0000><U+0000><<U+0000><U+0000><U+0000><U+0000><U+0000><U+0000><U+0000><U+0000><U+0000><U+0000><U+0000><U+0000><U+0000><U+0000><U+0000><U+0001><U+0000><U+0000><U+0000><98><U+0000><U+0000><U+0000><<U+0000><U+0000><U+0015>com.apple.quarantine<U+0000>q/0081;5fcd4ffe;Chrome;AA7E4432-765C-4D39-8B59-788415BC3068
  336.  
  337.  
  338.  
  339.  
  340.  
  341.  
  342.  
  343.  
  344.  
  345.  
  346.  
  347.  
  348.  
  349.  
  350.  
  351.  
  352.  
  353.  
  354. ^  
  355. /var/mobile/theos/sdks/iPhoneOS11.2.sdk/System/Library/Frameworks/OpenGLES.framework/Headers/._gltypes.h:1:184: error: expected unqualified-id  
  356. <U+0000><U+0005><U+0016><U+0007><U+0000><U+0002><U+0000><U+0000>Mac OS X <U+0000><U+0002><U+0000><U+0000><U+0000> <U+0000><U+0000><U+0000>2<U+0000><U+0000><U+0000><A2><U+0000><U+0000><U+0000><U+0002><U+0000><U+0000><U+0000><D4><U+0000><U+0000><U+0000><U+0000><U+0000><U+0000><U+0000><U+0000><U+0000><U+0000><U+0000><U+0000><U+0000><U+0000><U+0000><U+0000><U+0000><U+0000><U+0000><U+0000><U+0000><U+0000><U+0000><U+0000><U+0000><U+0000><U+0000><U+0000><U+0000><U+0000><U+0000><U+0000><U+0000><U+0000><U+0000><U+0000><U+0000><U+0000>ATTR<U+0000><U+0000><U+0000><U+0000><U+0000><U+0000><U+0000><D4><U+0000><U+0000><U+0000><98><U+0000><U+0000><U+0000><<U+0000><U+0000><U+0000><U+0000><U+0000><U+0000><U+0000><U+0000><U+0000><U+0000><U+0000><U+0000><U+0000><U+0000><U+0000><U+0001><U+0000><U+0000><U+0000><98><U+0000><U+0000><U+0000><<U+0000><U+0000><U+0015>com.apple.quarantine<U+0000>q/0081;5fcd4ffe;Chrome;AA7E4432-765C-4D39-8B59-788415BC3068
  357.  
  358.  
  359.  
  360.  
  361.  
  362.  
  363.  
  364.  
  365.  
  366.  
  367.  
  368.  
  369.  
  370.  
  371.  
  372.  
  373.  
  374.  
  375. ^  
  376. While building module 'UIKit' imported from Tweak.xm:1:  
  377. While building module 'QuartzCore' imported from /var/mobile/theos/sdks/iPhoneOS11.2.sdk/System/Library/Frameworks/UIKit.framework/Headers/UIView.h:9:  
  378. While building module 'OpenGLES' imported from /var/mobile/theos/sdks/iPhoneOS11.2.sdk/System/Library/Frameworks/QuartzCore.framework/Headers/CAEAGLLayer.h:7:  
  379. In file included from <module-includes>:5:  
  380. /var/mobile/theos/sdks/iPhoneOS11.2.sdk/System/Library/Frameworks/OpenGLES.framework/Headers/gltypes.h:7:10: fatal error: could not build module 'Darwin'  
  381. #include <stdint.h>  
  382. ~~~~~~~~^  
  383. While building module 'UIKit' imported from Tweak.xm:1:  
  384. While building module 'QuartzCore' imported from /var/mobile/theos/sdks/iPhoneOS11.2.sdk/System/Library/Frameworks/UIKit.framework/Headers/UIView.h:9:  
  385. While building module 'Metal' imported from /var/mobile/theos/sdks/iPhoneOS11.2.sdk/System/Library/Frameworks/QuartzCore.framework/Headers/CAMetalLayer.h:7:  
  386. In file included from <module-includes>:2:  
  387. In file included from /var/mobile/theos/sdks/iPhoneOS11.2.sdk/System/Library/Frameworks/Metal.framework/Headers/Metal.h:8:  
  388. /var/mobile/theos/sdks/iPhoneOS11.2.sdk/System/Library/Frameworks/Metal.framework/Headers/MTLDefines.h:8:9: fatal error: could not build module 'Darwin'  
  389. #import <Availability.h>  
  390. ~~~~~~~^  
  391. While building module 'UIKit' imported from Tweak.xm:1:  
  392. While building module 'QuartzCore' imported from /var/mobile/theos/sdks/iPhoneOS11.2.sdk/System/Library/Frameworks/UIKit.framework/Headers/UIView.h:9:  
  393. While building module 'Metal' imported from /var/mobile/theos/sdks/iPhoneOS11.2.sdk/System/Library/Frameworks/QuartzCore.framework/Headers/CAMetalLayer.h:7:  
  394. While building module 'IOSurface' imported from /var/mobile/theos/sdks/iPhoneOS11.2.sdk/System/Library/Frameworks/Metal.framework/Headers/MTLTexture.h:15:  
  395. In file included from <module-includes>:2:  
  396. /var/mobile/theos/sdks/iPhoneOS11.2.sdk/System/Library/Frameworks/IOSurface.framework/Headers/IOSurfaceBase.h:12:10: fatal error: could not build module 'Darwin'  
  397. #include <sys/cdefs.h>  
  398. ~~~~~~~~^  
  399. While building module 'UIKit' imported from Tweak.xm:1:  
  400. While building module 'CoreImage' imported from /var/mobile/theos/sdks/iPhoneOS11.2.sdk/System/Library/Frameworks/UIKit.framework/Headers/UIColor.h:11:  
  401. In file included from <module-includes>:2:  
  402. In file included from /var/mobile/theos/sdks/iPhoneOS11.2.sdk/System/Library/Frameworks/CoreImage.framework/Headers/CoreImage.h:8:  
  403. /var/mobile/theos/sdks/iPhoneOS11.2.sdk/System/Library/Frameworks/CoreImage.framework/Headers/CoreImageDefines.h:10:10: fatal error: could not build module 'Darwin'  
  404. #include <TargetConditionals.h>  
  405. ~~~~~~~~^  
  406. While building module 'UIKit' imported from Tweak.xm:1:  
  407. While building module 'CoreImage' imported from /var/mobile/theos/sdks/iPhoneOS11.2.sdk/System/Library/Frameworks/UIKit.framework/Headers/UIColor.h:11:  
  408. While building module 'CoreVideo' imported from /var/mobile/theos/sdks/iPhoneOS11.2.sdk/System/Library/Frameworks/CoreImage.framework/Headers/CIImage.h:10:  
  409. In file included from <module-includes>:2:  
  410. /var/mobile/theos/sdks/iPhoneOS11.2.sdk/System/Library/Frameworks/CoreVideo.framework/Headers/CoreVideo.h:16:10: fatal error: could not build module 'Darwin'  
  411. #include <TargetConditionals.h>  
  412. ~~~~~~~~^  
  413. While building module 'UIKit' imported from Tweak.xm:1:  
  414. While building module 'CoreImage' imported from /var/mobile/theos/sdks/iPhoneOS11.2.sdk/System/Library/Frameworks/UIKit.framework/Headers/UIColor.h:11:  
  415. While building module 'ImageIO' imported from /var/mobile/theos/sdks/iPhoneOS11.2.sdk/System/Library/Frameworks/CoreImage.framework/Headers/CIImage.h:11:  
  416. In file included from <module-includes>:2:  
  417. In file included from /var/mobile/theos/sdks/iPhoneOS11.2.sdk/System/Library/Frameworks/ImageIO.framework/Headers/ImageIO.h:10:  
  418. /var/mobile/theos/sdks/iPhoneOS11.2.sdk/System/Library/Frameworks/ImageIO.framework/Headers/ImageIOBase.h:11:10: fatal error: could not build module 'CoreFoundation'  
  419. #include <CoreFoundation/CoreFoundation.h>  
  420. ~~~~~~~~^  
  421. While building module 'UIKit' imported from Tweak.xm:1:  
  422. While building module 'CoreText' imported from /var/mobile/theos/sdks/iPhoneOS11.2.sdk/System/Library/Frameworks/UIKit.framework/Headers/NSText.h:10:
  423. In file included from <module-includes>:2:  
  424. In file included from /var/mobile/theos/sdks/iPhoneOS11.2.sdk/System/Library/Frameworks/CoreText.framework/Headers/CoreText.h:20:  
  425. /var/mobile/theos/sdks/iPhoneOS11.2.sdk/System/Library/Frameworks/CoreText.framework/Headers/CTDefines.h:12:10: fatal error: could not build module 'Darwin'  
  426. #include <Availability.h>  
  427. ~~~~~~~~^  
  428. While building module 'UIKit' imported from Tweak.xm:1:  
  429. While building module 'FileProvider' imported from /var/mobile/theos/sdks/iPhoneOS11.2.sdk/System/Library/Frameworks/UIKit.framework/Headers/NSFileProviderExtension.h:14:  
  430. In file included from <module-includes>:1:  
  431. In file included from /var/mobile/theos/sdks/iPhoneOS11.2.sdk/System/Library/Frameworks/FileProvider.framework/Headers/FileProvider.h:8:  
  432. /var/mobile/theos/sdks/iPhoneOS11.2.sdk/System/Library/Frameworks/FileProvider.framework/Headers/NSFileProviderDomain.h:8:9: fatal error: could not build module 'Foundation'  
  433. #import <Foundation/Foundation.h>  
  434. ~~~~~~~^  
  435. Tweak.xm:1:9: fatal error: could not build module
  436. 'UIKit'  
  437. #import <UIKit/UIKit.h>  
  438. ~~~~~~~^  
  439. While building module 'MachO' imported from /var/mobile/theos/vendor/include/substrate.h:45:  
  440. In file included from <module-includes>:2:  
  441. /var/mobile/theos/sdks/iPhoneOS11.2.sdk/usr/include/mach-o/arch.h:32:10: fatal error: could not build module 'Darwin'  
  442. #include <stdint.h>  
  443. ~~~~~~~~^  
  444. 49 errors generated.  
  445. make[3]: *** [/var/mobile/theos/makefiles/instance/rules.mk:270: /var/mobile/Sandbox/.theos/obj/debug/arm64/Tweak.xm.c3ed72a1.o] Error 1  
  446. make[2]: *** [/var/mobile/theos/makefiles/instance/library.mk:52: /var/mobile/Sandbox/.theos/obj/debug/arm64/photomathtweak.dylib] Error 2  
  447. make[1]: *** [/var/mobile/theos/makefiles/instance/library.mk:37: internal-library-all_] Error 2  
  448. make: *** [/var/mobile/theos/makefiles/master/rules.mk:116: photomathtweak.all.tweak.variables] Error 2  
  449. localhost:/var/mobile/Sandbox root#
Advertisement
Add Comment
Please, Sign In to add comment