Advertisement
Guest User

Gradle build failed.

a guest
Aug 8th, 2020
38
Never
Not a member of Pastebin yet? Sign Up, it unlocks many cool features!
  1. CommandInvokationFailure: Gradle build failed.
  2. /Applications/Unity/Hub/Editor/2019.4.4f1/PlaybackEngines/AndroidPlayer/OpenJDK/bin/java -classpath "/Applications/Unity/Hub/Editor/2019.4.4f1/PlaybackEngines/AndroidPlayer/Tools/gradle/lib/gradle-launcher-5.1.1.jar" org.gradle.launcher.GradleMain "-Dorg.gradle.jvmargs=-Xmx4096m" "assembleRelease"
  3.  
  4. stderr[
  5. D8: Type com.google.firebase.iid.zzbb is referenced as an interface from `com.google.firebase.messaging.zzf`.
  6. com.android.builder.dexing.DexArchiveBuilderException: com.android.builder.dexing.DexArchiveBuilderException: Failed to process /Users/shihab/.gradle/caches/transforms-2/files-2.1/a8d5840093588f0ddf1422752232c91b/jars/classes.jar
  7. at sun.reflect.NativeConstructorAccessorImpl.newInstance0(Native Method)
  8. at sun.reflect.NativeConstructorAccessorImpl.newInstance(NativeConstructorAccessorImpl.java:62)
  9. at sun.reflect.DelegatingConstructorAccessorImpl.newInstance(DelegatingConstructorAccessorImpl.java:45)
  10. at java.lang.reflect.Constructor.newInstance(Constructor.java:423)
  11. at java.util.concurrent.ForkJoinTask.getThrowableException(ForkJoinTask.java:593)
  12. at java.util.concurrent.ForkJoinTask.reportException(ForkJoinTask.java:677)
  13. at java.util.concurrent.ForkJoinTask.join(ForkJoinTask.java:720)
  14. at com.android.ide.common.internal.WaitableExecutor.waitForTasksWithQuickFail(WaitableExecutor.java:149)
  15. at com.android.build.gradle.internal.transforms.DexArchiveBuilderTransform.transform(DexArchiveBuilderTransform.java:420)
  16. at com.android.build.gradle.internal.pipeline.TransformTask$2.call(TransformTask.java:239)
  17. at com.android.build.gradle.internal.pipeline.TransformTask$2.call(TransformTask.java:235)
  18. at com.android.builder.profile.ThreadRecorder.record(ThreadRecorder.java:102)
  19. at com.android.build.gradle.internal.pipeline.TransformTask.transform(TransformTask.java:230)
  20. at sun.reflect.NativeMethodAccessorImpl.invoke0(Native Method)
  21. at sun.reflect.NativeMethodAccessorImpl.invoke(NativeMethodAccessorImpl.java:62)
  22. at sun.reflect.DelegatingMethodAccessorImpl.invoke(DelegatingMethodAccessorImpl.java:43)
  23. at java.lang.reflect.Method.invoke(Method.java:498)
  24. at org.gradle.internal.reflect.JavaMethod.invoke(JavaMethod.java:73)
  25. at org.gradle.api.internal.project.taskfactory.IncrementalTaskAction.doExecute(IncrementalTaskAction.java:47)
  26. at org.gradle.api.internal.project.taskfactory.StandardTaskAction.execute(StandardTaskAction.java:41)
  27. at org.gradle.api.internal.project.taskfactory.StandardTaskAction.execute(StandardTaskAction.java:28)
  28. at org.gradle.api.internal.tasks.execution.ExecuteActionsTaskExecuter$2.run(ExecuteActionsTaskExecuter.java:284)
  29. at org.gradle.internal.operations.DefaultBuildOperationExecutor$RunnableBuildOperationWorker.execute(DefaultBuildOperationExecutor.java:301)
  30. at org.gradle.internal.operations.DefaultBuildOperationExecutor$RunnableBuildOperationWorker.execute(DefaultBuildOperationExecutor.java:293)
  31. at org.gradle.internal.operations.DefaultBuildOperationExecutor.execute(DefaultBuildOperationExecutor.java:175)
  32. at org.gradle.internal.operations.DefaultBuildOperationExecutor.run(DefaultBuildOperationExecutor.java:91)
  33. at org.gradle.internal.operations.DelegatingBuildOperationExecutor.run(DelegatingBuildOperationExecutor.java:31)
  34. at org.gradle.api.internal.tasks.execution.ExecuteActionsTaskExecuter.executeAction(ExecuteActionsTaskExecuter.java:273)
  35. at org.gradle.api.internal.tasks.execution.ExecuteActionsTaskExecuter.executeActions(ExecuteActionsTaskExecuter.java:258)
  36. at org.gradle.api.internal.tasks.execution.ExecuteActionsTaskExecuter.access$200(ExecuteActionsTaskExecuter.java:67)
  37. at org.gradle.api.internal.tasks.execution.ExecuteActionsTaskExecuter$TaskExecution.execute(ExecuteActionsTaskExecuter.java:145)
  38. at org.gradle.internal.execution.impl.steps.ExecuteStep.execute(ExecuteStep.java:49)
  39. at org.gradle.internal.execution.impl.steps.CancelExecutionStep.execute(CancelExecutionStep.java:34)
  40. at org.gradle.internal.execution.impl.steps.TimeoutStep.executeWithoutTimeout(TimeoutStep.java:69)
  41. at org.gradle.internal.execution.impl.steps.TimeoutStep.execute(TimeoutStep.java:49)
  42. at org.gradle.internal.execution.impl.steps.CatchExceptionStep.execute(CatchExceptionStep.java:33)
  43. at org.gradle.internal.execution.impl.steps.CreateOutputsStep.execute(CreateOutputsStep.java:50)
  44. at org.gradle.internal.execution.impl.steps.SnapshotOutputStep.execute(SnapshotOutputStep.java:43)
  45. at org.gradle.internal.execution.impl.steps.SnapshotOutputStep.execute(SnapshotOutputStep.java:29)
  46. at org.gradle.internal.execution.impl.steps.CacheStep.executeWithoutCache(CacheStep.java:134)
  47. at org.gradle.internal.execution.impl.steps.CacheStep.lambda$execute$3(CacheStep.java:83)
  48. at java.util.Optional.orElseGet(Optional.java:267)
  49. at org.gradle.internal.execution.impl.steps.CacheStep.execute(CacheStep.java:82)
  50. at org.gradle.internal.execution.impl.steps.CacheStep.execute(CacheStep.java:36)
  51. at org.gradle.internal.execution.impl.steps.PrepareCachingStep.execute(PrepareCachingStep.java:33)
  52. at org.gradle.internal.execution.impl.steps.StoreSnapshotsStep.execute(StoreSnapshotsStep.java:38)
  53. at org.gradle.internal.execution.impl.steps.StoreSnapshotsStep.execute(StoreSnapshotsStep.java:23)
  54. at org.gradle.internal.execution.impl.steps.SkipUpToDateStep.executeBecause(SkipUpToDateStep.java:96)
  55. at org.gradle.internal.execution.impl.steps.SkipUpToDateStep.lambda$execute$0(SkipUpToDateStep.java:89)
  56. at java.util.Optional.map(Optional.java:215)
  57. at org.gradle.internal.execution.impl.steps.SkipUpToDateStep.execute(SkipUpToDateStep.java:52)
  58. at org.gradle.internal.execution.impl.steps.SkipUpToDateStep.execute(SkipUpToDateStep.java:36)
  59. at org.gradle.internal.execution.impl.DefaultWorkExecutor.execute(DefaultWorkExecutor.java:34)
  60. at org.gradle.api.internal.tasks.execution.ExecuteActionsTaskExecuter.execute(ExecuteActionsTaskExecuter.java:91)
  61. at org.gradle.api.internal.tasks.execution.ResolveTaskOutputCachingStateExecuter.execute(ResolveTaskOutputCachingStateExecuter.java:91)
  62. at org.gradle.api.internal.tasks.execution.ValidatingTaskExecuter.execute(ValidatingTaskExecuter.java:57)
  63. at org.gradle.api.internal.tasks.execution.SkipEmptySourceFilesTaskExecuter.execute(SkipEmptySourceFilesTaskExecuter.java:119)
  64. at org.gradle.api.internal.tasks.execution.ResolvePreviousStateExecuter.execute(ResolvePreviousStateExecuter.java:43)
  65. at org.gradle.api.internal.tasks.execution.CleanupStaleOutputsExecuter.execute(CleanupStaleOutputsExecuter.java:93)
  66. at org.gradle.api.internal.tasks.execution.FinalizePropertiesTaskExecuter.execute(FinalizePropertiesTaskExecuter.java:45)
  67. at org.gradle.api.internal.tasks.execution.ResolveTaskArtifactStateTaskExecuter.execute(ResolveTaskArtifactStateTaskExecuter.java:94)
  68. at org.gradle.api.internal.tasks.execution.SkipTaskWithNoActionsExecuter.execute(SkipTaskWithNoActionsExecuter.java:56)
  69. at org.gradle.api.internal.tasks.execution.SkipOnlyIfTaskExecuter.execute(SkipOnlyIfTaskExecuter.java:55)
  70. at org.gradle.api.internal.tasks.execution.CatchExceptionTaskExecuter.execute(CatchExceptionTaskExecuter.java:36)
  71. at org.gradle.api.internal.tasks.execution.EventFiringTaskExecuter$1.executeTask(EventFiringTaskExecuter.java:67)
  72. at org.gradle.api.internal.tasks.execution.EventFiringTaskExecuter$1.call(EventFiringTaskExecuter.java:52)
  73. at org.gradle.api.internal.tasks.execution.EventFiringTaskExecuter$1.call(EventFiringTaskExecuter.java:49)
  74. at org.gradle.internal.operations.DefaultBuildOperationExecutor$CallableBuildOperationWorker.execute(DefaultBuildOperationExecutor.java:315)
  75. at org.gradle.internal.operations.DefaultBuildOperationExecutor$CallableBuildOperationWorker.execute(DefaultBuildOperationExecutor.java:305)
  76. at org.gradle.internal.operations.DefaultBuildOperationExecutor.execute(DefaultBuildOperationExecutor.java:175)
  77. at org.gradle.internal.operations.DefaultBuildOperationExecutor.call(DefaultBuildOperationExecutor.java:101)
  78. at org.gradle.internal.operations.DelegatingBuildOperationExecutor.call(DelegatingBuildOperationExecutor.java:36)
  79. at org.gradle.api.internal.tasks.execution.EventFiringTaskExecuter.execute(EventFiringTaskExecuter.java:49)
  80. at org.gradle.execution.plan.LocalTaskNodeExecutor.execute(LocalTaskNodeExecutor.java:43)
  81. at org.gradle.execution.taskgraph.DefaultTaskExecutionGraph$InvokeNodeExecutorsAction.execute(DefaultTaskExecutionGraph.java:355)
  82. at org.gradle.execution.taskgraph.DefaultTaskExecutionGraph$InvokeNodeExecutorsAction.execute(DefaultTaskExecutionGraph.java:343)
  83. at org.gradle.execution.taskgraph.DefaultTaskExecutionGraph$BuildOperationAwareExecutionAction.execute(DefaultTaskExecutionGraph.java:336)
  84. at org.gradle.execution.taskgraph.DefaultTaskExecutionGraph$BuildOperationAwareExecutionAction.execute(DefaultTaskExecutionGraph.java:322)
  85. at org.gradle.execution.plan.DefaultPlanExecutor$ExecutorWorker$1.execute(DefaultPlanExecutor.java:134)
  86. at org.gradle.execution.plan.DefaultPlanExecutor$ExecutorWorker$1.execute(DefaultPlanExecutor.java:129)
  87. at org.gradle.execution.plan.DefaultPlanExecutor$ExecutorWorker.execute(DefaultPlanExecutor.java:202)
  88. at org.gradle.execution.plan.DefaultPlanExecutor$ExecutorWorker.executeNextNode(DefaultPlanExecutor.java:193)
  89. at org.gradle.execution.plan.DefaultPlanExecutor$ExecutorWorker.run(DefaultPlanExecutor.java:129)
  90. at org.gradle.internal.concurrent.ExecutorPolicy$CatchAndRecordFailures.onExecute(ExecutorPolicy.java:63)
  91. at org.gradle.internal.concurrent.ManagedExecutorImpl$1.run(ManagedExecutorImpl.java:46)
  92. at java.util.concurrent.ThreadPoolExecutor.runWorker(ThreadPoolExecutor.java:1149)
  93. at java.util.concurrent.ThreadPoolExecutor$Worker.run(ThreadPoolExecutor.java:624)
  94. at org.gradle.internal.concurrent.ThreadFactoryImpl$ManagedThreadRunnable.run(ThreadFactoryImpl.java:55)
  95. at java.lang.Thread.run(Thread.java:748)
  96. Caused by: com.android.builder.dexing.DexArchiveBuilderException: Failed to process /Users/shihab/.gradle/caches/transforms-2/files-2.1/a8d5840093588f0ddf1422752232c91b/jars/classes.jar
  97. at com.android.build.gradle.internal.transforms.DexArchiveBuilderTransform.launchProcessing(DexArchiveBuilderTransform.java:909)
  98. at com.android.build.gradle.internal.transforms.DexArchiveBuilderTransform.lambda$convertToDexArchive$6(DexArchiveBuilderTransform.java:834)
  99. at java.util.concurrent.ForkJoinTask$AdaptedCallable.exec(ForkJoinTask.java:1424)
  100. at java.util.concurrent.ForkJoinTask.doExec(ForkJoinTask.java:289)
  101. at java.util.concurrent.ForkJoinPool$WorkQueue.runTask(ForkJoinPool.java:1056)
  102. at java.util.concurrent.ForkJoinPool.runWorker(ForkJoinPool.java:1692)
  103. at java.util.concurrent.ForkJoinWorkerThread.run(ForkJoinWorkerThread.java:157)
  104. Caused by: com.android.builder.dexing.DexArchiveBuilderException: Error while dexing.
  105. at com.android.builder.dexing.D8DexArchiveBuilder.getExceptionToRethrow(D8DexArchiveBuilder.java:124)
  106. at com.android.builder.dexing.D8DexArchiveBuilder.convert(D8DexArchiveBuilder.java:101)
  107. at com.android.build.gradle.internal.transforms.DexArchiveBuilderTransform.launchProcessing(DexArchiveBuilderTransform.java:904)
  108. ... 6 more
  109. Caused by: com.android.tools.r8.CompilationFailedException: Compilation failed to complete
  110. at com.android.tools.r8.utils.ExceptionUtils.withCompilationHandler(ExceptionUtils.java:81)
  111. at com.android.tools.r8.utils.ExceptionUtils.withD8CompilationHandler(ExceptionUtils.java:45)
  112. at com.android.tools.r8.D8.run(D8.java:94)
  113. at com.android.builder.dexing.D8DexArchiveBuilder.convert(D8DexArchiveBuilder.java:99)
  114. ... 7 more
  115. Caused by: com.android.tools.r8.utils.AbortException: Error: Type com.google.firebase.iid.zzbb is referenced as an interface from `com.google.firebase.messaging.zzf`.
  116. at com.android.tools.r8.utils.Reporter.failIfPendingErrors(Reporter.java:101)
  117. at com.android.tools.r8.utils.Reporter.fatalError(Reporter.java:72)
  118. at com.android.tools.r8.utils.ExceptionUtils.withCompilationHandler(ExceptionUtils.java:66)
  119. ... 10 more
  120.  
  121.  
  122. FAILURE: Build failed with an exception.
  123.  
  124. * What went wrong:
  125. Execution failed for task ':launcher:transformClassesWithDexBuilderForRelease'.
  126. > com.android.build.api.transform.TransformException: com.android.builder.dexing.DexArchiveBuilderException: com.android.builder.dexing.DexArchiveBuilderException: Failed to process /Users/shihab/.gradle/caches/transforms-2/files-2.1/a8d5840093588f0ddf1422752232c91b/jars/classes.jar
  127.  
  128. * Try:
  129. Run with --stacktrace option to get the stack trace. Run with --info or --debug option to get more log output. Run with --scan to get full insights.
  130.  
  131. * Get more help at https://help.gradle.org
  132.  
  133. BUILD FAILED in 23s
  134. ]
  135. stdout[
  136. > Task :unityLibrary:preBuild UP-TO-DATE
  137. > Task :launcher:preBuild UP-TO-DATE
  138. > Task :unityLibrary:Firebase:preBuild UP-TO-DATE
  139. > Task :unityLibrary:UTNotificationsRes:preBuild UP-TO-DATE
  140. > Task :unityLibrary:preReleaseBuild UP-TO-DATE
  141. > Task :unityLibrary:Firebase:preReleaseBuild UP-TO-DATE
  142. > Task :unityLibrary:UTNotificationsRes:preReleaseBuild UP-TO-DATE
  143. > Task :unityLibrary:checkReleaseManifest UP-TO-DATE
  144. > Task :launcher:prepareLintJar UP-TO-DATE
  145. > Task :unityLibrary:UTNotificationsRes:checkReleaseManifest
  146. > Task :unityLibrary:Firebase:checkReleaseManifest
  147. > Task :unityLibrary:UTNotificationsRes:processReleaseManifest
  148. > Task :unityLibrary:Firebase:processReleaseManifest
  149. > Task :unityLibrary:processReleaseManifest
  150. > Task :unityLibrary:packageReleaseRenderscript NO-SOURCE
  151. > Task :unityLibrary:Firebase:compileReleaseAidl NO-SOURCE
  152. > Task :unityLibrary:UTNotificationsRes:compileReleaseAidl NO-SOURCE
  153. > Task :unityLibrary:Firebase:packageReleaseRenderscript NO-SOURCE
  154. > Task :unityLibrary:generateReleaseBuildConfig UP-TO-DATE
  155. > Task :unityLibrary:UTNotificationsRes:packageReleaseRenderscript NO-SOURCE
  156. > Task :unityLibrary:compileReleaseAidl NO-SOURCE
  157. > Task :unityLibrary:UTNotificationsRes:compileReleaseRenderscript NO-SOURCE
  158. > Task :unityLibrary:Firebase:compileReleaseRenderscript NO-SOURCE
  159. > Task :unityLibrary:compileReleaseRenderscript NO-SOURCE
  160. > Task :unityLibrary:generateReleaseResValues UP-TO-DATE
  161. > Task :unityLibrary:generateReleaseResources UP-TO-DATE
  162. > Task :unityLibrary:UTNotificationsRes:generateReleaseResValues
  163. > Task :unityLibrary:Firebase:generateReleaseResValues
  164. > Task :unityLibrary:Firebase:generateReleaseResources
  165. > Task :unityLibrary:UTNotificationsRes:generateReleaseResources
  166. > Task :unityLibrary:packageReleaseResources UP-TO-DATE
  167. > Task :unityLibrary:prepareLintJar UP-TO-DATE
  168. > Task :unityLibrary:generateReleaseSources UP-TO-DATE
  169. > Task :unityLibrary:prepareLintJarForPublish UP-TO-DATE
  170. > Task :unityLibrary:UTNotificationsRes:packageReleaseResources
  171. > Task :unityLibrary:Firebase:packageReleaseResources
  172. > Task :launcher:preReleaseBuild
  173. > Task :launcher:compileReleaseAidl NO-SOURCE
  174. > Task :launcher:compileReleaseRenderscript NO-SOURCE
  175. > Task :launcher:checkReleaseManifest UP-TO-DATE
  176. > Task :launcher:generateReleaseBuildConfig UP-TO-DATE
  177. > Task :launcher:generateReleaseSources UP-TO-DATE
  178. > Task :launcher:mainApkListPersistenceRelease UP-TO-DATE
  179. > Task :unityLibrary:mergeReleaseShaders UP-TO-DATE
  180. > Task :launcher:generateReleaseResValues UP-TO-DATE
  181. > Task :launcher:generateReleaseResources UP-TO-DATE
  182. > Task :unityLibrary:compileReleaseShaders UP-TO-DATE
  183. > Task :unityLibrary:generateReleaseAssets UP-TO-DATE
  184. > Task :unityLibrary:UTNotificationsRes:generateReleaseRFile
  185. > Task :unityLibrary:Firebase:generateReleaseRFile
  186. > Task :unityLibrary:UTNotificationsRes:generateReleaseBuildConfig
  187. > Task :unityLibrary:Firebase:generateReleaseBuildConfig
  188. > Task :unityLibrary:UTNotificationsRes:prepareLintJar UP-TO-DATE
  189. > Task :unityLibrary:UTNotificationsRes:generateReleaseSources
  190. > Task :unityLibrary:Firebase:prepareLintJar UP-TO-DATE
  191. > Task :unityLibrary:Firebase:generateReleaseSources
  192. > Task :unityLibrary:UTNotificationsRes:javaPreCompileRelease
  193. > Task :unityLibrary:Firebase:javaPreCompileRelease
  194. > Task :unityLibrary:Firebase:compileReleaseJavaWithJavac
  195. > Task :unityLibrary:UTNotificationsRes:compileReleaseJavaWithJavac
  196. > Task :unityLibrary:Firebase:bundleLibCompileRelease
  197. > Task :unityLibrary:UTNotificationsRes:bundleLibCompileRelease
  198. > Task :unityLibrary:Firebase:prepareLintJarForPublish UP-TO-DATE
  199. > Task :unityLibrary:UTNotificationsRes:prepareLintJarForPublish UP-TO-DATE
  200. > Task :unityLibrary:UTNotificationsRes:mergeReleaseShaders
  201. > Task :unityLibrary:Firebase:mergeReleaseShaders
  202. > Task :unityLibrary:UTNotificationsRes:compileReleaseShaders
  203. > Task :unityLibrary:UTNotificationsRes:generateReleaseAssets
  204. > Task :unityLibrary:Firebase:compileReleaseShaders
  205. > Task :unityLibrary:Firebase:generateReleaseAssets
  206. > Task :unityLibrary:UTNotificationsRes:packageReleaseAssets
  207. > Task :unityLibrary:Firebase:packageReleaseAssets
  208. > Task :unityLibrary:Firebase:bundleLibRuntimeRelease
  209. > Task :unityLibrary:UTNotificationsRes:bundleLibRuntimeRelease
  210. > Task :unityLibrary:Firebase:processReleaseJavaRes NO-SOURCE
  211. > Task :unityLibrary:UTNotificationsRes:processReleaseJavaRes NO-SOURCE
  212. > Task :unityLibrary:Firebase:bundleLibResRelease
  213. > Task :unityLibrary:Firebase:mergeReleaseJniLibFolders
  214. > Task :unityLibrary:Firebase:transformNativeLibsWithMergeJniLibsForRelease
  215. > Task :unityLibrary:Firebase:transformNativeLibsWithStripDebugSymbolForRelease
  216. > Task :unityLibrary:UTNotificationsRes:bundleLibResRelease
  217. > Task :unityLibrary:Firebase:transformNativeLibsWithIntermediateJniLibsForRelease
  218. > Task :unityLibrary:UTNotificationsRes:mergeReleaseJniLibFolders
  219. > Task :unityLibrary:UTNotificationsRes:transformNativeLibsWithMergeJniLibsForRelease
  220. > Task :unityLibrary:UTNotificationsRes:transformNativeLibsWithStripDebugSymbolForRelease
  221. > Task :unityLibrary:UTNotificationsRes:transformNativeLibsWithIntermediateJniLibsForRelease
  222. > Task :unityLibrary:packageReleaseAssets
  223. > Task :unityLibrary:generateReleaseRFile UP-TO-DATE
  224. > Task :unityLibrary:javaPreCompileRelease UP-TO-DATE
  225. > Task :unityLibrary:compileReleaseJavaWithJavac UP-TO-DATE
  226. > Task :unityLibrary:bundleLibCompileRelease UP-TO-DATE
  227. > Task :unityLibrary:bundleLibRuntimeRelease UP-TO-DATE
  228. > Task :unityLibrary:processReleaseJavaRes NO-SOURCE
  229. > Task :unityLibrary:bundleLibResRelease UP-TO-DATE
  230. > Task :launcher:mergeReleaseResources
  231. > Task :launcher:javaPreCompileRelease UP-TO-DATE
  232. > Task :launcher:createReleaseCompatibleScreenManifests UP-TO-DATE
  233. > Task :unityLibrary:mergeReleaseJniLibFolders UP-TO-DATE
  234. > Task :unityLibrary:transformNativeLibsWithMergeJniLibsForRelease UP-TO-DATE
  235. > Task :unityLibrary:transformNativeLibsWithStripDebugSymbolForRelease UP-TO-DATE
  236. > Task :unityLibrary:transformNativeLibsWithIntermediateJniLibsForRelease UP-TO-DATE
  237. > Task :launcher:processReleaseManifest
  238. > Task :launcher:processReleaseResources
  239. > Task :launcher:compileReleaseJavaWithJavac
  240. > Task :launcher:compileReleaseSources
  241. > Task :launcher:lintVitalRelease
  242. > Task :launcher:mergeReleaseShaders UP-TO-DATE
  243. > Task :launcher:compileReleaseShaders UP-TO-DATE
  244. > Task :launcher:generateReleaseAssets UP-TO-DATE
  245. > Task :launcher:mergeReleaseAssets
  246. > Task :launcher:validateSigningRelease UP-TO-DATE
  247. > Task :launcher:signingConfigWriterRelease UP-TO-DATE
  248. > Task :launcher:checkReleaseDuplicateClasses UP-TO-DATE
  249.  
  250. > Task :launcher:transformClassesWithDexBuilderForRelease FAILED
  251.  
  252. Deprecated Gradle features were used in this build, making it incompatible with Gradle 6.0.
  253. Use '--warning-mode all' to show the individual deprecation warnings.
  254. See https://docs.gradle.org/5.1.1/userguide/command_line_interface.html#sec:command_line_warnings
  255. 80 actionable tasks: 46 executed, 34 up-to-date
  256. ]
  257. exit code: 1
  258. at UnityEditor.Android.Command.WaitForProgramToRun (UnityEditor.Utils.Program p, UnityEditor.Android.Command+WaitingForProcessToExit waitingForProcessToExit, System.String errorMsg) [0x00033] in <d7067458867d436a825598eb5e44cdf0>:0
  259. at UnityEditor.Android.Command.Run (System.Diagnostics.ProcessStartInfo psi, UnityEditor.Android.Command+WaitingForProcessToExit waitingForProcessToExit, System.String errorMsg) [0x00017] in <d7067458867d436a825598eb5e44cdf0>:0
  260. at UnityEditor.Android.Command.Run (System.String command, System.String args, System.String workingdir, UnityEditor.Android.Command+WaitingForProcessToExit waitingForProcessToExit, System.String errorMsg) [0x0000a] in <d7067458867d436a825598eb5e44cdf0>:0
  261. at UnityEditor.Android.AndroidJavaTools.RunJava (System.String args, System.String workingdir, System.Action`1[T] progress, System.String error) [0x0001f] in <d7067458867d436a825598eb5e44cdf0>:0
  262. at UnityEditor.Android.GradleWrapper.Run (UnityEditor.Android.AndroidJavaTools javaTools, System.String workingdir, System.String task, System.Action`1[T] progress) [0x0002a] in <d7067458867d436a825598eb5e44cdf0>:0
  263. Rethrow as GradleInvokationException: Gradle build failed
  264. at UnityEditor.Android.GradleWrapper.Run (UnityEditor.Android.AndroidJavaTools javaTools, System.String workingdir, System.String task, System.Action`1[T] progress) [0x0004b] in <d7067458867d436a825598eb5e44cdf0>:0
  265. at UnityEditor.Android.PostProcessor.Tasks.BuildGradleProject.Execute (UnityEditor.Android.PostProcessor.PostProcessorContext context) [0x000d1] in <d7067458867d436a825598eb5e44cdf0>:0
  266. at UnityEditor.Android.PostProcessor.PostProcessRunner.RunAllTasks (UnityEditor.Android.PostProcessor.PostProcessorContext context) [0x00078] in <d7067458867d436a825598eb5e44cdf0>:0
  267. Rethrow as BuildFailedException: Exception of type 'UnityEditor.Build.BuildFailedException' was thrown.
  268. at UnityEditor.Android.PostProcessor.CancelPostProcess.AbortBuild (System.String title, System.String message, System.Exception ex) [0x00020] in <d7067458867d436a825598eb5e44cdf0>:0
  269. at UnityEditor.Android.PostProcessor.PostProcessRunner.RunAllTasks (UnityEditor.Android.PostProcessor.PostProcessorContext context) [0x0011a] in <d7067458867d436a825598eb5e44cdf0>:0
  270. at UnityEditor.Android.PostProcessAndroidPlayer.PostProcess (UnityEditor.BuildTarget target, System.String stagingAreaData, System.String stagingArea, System.String playerPackage, System.String installPath, System.String companyName, System.String productName, UnityEditor.BuildOptions options, UnityEditor.RuntimeClassRegistry usedClassRegistry, UnityEditor.Build.Reporting.BuildReport report) [0x00349] in <d7067458867d436a825598eb5e44cdf0>:0
  271. at UnityEditor.Android.AndroidBuildPostprocessor.PostProcess (UnityEditor.Modules.BuildPostProcessArgs args, UnityEditor.BuildProperties& outProperties) [0x00001] in <d7067458867d436a825598eb5e44cdf0>:0
  272. at UnityEditor.PostprocessBuildPlayer.Postprocess (UnityEditor.BuildTargetGroup targetGroup, UnityEditor.BuildTarget target, System.String installPath, System.String companyName, System.String productName, System.Int32 width, System.Int32 height, UnityEditor.BuildOptions options, UnityEditor.RuntimeClassRegistry usedClassRegistry, UnityEditor.Build.Reporting.BuildReport report) [0x000dc] in /Users/builduser/buildslave/unity/build/Editor/Mono/BuildPipeline/PostprocessBuildPlayer.cs:340
  273. UnityEditor.BuildPipeline:BuildPlayerInternalNoCheck(String[], String, String, BuildTargetGroup, BuildTarget, BuildOptions, Boolean)
  274. UnityEditor.DefaultBuildMethods:BuildPlayer(BuildPlayerOptions) (at /Users/builduser/buildslave/unity/build/Editor/Mono/BuildPlayerWindowBuildMethods.cs:170)
  275. UnityEditor.BuildPlayerWindow:CallBuildMethods(Boolean, BuildOptions) (at /Users/builduser/buildslave/unity/build/Editor/Mono/BuildPlayerWindowBuildMethods.cs:95)
  276. UnityEditor.BuildPlayerWindow:GUIBuildButtons(IBuildWindowExtension, Boolean, Boolean, Boolean, BuildPlatform) (at /Users/builduser/buildslave/unity/build/Editor/Mono/BuildPlayerWindow.cs:961)
  277. UnityEditor.BuildPlayerWindow:ShowBuildTargetSettings() (at /Users/builduser/buildslave/unity/build/Editor/Mono/BuildPlayerWindow.cs:845)
  278. UnityEditor.BuildPlayerWindow:OnGUI() (at /Users/builduser/buildslave/unity/build/Editor/Mono/BuildPlayerWindow.cs:386)
  279. System.Reflection.MonoMethod:InternalInvoke(Object, Object[], Exception&)
  280. System.Reflection.MonoMethod:Invoke(Object, BindingFlags, Binder, Object[], CultureInfo)
  281. System.Reflection.MethodBase:Invoke(Object, Object[])
  282. UnityEditor.HostView:Invoke(String, Object) (at /Users/builduser/buildslave/unity/build/Editor/Mono/HostView.cs:381)
  283. UnityEditor.HostView:Invoke(String) (at /Users/builduser/buildslave/unity/build/Editor/Mono/HostView.cs:375)
  284. UnityEditor.HostView:OldOnGUI() (at /Users/builduser/buildslave/unity/build/Editor/Mono/HostView.cs:151)
  285. UnityEngine.UIElements.IMGUIContainer:DoOnGUI(Event, Matrix4x4, Rect, Boolean, Rect, Action, Boolean) (at /Users/builduser/buildslave/unity/build/Modules/UIElements/IMGUIContainer.cs:276)
  286. UnityEngine.UIElements.IMGUIContainer:HandleIMGUIEvent(Event, Matrix4x4, Rect, Action, Boolean) (at /Users/builduser/buildslave/unity/build/Modules/UIElements/IMGUIContainer.cs:508)
  287. UnityEngine.UIElements.IMGUIContainer:HandleIMGUIEvent(Event, Action, Boolean) (at /Users/builduser/buildslave/unity/build/Modules/UIElements/IMGUIContainer.cs:491)
  288. UnityEngine.UIElements.IMGUIContainer:HandleIMGUIEvent(Event, Boolean) (at /Users/builduser/buildslave/unity/build/Modules/UIElements/IMGUIContainer.cs:484)
  289. UnityEngine.UIElements.IMGUIContainer:SendEventToIMGUI(EventBase, Boolean) (at /Users/builduser/buildslave/unity/build/Modules/UIElements/IMGUIContainer.cs:477)
  290. UnityEngine.UIElements.IMGUIContainer:HandleEvent(EventBase) (at /Users/builduser/buildslave/unity/build/Modules/UIElements/IMGUIContainer.cs:449)
  291. UnityEngine.UIElements.CallbackEventHandler:HandleEventAtTargetPhase(EventBase) (at /Users/builduser/buildslave/unity/build/Modules/UIElements/Events/EventHandler.cs:77)
  292. UnityEngine.UIElements.MouseCaptureDispatchingStrategy:DispatchEvent(EventBase, IPanel) (at /Users/builduser/buildslave/unity/build/Modules/UIElements/Events/MouseCaptureDispatchingStrategy.cs:92)
  293. UnityEngine.UIElements.EventDispatcher:ApplyDispatchingStrategies(EventBase, IPanel, Boolean) (at /Users/builduser/buildslave/unity/build/Modules/UIElements/EventDispatcher.cs:310)
  294. UnityEngine.UIElements.EventDispatcher:ProcessEvent(EventBase, IPanel) (at /Users/builduser/buildslave/unity/build/Modules/UIElements/EventDispatcher.cs:275)
  295. UnityEngine.UIElements.EventDispatcher:ProcessEventQueue() (at /Users/builduser/buildslave/unity/build/Modules/UIElements/EventDispatcher.cs:238)
  296. UnityEngine.UIElements.EventDispatcher:OpenGate() (at /Users/builduser/buildslave/unity/build/Modules/UIElements/EventDispatcher.cs:203)
  297. UnityEngine.UIElements.EventDispatcherGate:Dispose() (at /Users/builduser/buildslave/unity/build/Modules/UIElements/EventDispatcher.cs:44)
  298. UnityEngine.UIElements.EventDispatcher:ProcessEvent(EventBase, IPanel) (at /Users/builduser/buildslave/unity/build/Modules/UIElements/EventDispatcher.cs:301)
  299. UnityEngine.UIElements.EventDispatcher:Dispatch(EventBase, IPanel, DispatchMode) (at /Users/builduser/buildslave/unity/build/Modules/UIElements/EventDispatcher.cs:159)
  300. UnityEngine.UIElements.BaseVisualElementPanel:SendEvent(EventBase, DispatchMode) (at /Users/builduser/buildslave/unity/build/Modules/UIElements/Panel.cs:257)
  301. UnityEngine.UIElements.UIElementsUtility:DoDispatch(BaseVisualElementPanel) (at /Users/builduser/buildslave/unity/build/Modules/UIElements/UIElementsUtility.bindings.cs:404)
  302. UnityEngine.UIElements.UIElementsUtility:ProcessEvent(Int32, IntPtr) (at /Users/builduser/buildslave/unity/build/Modules/UIElements/UIElementsUtility.bindings.cs:194)
  303. UnityEngine.GUIUtility:ProcessEvent(Int32, IntPtr) (at /Users/builduser/buildslave/unity/build/Modules/IMGUI/GUIUtility.cs:197)
Advertisement
RAW Paste Data Copied
Advertisement