SHARE
TWEET

Untitled

a guest Jan 26th, 2016 61 Never
Not a member of Pastebin yet? Sign Up, it unlocks many cool features!
  1. [build UPK] 1f24ab1d39f4a51faf22244c94a6203f-xmlsec1-1.2.14.tar.gz
  2. [build BIN] neon
  3. [build PKG] rasqal
  4. [build DEP] LNK:Executable/ulfex
  5. [build LNK] Executable/ulfex
  6. [build DEP] LNK:Executable/gendict
  7. [build LNK] Executable/gendict
  8. [build DEP] LNK:Executable/genconv_dict
  9. [build LNK] Executable/genconv_dict
  10. [build DEP] LNK:Executable/cfgex
  11. [build LNK] Executable/cfgex
  12. [build DEP] LNK:Executable/uiex
  13. [build LNK] Executable/uiex
  14. [build DEP] LNK:Executable/localize
  15. [build LNK] Executable/localize
  16. [build DEP] LNK:Executable/pocheck
  17. [build LNK] Executable/pocheck
  18. [build DEP] LNK:Executable/propex
  19. [build LNK] Executable/propex
  20. [build DEP] LNK:Executable/treex
  21. [build LNK] Executable/treex
  22. [build LOC] postprocess
  23. [build DEP] LNK:Executable/cppunittester
  24. [build LNK] Executable/cppunittester
  25. [build DEP] LNK:Executable/osl_process_child
  26. [build LNK] Executable/osl_process_child
  27. [build INS] setup_osl
  28. /home/cono/src/git/libreoffice/workdir/CxxObject/sal/cppunittester/cppunittester.o: In function `(anonymous namespace)::ProtectedFixtureFunctor::run() const':
  29. cppunittester.cxx:(.text+0x7b6): undefined reference to `CppUnit::PlugInParameters::PlugInParameters(std::__cxx11::basic_string<char, std::char_traits<char>, std::allocator<char> > const&)'
  30. cppunittester.cxx:(.text+0x7c8): undefined reference to `CppUnit::PlugInManager::load(std::__cxx11::basic_string<char, std::char_traits<char>, std::allocator<char> > const&, CppUnit::PlugInParameters const&)'
  31. cppunittester.cxx:(.text+0x9f9): undefined reference to `CppUnit::TestFactoryRegistry::getRegistry(std::__cxx11::basic_string<char, std::char_traits<char>, std::allocator<char> > const&)'
  32. cppunittester.cxx:(.text+0xa54): undefined reference to `CppUnit::TestFactoryRegistry::getRegistry(std::__cxx11::basic_string<char, std::char_traits<char>, std::allocator<char> > const&)'
  33. cppunittester.cxx:(.text+0xa9c): undefined reference to `CppUnit::TestRunner::run(CppUnit::TestResult&, std::__cxx11::basic_string<char, std::char_traits<char>, std::allocator<char> > const&)'
  34. cppunittester.cxx:(.text+0xace): undefined reference to `CppUnit::CompilerOutputter::CompilerOutputter(CppUnit::TestResultCollector*, std::ostream&, std::__cxx11::basic_string<char, std::char_traits<char>, std::allocator<char> > const&)'
  35. /home/cono/src/git/libreoffice/workdir/CxxObject/sal/cppunittester/cppunittester.o: In function `(anonymous namespace)::LogFailuresAsTheyHappen::addFailure(CppUnit::TestFailure const&)':
  36. cppunittester.cxx:(.text+0x164a): undefined reference to `CppUnit::SourceLine::fileName[abi:cxx11]() const'
  37. cppunittester.cxx:(.text+0x16f2): undefined reference to `CppUnit::Message::shortDescription[abi:cxx11]() const'
  38. cppunittester.cxx:(.text+0x173c): undefined reference to `CppUnit::Message::details[abi:cxx11]() const'
  39. collect2: error: ld returned 1 exit status
  40. /home/cono/src/git/libreoffice/solenv/gbuild/LinkTarget.mk:468: recept voor doel '/home/cono/src/git/libreoffice/workdir/LinkTarget/Executable/cppunittester' is mislukt
  41. make[1]: *** [/home/cono/src/git/libreoffice/workdir/LinkTarget/Executable/cppunittester] Fout 1
  42. make[1]: *** Wachten op onvoltooide taken...
  43. Makefile:244: recept voor doel 'build' is mislukt
  44. make: *** [build] Fout 2
RAW Paste Data
We use cookies for various purposes including analytics. By continuing to use Pastebin, you agree to our use of cookies as described in the Cookies Policy. OK, I Understand
 
Top