SrinjoySS01

Untitled

Oct 28th, 2020
49
Never
Not a member of Pastebin yet? Sign Up, it unlocks many cool features!
  1. LWJGL 3.2.3 build 13!
  2. ERROR: 'defaultShader.glsl'
  3. VertexShader compilation failed.
  4. 0(2) : error C0000: syntax error, unexpected '(', expecting "::" at token "("
  5. 0(5) : error C5060: out can't be used with non-varying fColour
  6. 0(8) : error C1503: undefined variable "aColour"
  7. 0(9) : error C1503: undefined variable "aPos"
  8.  
  9. ERROR: 'defaultShader.glsl'
  10. FragmentShader compilation failed.
  11. 0(3) : error C5060: out can't be used with non-varying colour
  12.  
  13. ERROR: 'defaultShader.glsl'
  14. Linking of shaders failed.
RAW Paste Data