Advertisement
Guest User

Untitled

a guest
Nov 29th, 2020
19
0
Never
Not a member of Pastebin yet? Sign Up, it unlocks many cool features!
text 0.70 KB | None | 0 0
  1. /usr/bin/ld: rc-logger.o:(.data+0x14): multiple definition of `rc_logger_pid'; rc.o:(.bss+0x24): first defined here
  2. /usr/bin/ld: rc-logger.o:(.data+0x10): multiple definition of `rc_logger_tty'; rc.o:(.bss+0x20): first defined here
  3. collect2: error: ld returned 1 exit status
  4. make[2]: *** [Makefile:135: openrc] Error 1
  5. make[2]: Leaving directory '/home/pav311/.cache/yay/openrc/src/openrc-0.38.1/src/rc'
  6. make[1]: *** [../mk/subdir.mk:26: all] Error 2
  7. make[1]: Leaving directory '/home/pav311/.cache/yay/openrc/src/openrc-0.38.1/src'
  8. make: *** [/home/pav311/.cache/yay/openrc/src/openrc-0.38.1//mk/subdir.mk:26: all] Error 2
  9. ==> ERROR: A failure occurred in build().
  10. Aborting...
  11. error making: openrc
  12.  
Advertisement
Add Comment
Please, Sign In to add comment
Advertisement