Advertisement
Guest User

Untitled

a guest
Aug 31st, 2012
84
Never
Not a member of Pastebin yet? Sign Up, it unlocks many cool features!
text 1.22 KB | None
  1. [ 74%] Building C object /home/Nushio/Downloads/lpc/trinlibr-code/GGE/CMakeFiles/GGE.dir/External/theora/src/analyze.c.o
  2. /home/Nushio/Downloads/lpc/trinlibr-code/GGE/External/theora/src/analyze.c: In function ‘oc_enc_analyze_inter’:
  3. /home/Nushio/Downloads/lpc/trinlibr-code/GGE/External/theora/src/analyze.c:2230:1: error: insn does not satisfy its constraints:
  4. (insn 5949 5948 5950 64 (set (reg/f:SI 6403)
  5. (plus:SI (reg/f:SI 20 frame)
  6. (const_int -3648 [0xfffffffffffff1c0]))) 193 {*leasi_2}
  7. (expr_list:REG_EQUIV (plus:SI (reg/f:SI 20 frame)
  8. (const_int -3648 [0xfffffffffffff1c0]))
  9. (nil)))
  10. /home/Nushio/Downloads/lpc/trinlibr-code/GGE/External/theora/src/analyze.c:2230:1: internal compiler error: in reload_cse_simplify_operands, at postreload.c:403
  11. Please submit a full bug report,
  12. with preprocessed source if appropriate.
  13. See <http://bugzilla.redhat.com/bugzilla> for instructions.
  14. Preprocessed source stored into /tmp/ccaXultS.out file, please attach this to your bugreport.
  15. make[2]: *** [/home/Nushio/Downloads/lpc/trinlibr-code/GGE/CMakeFiles/GGE.dir/External/theora/src/analyze.c.o] Error 1
  16. make[1]: *** [/home/Nushio/Downloads/lpc/trinlibr-code/GGE/CMakeFiles/GGE.dir/all] Error 2
Advertisement
RAW Paste Data Copied
Advertisement