lamiastella

'ImfOutputFile.h': No such file or directory

Dec 16th, 2016
419
0
Never
Not a member of Pastebin yet? Sign Up, it unlocks many cool features!
text 7.38 KB | None | 0 0
  1. 1>------ Build started: Project: dxgi, Configuration: Debug Win32 ------
  2. 2>------ Build started: Project: dxbc, Configuration: Debug Win32 ------
  3. 3>------ Build started: Project: spirv, Configuration: Debug Win32 ------
  4. 4>------ Build started: Project: pdblocate, Configuration: Debug Win32 ------
  5. 5>------ Build started: Project: breakpad_common, Configuration: Debug Win32 ------
  6. 6>------ Build started: Project: crash_generation_client, Configuration: Debug Win32 ------
  7. 7>------ Build started: Project: crash_generation_server, Configuration: Debug Win32 ------
  8. 8>------ Build started: Project: exception_handler, Configuration: Debug Win32 ------
  9. 1> dxgi_hooks.cpp
  10. 1> dxgi_wrapped.cpp
  11. 2> dxbc_debug.cpp
  12. 2> dxbc_disassemble.cpp
  13. 2> dxbc_inspect.cpp
  14. 5> http_upload.cc
  15. 5> guid_string.cc
  16. 5> string_utils.cc
  17. 8> exception_handler.cc
  18. 6> crash_generation_client.cc
  19. 7> client_info.cc
  20. 7> minidump_generator.cc
  21. 7> crash_generation_server.cc
  22. 3> CodeGen.cpp
  23. 3> Link.cpp
  24. 3> Constant.cpp
  25. 3> glslang_tab.cpp
  26. 3> InfoSink.cpp
  27. 3> Initialize.cpp
  28. 3> Intermediate.cpp
  29. 3> intermOut.cpp
  30. 4> pdblocate.cpp
  31. 6> crash_generation_client.vcxproj -> C:\Users\mona\playing-for-data\renderdoc\renderdoc\3rdparty\breakpad\Win32\Debug\\crash_generation_client.lib
  32. 5> common.vcxproj -> C:\Users\mona\playing-for-data\renderdoc\renderdoc\3rdparty\breakpad\Win32\Debug\\breakpad_common.lib
  33. 8> exception_handler.vcxproj -> C:\Users\mona\playing-for-data\renderdoc\renderdoc\3rdparty\breakpad\Win32\Debug\\exception_handler.lib
  34. 7> crash_generation_server.vcxproj -> C:\Users\mona\playing-for-data\renderdoc\renderdoc\3rdparty\breakpad\Win32\Debug\\crash_generation_server.lib
  35. 4> Generating code
  36. 4> All 222 functions were compiled because no usable IPDB/IOBJ from previous compilation was found.
  37. 4> Finished generating code
  38. 4> pdblocate.vcxproj -> C:\Users\mona\playing-for-data\renderdoc\x64\Release\pdblocate\pdblocate.exe
  39. 4> pdblocate.vcxproj -> C:\Users\mona\playing-for-data\renderdoc\x64\Release\pdblocate\pdblocate.pdb (Full PDB)
  40. 3> IntermTraverse.cpp
  41. 3> limits.cpp
  42. 3> linkValidate.cpp
  43. 3> parseConst.cpp
  44. 3> ParseHelper.cpp
  45. 3> PoolAlloc.cpp
  46. 3> Pp.cpp
  47. 3> PpAtom.cpp
  48. 3> PpContext.cpp
  49. 3> PpMemory.cpp
  50. 3> PpScanner.cpp
  51. 3> PpSymbols.cpp
  52. 3> PpTokens.cpp
  53. 3> reflection.cpp
  54. 2> renderdoc_dxbc.vcxproj -> C:\Users\mona\playing-for-data\renderdoc\Win32\Debug\dxbc.lib
  55. 3> RemoveTree.cpp
  56. 3> Scan.cpp
  57. 3> ShaderLang.cpp
  58. 3>..\..\..\3rdparty\glslang\glslang\MachineIndependent\preprocessor\PpTokens.cpp(218): error C2220: warning treated as error - no 'object' file generated
  59. 3>..\..\..\3rdparty\glslang\glslang\MachineIndependent\preprocessor\PpTokens.cpp(218): warning C4996: 'strcpy': This function or variable may be unsafe. Consider using strcpy_s instead. To disable deprecation, use _CRT_SECURE_NO_WARNINGS. See online help for details.
  60. 3> C:\Program Files (x86)\Windows Kits\10\Include\10.0.14393.0\ucrt\string.h(129): note: see declaration of 'strcpy'
  61. 3>..\..\..\3rdparty\glslang\glslang\MachineIndependent\preprocessor\PpTokens.cpp(223): warning C4996: 'strcpy': This function or variable may be unsafe. Consider using strcpy_s instead. To disable deprecation, use _CRT_SECURE_NO_WARNINGS. See online help for details.
  62. 3> C:\Program Files (x86)\Windows Kits\10\Include\10.0.14393.0\ucrt\string.h(129): note: see declaration of 'strcpy'
  63. 3> SymbolTable.cpp
  64. 3> Versions.cpp
  65. 3> ossource.cpp
  66. 3> InitializeDll.cpp
  67. 3> GlslangToSpv.cpp
  68. 3> SpvBuilder.cpp
  69. 3> spirv_common.cpp
  70. 1> renderdoc_dxgi.vcxproj -> C:\Users\mona\playing-for-data\renderdoc\Win32\Debug\driver_dxgi.lib
  71. 9>------ Build started: Project: d3d11, Configuration: Debug Win32 ------
  72. 3> spirv_compile.cpp
  73. 9> d3d11_analyse.cpp
  74. 9> d3d11_common.cpp
  75. 9> d3d11_context.cpp
  76. 9> d3d11_context1_wrap.cpp
  77. 9> d3d11_context2_wrap.cpp
  78. 9> d3d11_context_wrap.cpp
  79. 9> d3d11_counters.cpp
  80. 9> d3d11_debug.cpp
  81. 3> spirv_disassemble.cpp
  82. 9> d3d11_device.cpp
  83. 10>------ Build started: Project: gl, Configuration: Debug Win32 ------
  84. 10> gl_common.cpp
  85. 10> gl_counters.cpp
  86. 10> gl_debug.cpp
  87. 10> gl_driver.cpp
  88. 10> gl_hooks_win32.cpp
  89. 10> gl_manager.cpp
  90. 10> gl_renderstate.cpp
  91. 10> gl_replay.cpp
  92. 9> d3d11_device1_wrap.cpp
  93. 9> d3d11_device_wrap.cpp
  94. 9> d3d11_hooks.cpp
  95. 9> d3d11_manager.cpp
  96. 9> d3d11_renderstate.cpp
  97. 9> d3d11_replay.cpp
  98. 9> d3d11_resources.cpp
  99. 10> gl_replay_win32.cpp
  100. 10> gl_resources.cpp
  101. 10> gl_shader_refl.cpp
  102. 10> gl_buffer_funcs.cpp
  103. 10> gl_debug_funcs.cpp
  104. 10> gl_draw_funcs.cpp
  105. 10> gl_emulated.cpp
  106. 10> gl_framebuffer_funcs.cpp
  107. 10> gl_get_funcs.cpp
  108. 10> gl_query_funcs.cpp
  109. 9> d3d9_hooks.cpp
  110. 10> gl_sampler_funcs.cpp
  111. 10> gl_shader_funcs.cpp
  112. 10> gl_state_funcs.cpp
  113. 10> gl_texture_funcs.cpp
  114. 10> gl_uniform_funcs.cpp
  115. 9> renderdoc_d3d11.vcxproj -> C:\Users\mona\playing-for-data\renderdoc\Win32\Debug\driver_d3d11.lib
  116. 10> renderdoc_gl.vcxproj -> C:\Users\mona\playing-for-data\renderdoc\Win32\Debug\driver_gl.lib
  117. 11>------ Build started: Project: renderdoc, Configuration: Debug Win32 ------
  118. 11> jpgd.cpp
  119. 11> jpge.cpp
  120. 11> tinyexr.cpp
  121. 11> common.cpp
  122. 11> dds_readwrite.cpp
  123. 11> core.cpp
  124. 11> image_viewer.cpp
  125. 11> remote_access.cpp
  126. 11> remote_replay.cpp
  127. 11> replay_proxy.cpp
  128. 11> resource_manager.cpp
  129. 11> hooks.cpp
  130. 11>core\core.cpp(854): error C2220: warning treated as error - no 'object' file generated
  131. 11>core\core.cpp(854): warning C4456: declaration of 'it' hides previous local declaration
  132. 11> core\core.cpp(854): note: to simplify migration, consider the temporary use of /Wv:18 flag with the version of the compiler with which you used to build without warnings
  133. 11> core\core.cpp(839): note: see declaration of 'it'
  134. 11> camera.cpp
  135. 11> matrix.cpp
  136. 11> os_specific.cpp
  137. 11> sys_win32_hooks.cpp
  138. 11> win32_callstack.cpp
  139. 11> win32_hook.cpp
  140. 11> win32_libentry.cpp
  141. 11> win32_network.cpp
  142. 11>C:\Program Files (x86)\Windows Kits\8.1\Include\um\dbghelp.h(1545): error C2220: warning treated as error - no 'object' file generated (compiling source file os\win32\win32_callstack.cpp)
  143. 11>C:\Program Files (x86)\Windows Kits\8.1\Include\um\dbghelp.h(1545): warning C4091: 'typedef ': ignored on left of '' when no variable is declared (compiling source file os\win32\win32_callstack.cpp)
  144. 11>C:\Program Files (x86)\Windows Kits\8.1\Include\um\dbghelp.h(3191): warning C4091: 'typedef ': ignored on left of '' when no variable is declared (compiling source file os\win32\win32_callstack.cpp)
  145. 11> win32_process.cpp
  146. 11> win32_shellext.cpp
  147. 11> win32_stringio.cpp
  148. 11> win32_threading.cpp
  149. 11> app_api.cpp
  150. 11> capture_options.cpp
  151. 11> entry_points.cpp
  152. 11> MurmurHash3.cpp
  153. 11> replay_output.cpp
  154. 11> replay_renderer.cpp
  155. 11> type_helpers.cpp
  156. 11> grisu2.cpp
  157. 11> serialiser.cpp
  158. 11> string_utils.cpp
  159. 11> utf8printf.cpp
  160. 11>replay\replay_renderer.cpp(64): fatal error C1083: Cannot open include file: 'ImfOutputFile.h': No such file or directory
  161. 11>serialise\serialiser.cpp(493): error C2220: warning treated as error - no 'object' file generated
  162. 11>serialise\serialiser.cpp(493): warning C4456: declaration of 'memoryBufEnd' hides previous local declaration
  163. 11> serialise\serialiser.cpp(493): note: to simplify migration, consider the temporary use of /Wv:18 flag with the version of the compiler with which you used to build without warnings
  164. 11> serialise\serialiser.cpp(446): note: see declaration of 'memoryBufEnd'
  165. ========== Build: 9 succeeded, 2 failed, 0 up-to-date, 0 skipped ==========
Advertisement
Add Comment
Please, Sign In to add comment