Guest User

Untitled

a guest
Oct 24th, 2026
10
0
Never
Not a member of Pastebin yet? Sign Up, it unlocks many cool features!
text 7.58 KB | None | 0 0
  1. Executing Gradle synchronization tasks
  2. Build info: MCreator 2026.2.33518, fabric-26.2, 64-bit, 49102 MB, Windows 10, JVM 25.0.2, JAVA_HOME: C:\Users\cltno\Downloads\MCreator.2026.2.Windows.64bit\MCreator20262\jdk, started on: 2026-10-24-14:08:45
  3.  
  4. org.gradle.tooling.GradleConnectionException: Could not run phased build action using connection to Gradle distribution 'https://services.gradle.org/distributions/gradle-9.5.1-bin.zip'.
  5. at org.gradle.tooling.internal.consumer.ConnectionExceptionTransformer.transform(ConnectionExceptionTransformer.java:73) at org.gradle.tooling.internal.consumer.ResultHandlerAdapter.onFailure(ResultHandlerAdapter.java:42) at org.gradle.tooling.internal.consumer.async.DefaultAsyncConsumerActionExecutor$1$1.run(DefaultAsyncConsumerActionExecutor.java:68) at org.gradle.internal.concurrent.ExecutorPolicy$CatchAndRecordFailures.onExecute(ExecutorPolicy.java:64) at org.gradle.internal.concurrent.AbstractManagedExecutor$1.run(AbstractManagedExecutor.java:47) at java.base/java.util.concurrent.ThreadPoolExecutor.runWorker(ThreadPoolExecutor.java:1090) at java.base/java.util.concurrent.ThreadPoolExecutor$Worker.run(ThreadPoolExecutor.java:614) at java.base/java.lang.Thread.run(Thread.java:1474) Caused by: org.gradle.api.GradleException: Unable to start the daemon process.
  6. This problem might be caused by incorrect configuration of the daemon.
  7. For example, an unrecognized jvm option is used.For more details on the daemon, please refer to https://docs.gradle.org/9.5.1/userguide/gradle_daemon.html in the Gradle documentation.
  8. Process command line: C:\Users\cltno\Downloads\MCreator.2026.2.Windows.64bit\MCreator20262\jdk\bin\java.exe --add-opens=java.base/java.lang=ALL-UNNAMED --add-opens=java.base/java.lang.invoke=ALL-UNNAMED --add-opens=java.base/java.util=ALL-UNNAMED --add-opens=java.prefs/java.util.prefs=ALL-UNNAMED --add-exports=jdk.compiler/com.sun.tools.javac.api=ALL-UNNAMED --add-exports=jdk.compiler/com.sun.tools.javac.util=ALL-UNNAMED --add-opens=java.base/java.nio.charset=ALL-UNNAMED --add-opens=java.base/java.net=ALL-UNNAMED --add-opens=java.base/java.util.concurrent=ALL-UNNAMED --add-opens=java.base/java.util.concurrent.atomic=ALL-UNNAMED --add-opens=java.xml/javax.xml.namespace=ALL-UNNAMED --add-opens=java.base/java.time=ALL-UNNAMED --enable-native-access=ALL-UNNAMED -Xmx3072m -Dfile.encoding=UTF-8 -Duser.country=US -Duser.language=en -Duser.variant -cp C:\Users\cltno\.mcreator\gradle\wrapper\dists\gradle-9.5.1-bin\iq79hdu3mqx29lgffhp8bfmx\gradle-9.5.1\lib\gradle-daemon-main-9.5.1.jar -javaagent:C:\Users\cltno\.mcreator\gradle\wrapper\dists\gradle-9.5.1-bin\iq79hdu3mqx29lgffhp8bfmx\gradle-9.5.1\lib\agents\gradle-instrumentation-agent-9.5.1.jar org.gradle.launcher.daemon.bootstrap.GradleDaemon 9.5.1
  9. Please read the following process output to find out more:
  10. -----------------------
  11. FAILURE: Build failed with an exception.
  12. * What went wrong:
  13. Could not initialize native services.
  14. * Try:
  15. > Run with --info or --debug option to get more log output.
  16. > Run with --scan to get full insights from a Build Scan (powered by Develocity).
  17. > Get more help at https://help.gradle.org.
  18. * Exception is:
  19. org.gradle.internal.service.ServiceCreationException: Could not initialize native services.
  20. at org.gradle.internal.nativeintegration.services.NativeServices.initialize(NativeServices.java:284) at org.gradle.internal.nativeintegration.services.NativeServices.initializeOnDaemon(NativeServices.java:244) at org.gradle.launcher.daemon.bootstrap.DaemonMain.doAction(DaemonMain.java:90) at org.gradle.launcher.bootstrap.EntryPoint.run(EntryPoint.java:53) at java.base/jdk.internal.reflect.DirectMethodHandleAccessor.invoke(DirectMethodHandleAccessor.java:104) at java.base/java.lang.reflect.Method.invoke(Method.java:565) at org.gradle.launcher.bootstrap.ProcessBootstrap.runNoExit(ProcessBootstrap.java:72) at org.gradle.launcher.bootstrap.ProcessBootstrap.run(ProcessBootstrap.java:39) at org.gradle.launcher.daemon.bootstrap.GradleDaemon.main(GradleDaemon.java:22) Caused by: net.rubygrapefruit.platform.NativeException: Failed to initialise native integration.
  21. at org.gradle.fileevents.FileEvents.init(FileEvents.java:71) at org.gradle.internal.nativeintegration.services.NativeServices$NativeFeatures$1.initialize(NativeServices.java:112) at org.gradle.internal.nativeintegration.services.NativeServices.<init>(NativeServices.java:337) at org.gradle.internal.nativeintegration.services.NativeServices.initialize(NativeServices.java:282) ... 8 more
  22. Caused by: java.lang.UnsatisfiedLinkError: Can't load library: C:\Users\cltno\.mcreator\gradle\native\0.2.8\x86_64-windows-gnu\gradle-fileevents.dll
  23. at java.base/java.lang.ClassLoader.loadLibrary(ClassLoader.java:2249) at java.base/java.lang.Runtime.load0(Runtime.java:767) at java.base/java.lang.System.load(System.java:1648) at org.gradle.fileevents.FileEvents.init(FileEvents.java:55) ... 11 more
  24. at org.gradle.launcher.daemon.client.DaemonGreeter.parseDaemonOutput(DaemonGreeter.java:41) at org.gradle.launcher.daemon.client.DefaultDaemonStarter.startProcess(DefaultDaemonStarter.java:255) at org.gradle.launcher.daemon.client.DefaultDaemonStarter.startDaemon(DefaultDaemonStarter.java:197) at org.gradle.launcher.daemon.client.DefaultDaemonConnector.doStartDaemon(DefaultDaemonConnector.java:219) at org.gradle.launcher.daemon.client.DefaultDaemonConnector.startDaemon(DefaultDaemonConnector.java:213) at org.gradle.launcher.daemon.client.DaemonClient.execute(DaemonClient.java:169) at org.gradle.launcher.daemon.client.DaemonClient.execute(DaemonClient.java:97) at org.gradle.tooling.internal.provider.DaemonBuildActionExecuter.execute(DaemonBuildActionExecuter.java:44) at org.gradle.tooling.internal.provider.DaemonBuildActionExecuter.execute(DaemonBuildActionExecuter.java:30) at org.gradle.tooling.internal.provider.LoggingBridgingBuildActionExecuter.execute(LoggingBridgingBuildActionExecuter.java:59) at org.gradle.tooling.internal.provider.LoggingBridgingBuildActionExecuter.execute(LoggingBridgingBuildActionExecuter.java:38) at org.gradle.tooling.internal.provider.ProviderConnection.run(ProviderConnection.java:278) at org.gradle.tooling.internal.provider.ProviderConnection.runPhasedAction(ProviderConnection.java:240) at org.gradle.tooling.internal.provider.DefaultConnection.run(DefaultConnection.java:194) at org.gradle.tooling.internal.consumer.connection.PhasedActionAwareConsumerConnection.doRun(PhasedActionAwareConsumerConnection.java:56) at org.gradle.tooling.internal.consumer.connection.HelpAndVersionHandlingConsumerConnection.run(HelpAndVersionHandlingConsumerConnection.java:56) at org.gradle.tooling.internal.consumer.connection.ParameterValidatingConsumerConnection.run(ParameterValidatingConsumerConnection.java:62) at org.gradle.tooling.internal.consumer.DefaultPhasedBuildActionExecuter$1.run(DefaultPhasedBuildActionExecuter.java:83) at org.gradle.tooling.internal.consumer.DefaultPhasedBuildActionExecuter$1.run(DefaultPhasedBuildActionExecuter.java:75) at org.gradle.tooling.internal.consumer.connection.LazyConsumerActionExecutor.run(LazyConsumerActionExecutor.java:144) at org.gradle.tooling.internal.consumer.connection.CancellableConsumerActionExecutor.run(CancellableConsumerActionExecutor.java:45) at org.gradle.tooling.internal.consumer.connection.ProgressLoggingConsumerActionExecutor.run(ProgressLoggingConsumerActionExecutor.java:61) at org.gradle.tooling.internal.consumer.connection.RethrowingErrorsConsumerActionExecutor.run(RethrowingErrorsConsumerActionExecutor.java:38) at org.gradle.tooling.internal.consumer.async.DefaultAsyncConsumerActionExecutor$1$1.run(DefaultAsyncConsumerActionExecutor.java:66) ... 5 more
  25.  
  26. TASK EXECUTION FAILED
  27. Task completed in 5 seconds
Advertisement
Add Comment
Please, Sign In to add comment