SHARE
TWEET

svn 1.6.17 apache 2.3

a guest Jul 19th, 2011 193 Never
Not a member of Pastebin yet? Sign Up, it unlocks many cool features!
  1. 1>------ Build started: Project: zlib, Configuration: Release Win32 ------
  2. 1>Performing Makefile project actions
  3. 1>nmake /f win32\Makefile.msc LOC="-DASMV -DASMINF -I." OBJA="inffas32.obj match686.obj" CFLAGS="/nologo /W3 /FD /GX /DWIN32 /D_WINDOWS /MD /O2 /Zi $(LOC)" STATICLIB=zlibstat.lib  zlibstat.lib
  4. 1>'zlibstat.lib' is up-to-date
  5. 1>Build log was saved at "file://C:\build\subversion-1.6.17-apache23\zlib\Release\BuildLog.htm"
  6. 1>zlib - 0 error(s), 0 warning(s)
  7. 2>------ Build started: Project: neon, Configuration: Release Win32 ------
  8. 2>Performing Makefile project actions
  9. 2>Build log was saved at "file://c:\build\subversion-1.6.17-apache23\neon\Release\BuildLog.htm"
  10. 2>neon - 0 error(s), 0 warning(s)
  11. 3>------ Build started: Project: libsvn_ra_dll, Configuration: Release Win32 ------
  12. 4>------ Build started: Project: mod_dav_svn, Configuration: Release Win32 ------
  13. 4>Compiling...
  14. 4>version.c
  15. 3>Linking...
  16. 3>   Creating library ..\..\..\Release\subversion\libsvn_ra\libsvn_ra-1.lib and object ..\..\..\Release\subversion\libsvn_ra\libsvn_ra-1.exp
  17. 3>libneon.lib(ne_openssl.obj) : error LNK2019: unresolved external symbol _SSL_SESSION_cmp referenced in function _ne__negotiate_ssl
  18. 3>libneon.lib(ne_xml.obj) : error LNK2019: unresolved external symbol __imp__XML_GetCurrentLineNumber referenced in function _ne_xml_currentline
  19. 3>libneon.lib(ne_xml.obj) : error LNK2019: unresolved external symbol __imp__XML_ErrorString referenced in function _ne_xml_parse
  20. 3>libneon.lib(ne_xml.obj) : error LNK2019: unresolved external symbol __imp__XML_GetErrorCode referenced in function _ne_xml_parse
  21. 3>libneon.lib(ne_xml.obj) : error LNK2019: unresolved external symbol __imp__XML_Parse referenced in function _ne_xml_parse
  22. 3>libneon.lib(ne_xml.obj) : error LNK2019: unresolved external symbol __imp__XML_ParserFree referenced in function _ne_xml_destroy
  23. 3>libneon.lib(ne_xml.obj) : error LNK2019: unresolved external symbol __imp__XML_SetXmlDeclHandler referenced in function _ne_xml_create
  24. 3>libneon.lib(ne_xml.obj) : error LNK2019: unresolved external symbol __imp__XML_SetUserData referenced in function _ne_xml_create
  25. 3>libneon.lib(ne_xml.obj) : error LNK2019: unresolved external symbol __imp__XML_SetCharacterDataHandler referenced in function _ne_xml_create
  26. 3>libneon.lib(ne_xml.obj) : error LNK2019: unresolved external symbol __imp__XML_SetElementHandler referenced in function _ne_xml_create
  27. 3>libneon.lib(ne_xml.obj) : error LNK2019: unresolved external symbol __imp__XML_ParserCreate referenced in function _ne_xml_create
  28. 3>..\..\..\Release\subversion\libsvn_ra\libsvn_ra-1.dll : fatal error LNK1120: 11 unresolved externals
  29. 4>c:\build\httpd-2.3.12-beta\include\ap_config.h(140) : fatal error C1083: Cannot open include file: 'ap_config_layout.h': No such file or directory
  30. 4>util.c
  31. 3>Build log was saved at "file://c:\build\subversion-1.6.17-apache23\Release\subversion\libsvn_ra\BuildLog.htm"
  32. 3>libsvn_ra_dll - 12 error(s), 0 warning(s)
  33. 5>------ Build started: Project: libsvn_client_dll, Configuration: Release Win32 ------
  34. 5>Linking...
  35. 4>c:\build\httpd-2.3.12-beta\include\ap_config.h(140) : fatal error C1083: Cannot open include file: 'ap_config_layout.h': No such file or directory
  36. 5>   Creating library ..\..\..\Release\subversion\libsvn_client\libsvn_client-1.lib and object ..\..\..\Release\subversion\libsvn_client\libsvn_client-1.exp
  37. 4>repos.c
  38. 5>Embedding manifest...
  39. 4>c:\build\httpd-2.3.12-beta\include\ap_config.h(140) : fatal error C1083: Cannot open include file: 'ap_config_layout.h': No such file or directory
  40. 4>mod_dav_svn.c
  41. 5>Build log was saved at "file://c:\build\subversion-1.6.17-apache23\Release\subversion\libsvn_client\BuildLog.htm"
  42. 5>libsvn_client_dll - 0 error(s), 0 warning(s)
  43. 4>c:\build\httpd-2.3.12-beta\include\ap_config.h(140) : fatal error C1083: Cannot open include file: 'ap_config_layout.h': No such file or directory
  44. 4>mirror.c
  45. 6>------ Build started: Project: svnsync, Configuration: Release Win32 ------
  46. 6>Linking...
  47. 6>Embedding manifest...
  48. 4>c:\build\httpd-2.3.12-beta\include\ap_config.h(140) : fatal error C1083: Cannot open include file: 'ap_config_layout.h': No such file or directory
  49. 4>merge.c
  50. 6>Build log was saved at "file://c:\build\subversion-1.6.17-apache23\Release\subversion\svnsync\BuildLog.htm"
  51. 6>svnsync - 0 error(s), 0 warning(s)
  52. 4>c:\build\httpd-2.3.12-beta\include\ap_config.h(140) : fatal error C1083: Cannot open include file: 'ap_config_layout.h': No such file or directory
  53. 4>lock.c
  54. 7>------ Build started: Project: svn, Configuration: Release Win32 ------
  55. 7>Linking...
  56. 4>c:\build\httpd-2.3.12-beta\include\ap_config.h(140) : fatal error C1083: Cannot open include file: 'ap_config_layout.h': No such file or directory
  57. 4>liveprops.c
  58. 7>Embedding manifest...
  59. 4>c:\build\httpd-2.3.12-beta\include\ap_config.h(140) : fatal error C1083: Cannot open include file: 'ap_config_layout.h': No such file or directory
  60. 4>deadprops.c
  61. 7>Build log was saved at "file://c:\build\subversion-1.6.17-apache23\Release\subversion\svn\BuildLog.htm"
  62. 7>svn - 0 error(s), 0 warning(s)
  63. 4>c:\build\httpd-2.3.12-beta\include\ap_config.h(140) : fatal error C1083: Cannot open include file: 'ap_config_layout.h': No such file or directory
  64. 4>authz.c
  65. 4>c:\build\httpd-2.3.12-beta\include\ap_config.h(140) : fatal error C1083: Cannot open include file: 'ap_config_layout.h': No such file or directory
  66. 4>activity.c
  67. 4>c:\build\httpd-2.3.12-beta\include\ap_config.h(140) : fatal error C1083: Cannot open include file: 'ap_config_layout.h': No such file or directory
  68. 4>Generating Code...
  69. 4>Build log was saved at "file://c:\build\subversion-1.6.17-apache23\Release\subversion\mod_dav_svn\BuildLog.htm"
  70. 4>mod_dav_svn - 11 error(s), 0 warning(s)
  71. 8>------ Build started: Project: mod_authz_svn, Configuration: Release Win32 ------
  72. 8>Compiling...
  73. 8>mod_authz_svn.c
  74. 8>c:\build\httpd-2.3.12-beta\include\ap_config.h(140) : fatal error C1083: Cannot open include file: 'ap_config_layout.h': No such file or directory
  75. 8>Build log was saved at "file://c:\build\subversion-1.6.17-apache23\Release\subversion\mod_authz_svn\BuildLog.htm"
  76. 8>mod_authz_svn - 1 error(s), 0 warning(s)
  77. ========== Build: 5 succeeded, 3 failed, 26 up-to-date, 0 skipped ==========
RAW Paste Data
We use cookies for various purposes including analytics. By continuing to use Pastebin, you agree to our use of cookies as described in the Cookies Policy. OK, I Understand
 
Top