mardurhack

synaptic-multitouch-dkms-make.log

May 14th, 2011
156
Never
Not a member of Pastebin yet? Sign Up, it unlocks many cool features!
  1. DKMS make.log for synaptics-1.1.1 for kernel 2.6.32-31-generic (i686)
  2. Sun May 15 04:31:55 CEST 2011
  3. make: Entering directory `/usr/src/linux-headers-2.6.32-31-generic'
  4. CC [M] /var/lib/dkms/synaptics/1.1.1/build/psmouse-base.o
  5. CC [M] /var/lib/dkms/synaptics/1.1.1/build/synaptics.o
  6. In file included from /var/lib/dkms/synaptics/1.1.1/build/synaptics.c:28:
  7. /var/lib/dkms/synaptics/1.1.1/build/input-mt.h:21: warning: ‘struct input_mt_slot’ declared inside parameter list
  8. /var/lib/dkms/synaptics/1.1.1/build/input-mt.h:21: warning: its scope is only this definition or declaration, which is probably not what you want
  9. /var/lib/dkms/synaptics/1.1.1/build/input-mt.h: In function ‘input_mt_set_value’:
  10. /var/lib/dkms/synaptics/1.1.1/build/input-mt.h:23: error: dereferencing pointer to incomplete type
  11. /var/lib/dkms/synaptics/1.1.1/build/input-mt.h:23: error: ‘ABS_MT_FIRST’ undeclared (first use in this function)
  12. /var/lib/dkms/synaptics/1.1.1/build/input-mt.h:23: error: (Each undeclared identifier is reported only once
  13. /var/lib/dkms/synaptics/1.1.1/build/input-mt.h:23: error: for each function it appears in.)
  14. /var/lib/dkms/synaptics/1.1.1/build/input-mt.h: At top level:
  15. /var/lib/dkms/synaptics/1.1.1/build/input-mt.h:27: warning: ‘struct input_mt_slot’ declared inside parameter list
  16. /var/lib/dkms/synaptics/1.1.1/build/input-mt.h: In function ‘input_mt_get_value’:
  17. /var/lib/dkms/synaptics/1.1.1/build/input-mt.h:29: error: dereferencing pointer to incomplete type
  18. /var/lib/dkms/synaptics/1.1.1/build/input-mt.h:29: error: ‘ABS_MT_FIRST’ undeclared (first use in this function)
  19. /var/lib/dkms/synaptics/1.1.1/build/synaptics.c: In function ‘set_slot’:
  20. /var/lib/dkms/synaptics/1.1.1/build/synaptics.c:490: error: implicit declaration of function ‘input_mt_slot’
  21. make[1]: *** [/var/lib/dkms/synaptics/1.1.1/build/synaptics.o] Error 1
  22. make: *** [_module_/var/lib/dkms/synaptics/1.1.1/build] Error 2
  23. make: Leaving directory `/usr/src/linux-headers-2.6.32-31-generic'
RAW Paste Data