Guest User

processing4 compile errors

a guest
Jan 29th, 2022
232
0
Never
Not a member of Pastebin yet? Sign Up, it unlocks many cool features!
text 25.77 KB | None | 0 0
  1. :: (1/1) Downloaded PKGBUILD: processing4
  2. 1 processing4 (Installed) (Build Files Exist)
  3. ==> Diffs to show?
  4. ==> [N]one [A]ll [Ab]ort [I]nstalled [No]tInstalled or (1 2 3, 1-3, ^4)
  5. ==>
  6. :: (1/1) Parsing SRCINFO: processing4
  7. ==> Making package: processing4 4.0b3-2 (Sat 29 Jan 2022 02:14:56 PM PST)
  8. ==> Retrieving sources...
  9. -> Downloading processing-1278-4.0b3.tar.gz...
  10. % Total % Received % Xferd Average Speed Time Time Time Current
  11. Dload Upload Total Spent Left Speed
  12. 100 145 100 145 0 0 496 0 --:--:-- --:--:-- --:--:-- 496
  13. 100 49.3M 0 49.3M 0 0 910k 0 --:--:-- 0:00:55 --:--:-- 928k
  14. -> Downloading reference.zip...
  15. % Total % Received % Xferd Average Speed Time Time Time Current
  16. Dload Upload Total Spent Left Speed
  17. 100 4290k 100 4290k 0 0 842k 0 0:00:05 0:00:05 --:--:-- 882k
  18. -> Found disable_update_check.patch
  19. -> Found fix_theme_engine.patch
  20. -> Found no_ffmpeg_download.patch
  21. -> Found no_jdk_download.patch
  22. -> Found no_jfx_download.patch
  23. -> Found use_system_jdk.patch
  24. -> Found use_system_libraries.patch
  25. ==> Validating source files with sha256sums...
  26. processing-1278-4.0b3.tar.gz ... Passed
  27. reference.zip ... Passed
  28. disable_update_check.patch ... Passed
  29. fix_theme_engine.patch ... Passed
  30. no_ffmpeg_download.patch ... Passed
  31. no_jdk_download.patch ... Passed
  32. no_jfx_download.patch ... Passed
  33. use_system_jdk.patch ... Passed
  34. use_system_libraries.patch ... Passed
  35. ==> Making package: processing4 4.0b3-2 (Sat 29 Jan 2022 02:15:57 PM PST)
  36. ==> Checking runtime dependencies...
  37. ==> Checking buildtime dependencies...
  38. ==> Retrieving sources...
  39. -> Found processing-1278-4.0b3.tar.gz
  40. -> Found reference.zip
  41. -> Found disable_update_check.patch
  42. -> Found fix_theme_engine.patch
  43. -> Found no_ffmpeg_download.patch
  44. -> Found no_jdk_download.patch
  45. -> Found no_jfx_download.patch
  46. -> Found use_system_jdk.patch
  47. -> Found use_system_libraries.patch
  48. ==> Validating source files with sha256sums...
  49. processing-1278-4.0b3.tar.gz ... Passed
  50. reference.zip ... Passed
  51. disable_update_check.patch ... Passed
  52. fix_theme_engine.patch ... Passed
  53. no_ffmpeg_download.patch ... Passed
  54. no_jdk_download.patch ... Passed
  55. no_jfx_download.patch ... Passed
  56. use_system_jdk.patch ... Passed
  57. use_system_libraries.patch ... Passed
  58. ==> Removing existing $srcdir/ directory...
  59. ==> Extracting sources...
  60. -> Extracting processing-1278-4.0b3.tar.gz with bsdtar
  61. -> Extracting reference.zip with bsdtar
  62. ==> Starting prepare()...
  63. [processing] Generating desktop file... ok
  64. patching file processing4/build/build.xml
  65. patching file processing4/java/libraries/javafx/build.xml
  66. Hunk #1 succeeded at 175 (offset 8 lines).
  67. patching file processing4/build/shared/tools/MovieMaker/build.xml
  68. Hunk #1 succeeded at 81 (offset 7 lines).
  69. patching file processing4/core/build.xml
  70. patching file processing4/build/shared/tools/ThemeEngine/build.xml
  71. patching file processing4/build/linux/processing
  72. patching file processing4/build/shared/lib/defaults.txt
  73. Hunk #1 succeeded at 89 with fuzz 2 (offset 7 lines).
  74. ==> Sources are ready.
  75. ==> Making package: processing4 4.0b3-2 (Sat 29 Jan 2022 02:16:00 PM PST)
  76. ==> Checking runtime dependencies...
  77. ==> Checking buildtime dependencies...
  78. ==> WARNING: Using existing $srcdir/ tree
  79. ==> Starting build()...
  80. Buildfile: /path/to/processing4/src/processing4-processing-1278-4.0b3/build/build.xml
  81.  
  82. build:
  83.  
  84. ignore-tools:
  85. [echo] Ignore the 'Unable to locate tools.jar' message.
  86. [echo] The tools.jar file is not required to build Processing.
  87.  
  88. check-linux-arm32:
  89.  
  90. check-linux-arm64:
  91.  
  92. revision-check:
  93.  
  94. linux-check-os:
  95.  
  96. subprojects-build:
  97.  
  98. download-jogl:
  99. [get] Getting: https://jogamp.org/deployment/archive/rc/v2.4.0-rc-20210111/jar/gluegen-rt-natives-linux-aarch64.jar
  100. [get] To: /path/to/processing4/src/processing4-processing-1278-4.0b3/core/library/gluegen-rt-natives-linux-aarch64.jar
  101. [get] Getting: https://jogamp.org/deployment/archive/rc/v2.4.0-rc-20210111/jar/gluegen-rt-natives-linux-amd64.jar
  102. [get] To: /path/to/processing4/src/processing4-processing-1278-4.0b3/core/library/gluegen-rt-natives-linux-amd64.jar
  103. [get] Getting: https://jogamp.org/deployment/archive/rc/v2.4.0-rc-20210111/jar/gluegen-rt-natives-linux-armv6hf.jar
  104. [get] To: /path/to/processing4/src/processing4-processing-1278-4.0b3/core/library/gluegen-rt-natives-linux-armv6hf.jar
  105. [get] Getting: https://jogamp.org/deployment/archive/rc/v2.4.0-rc-20210111/jar/gluegen-rt-natives-linux-i586.jar
  106. [get] To: /path/to/processing4/src/processing4-processing-1278-4.0b3/core/library/gluegen-rt-natives-linux-i586.jar
  107. [get] Getting: https://jogamp.org/deployment/archive/rc/v2.4.0-rc-20210111/jar/gluegen-rt-natives-macosx-universal.jar
  108. [get] To: /path/to/processing4/src/processing4-processing-1278-4.0b3/core/library/gluegen-rt-natives-macosx-universal.jar
  109. [get] Getting: https://jogamp.org/deployment/archive/rc/v2.4.0-rc-20210111/jar/gluegen-rt-natives-windows-amd64.jar
  110. [get] To: /path/to/processing4/src/processing4-processing-1278-4.0b3/core/library/gluegen-rt-natives-windows-amd64.jar
  111. [get] Getting: https://jogamp.org/deployment/archive/rc/v2.4.0-rc-20210111/jar/gluegen-rt-natives-windows-i586.jar
  112. [get] To: /path/to/processing4/src/processing4-processing-1278-4.0b3/core/library/gluegen-rt-natives-windows-i586.jar
  113. [get] Getting: https://jogamp.org/deployment/archive/rc/v2.4.0-rc-20210111/jar/gluegen-rt.jar
  114. [get] To: /path/to/processing4/src/processing4-processing-1278-4.0b3/core/library/gluegen-rt.jar
  115. [get] Getting: https://jogamp.org/deployment/archive/rc/v2.4.0-rc-20210111/jar/jogl-all-natives-linux-aarch64.jar
  116. [get] To: /path/to/processing4/src/processing4-processing-1278-4.0b3/core/library/jogl-all-natives-linux-aarch64.jar
  117. [get] Getting: https://jogamp.org/deployment/archive/rc/v2.4.0-rc-20210111/jar/jogl-all-natives-linux-amd64.jar
  118. [get] To: /path/to/processing4/src/processing4-processing-1278-4.0b3/core/library/jogl-all-natives-linux-amd64.jar
  119. [get] Getting: https://jogamp.org/deployment/archive/rc/v2.4.0-rc-20210111/jar/jogl-all-natives-linux-armv6hf.jar
  120. [get] To: /path/to/processing4/src/processing4-processing-1278-4.0b3/core/library/jogl-all-natives-linux-armv6hf.jar
  121. [get] Getting: https://jogamp.org/deployment/archive/rc/v2.4.0-rc-20210111/jar/jogl-all-natives-linux-i586.jar
  122. [get] To: /path/to/processing4/src/processing4-processing-1278-4.0b3/core/library/jogl-all-natives-linux-i586.jar
  123. [get] Getting: https://jogamp.org/deployment/archive/rc/v2.4.0-rc-20210111/jar/jogl-all-natives-macosx-universal.jar
  124. [get] To: /path/to/processing4/src/processing4-processing-1278-4.0b3/core/library/jogl-all-natives-macosx-universal.jar
  125. [get] Getting: https://jogamp.org/deployment/archive/rc/v2.4.0-rc-20210111/jar/jogl-all-natives-windows-amd64.jar
  126. [get] To: /path/to/processing4/src/processing4-processing-1278-4.0b3/core/library/jogl-all-natives-windows-amd64.jar
  127. [get] Getting: https://jogamp.org/deployment/archive/rc/v2.4.0-rc-20210111/jar/jogl-all-natives-windows-i586.jar
  128. [get] To: /path/to/processing4/src/processing4-processing-1278-4.0b3/core/library/jogl-all-natives-windows-i586.jar
  129. [get] Getting: https://jogamp.org/deployment/archive/rc/v2.4.0-rc-20210111/jar/jogl-all.jar
  130. [get] To: /path/to/processing4/src/processing4-processing-1278-4.0b3/core/library/jogl-all.jar
  131.  
  132. methods-check:
  133.  
  134. methods-build:
  135.  
  136. compile:
  137. [mkdir] Created dir: /path/to/processing4/src/processing4-processing-1278-4.0b3/core/methods/bin
  138. [javac] Compiling 1 source file to /path/to/processing4/src/processing4-processing-1278-4.0b3/core/methods/bin
  139.  
  140. dist:
  141. [jar] Building jar: /path/to/processing4/src/processing4-processing-1278-4.0b3/core/methods/methods.jar
  142.  
  143. compile:
  144. [methods] No changes to PApplet API.
  145. [mkdir] Created dir: /path/to/processing4/src/processing4-processing-1278-4.0b3/core/bin
  146. [javac] Compiling 57 source files to /path/to/processing4/src/processing4-processing-1278-4.0b3/core/bin
  147. [javac] Note: /path/to/processing4/src/processing4-processing-1278-4.0b3/core/src/processing/awt/PImageAWT.java uses or overrides a deprecated API.
  148. [javac] Note: Recompile with -Xlint:deprecation for details.
  149. [copy] Copying 1 file to /path/to/processing4/src/processing4-processing-1278-4.0b3/core/bin/japplemenubar
  150. [copy] Copying 33 files to /path/to/processing4/src/processing4-processing-1278-4.0b3/core/bin
  151.  
  152. build:
  153. [jar] Building jar: /path/to/processing4/src/processing4-processing-1278-4.0b3/core/library/core.jar
  154.  
  155. download-vaqua:
  156. [get] Getting: https://violetlib.org/release/vaqua/9/VAqua9.jar
  157. [get] To: /path/to/processing4/src/processing4-processing-1278-4.0b3/app/lib/VAqua9.jar
  158.  
  159. download-ant:
  160. [get] Getting: https://archive.apache.org/dist/ant/binaries/apache-ant-1.10.10-bin.zip
  161. [get] To: /path/to/processing4/src/processing4-processing-1278-4.0b3/app/apache-ant-1.10.10-bin.zip
  162. [unzip] Expanding: /path/to/processing4/src/processing4-processing-1278-4.0b3/app/apache-ant-1.10.10-bin.zip into /path/to/processing4/src/processing4-processing-1278-4.0b3/app/lib
  163. [delete] Deleting: /path/to/processing4/src/processing4-processing-1278-4.0b3/app/apache-ant-1.10.10-bin.zip
  164.  
  165. download-jna:
  166. [get] Getting: https://github.com/java-native-access/jna/archive/5.8.0.zip
  167. [get] To: /path/to/processing4/src/processing4-processing-1278-4.0b3/app/5.8.0.zip
  168. [get] https://github.com/java-native-access/jna/archive/5.8.0.zip moved to https://codeload.github.com/java-native-access/jna/zip/5.8.0
  169. [unzip] Expanding: /path/to/processing4/src/processing4-processing-1278-4.0b3/app/5.8.0.zip into /path/to/processing4/src/processing4-processing-1278-4.0b3/app/lib
  170. [delete] Deleting: /path/to/processing4/src/processing4-processing-1278-4.0b3/app/5.8.0.zip
  171.  
  172. compile:
  173. [mkdir] Created dir: /path/to/processing4/src/processing4-processing-1278-4.0b3/app/bin
  174. [javac] Compiling 108 source files to /path/to/processing4/src/processing4-processing-1278-4.0b3/app/bin
  175. [javac] /path/to/processing4/src/processing4-processing-1278-4.0b3/app/src/processing/app/ui/EditorButton.java:192: warning: [deprecation] getModifiers() in InputEvent has been deprecated
  176. [javac] null, e.getModifiers()));
  177. [javac] ^
  178. [javac] 1 warning
  179.  
  180. build:
  181. [jar] Building jar: /path/to/processing4/src/processing4-processing-1278-4.0b3/app/pde.jar
  182.  
  183. compile:
  184. [mkdir] Created dir: /path/to/processing4/src/processing4-processing-1278-4.0b3/java/libraries/dxf/bin
  185. [javac] Compiling 1 source file to /path/to/processing4/src/processing4-processing-1278-4.0b3/java/libraries/dxf/bin
  186.  
  187. build:
  188. [jar] Building jar: /path/to/processing4/src/processing4-processing-1278-4.0b3/java/libraries/dxf/library/dxf.jar
  189.  
  190. build:
  191.  
  192. compile:
  193. [mkdir] Created dir: /path/to/processing4/src/processing4-processing-1278-4.0b3/java/libraries/net/bin
  194. [javac] Compiling 2 source files to /path/to/processing4/src/processing4-processing-1278-4.0b3/java/libraries/net/bin
  195.  
  196. build:
  197. [jar] Building jar: /path/to/processing4/src/processing4-processing-1278-4.0b3/java/libraries/net/library/net.jar
  198.  
  199. compile:
  200. [mkdir] Created dir: /path/to/processing4/src/processing4-processing-1278-4.0b3/java/libraries/pdf/bin
  201. [javac] Compiling 1 source file to /path/to/processing4/src/processing4-processing-1278-4.0b3/java/libraries/pdf/bin
  202.  
  203. build:
  204. [jar] Building jar: /path/to/processing4/src/processing4-processing-1278-4.0b3/java/libraries/pdf/library/pdf.jar
  205.  
  206. compile:
  207. [mkdir] Created dir: /path/to/processing4/src/processing4-processing-1278-4.0b3/java/libraries/serial/bin
  208. [javac] Compiling 1 source file to /path/to/processing4/src/processing4-processing-1278-4.0b3/java/libraries/serial/bin
  209. [javac] Note: /path/to/processing4/src/processing4-processing-1278-4.0b3/java/libraries/serial/src/processing/serial/Serial.java uses or overrides a deprecated API.
  210. [javac] Note: Recompile with -Xlint:deprecation for details.
  211.  
  212. build:
  213. [jar] Building jar: /path/to/processing4/src/processing4-processing-1278-4.0b3/java/libraries/serial/library/serial.jar
  214.  
  215. download-batik:
  216. [get] Getting: https://archive.apache.org/dist/xmlgraphics/batik/binaries/batik-bin-1.14.zip
  217. [get] To: /path/to/processing4/src/processing4-processing-1278-4.0b3/java/libraries/svg/batik-bin-1.14.zip
  218. [unzip] Expanding: /path/to/processing4/src/processing4-processing-1278-4.0b3/java/libraries/svg/batik-bin-1.14.zip into /path/to/processing4/src/processing4-processing-1278-4.0b3/java/libraries/svg
  219. [rename] DEPRECATED - The rename task is deprecated. Use move instead.
  220. [delete] Deleting: /path/to/processing4/src/processing4-processing-1278-4.0b3/java/libraries/svg/batik-bin-1.14.zip
  221.  
  222. compile:
  223. [mkdir] Created dir: /path/to/processing4/src/processing4-processing-1278-4.0b3/java/libraries/svg/bin
  224. [javac] Compiling 2 source files to /path/to/processing4/src/processing4-processing-1278-4.0b3/java/libraries/svg/bin
  225.  
  226. build:
  227. [jar] Building jar: /path/to/processing4/src/processing4-processing-1278-4.0b3/java/libraries/svg/library/svg.jar
  228.  
  229. compile:
  230. [mkdir] Created dir: /path/to/processing4/src/processing4-processing-1278-4.0b3/build/shared/tools/MovieMaker/bin
  231. [javac] Compiling 16 source files to /path/to/processing4/src/processing4-processing-1278-4.0b3/build/shared/tools/MovieMaker/bin
  232.  
  233. build:
  234. [jar] Building jar: /path/to/processing4/src/processing4-processing-1278-4.0b3/build/shared/tools/MovieMaker/tool/MovieMaker.jar
  235.  
  236. compile:
  237. [mkdir] Created dir: /path/to/processing4/src/processing4-processing-1278-4.0b3/build/shared/tools/ThemeEngine/bin
  238. [javac] Compiling 3 source files to /path/to/processing4/src/processing4-processing-1278-4.0b3/build/shared/tools/ThemeEngine/bin
  239. [javac] /path/to/processing4/src/processing4-processing-1278-4.0b3/build/shared/tools/ThemeEngine/src/processing/app/tools/SimpleSwingBrowser.java:34: error: package javafx.application does not exist
  240. [javac] import javafx.application.Platform;
  241. [javac] ^
  242. [javac] /path/to/processing4/src/processing4-processing-1278-4.0b3/build/shared/tools/ThemeEngine/src/processing/app/tools/SimpleSwingBrowser.java:35: error: package javafx.embed.swing does not exist
  243. [javac] import javafx.embed.swing.JFXPanel;
  244. [javac] ^
  245. [javac] /path/to/processing4/src/processing4-processing-1278-4.0b3/build/shared/tools/ThemeEngine/src/processing/app/tools/SimpleSwingBrowser.java:36: error: package javafx.scene does not exist
  246. [javac] import javafx.scene.Scene;
  247. [javac] ^
  248. [javac] /path/to/processing4/src/processing4-processing-1278-4.0b3/build/shared/tools/ThemeEngine/src/processing/app/tools/SimpleSwingBrowser.java:37: error: package javafx.scene.web does not exist
  249. [javac] import javafx.scene.web.WebEngine;
  250. [javac] ^
  251. [javac] /path/to/processing4/src/processing4-processing-1278-4.0b3/build/shared/tools/ThemeEngine/src/processing/app/tools/SimpleSwingBrowser.java:38: error: package javafx.scene.web does not exist
  252. [javac] import javafx.scene.web.WebView;
  253. [javac] ^
  254. [javac] /path/to/processing4/src/processing4-processing-1278-4.0b3/build/shared/tools/ThemeEngine/src/processing/app/tools/SimpleSwingBrowser.java:46: error: package javafx.concurrent.Worker does not exist
  255. [javac] import static javafx.concurrent.Worker.State.FAILED;
  256. [javac] ^
  257. [javac] /path/to/processing4/src/processing4-processing-1278-4.0b3/build/shared/tools/ThemeEngine/src/processing/app/tools/SimpleSwingBrowser.java:46: error: static import only from classes and interfaces
  258. [javac] import static javafx.concurrent.Worker.State.FAILED;
  259. [javac] ^
  260. [javac] /path/to/processing4/src/processing4-processing-1278-4.0b3/build/shared/tools/ThemeEngine/src/processing/app/tools/SimpleSwingBrowser.java:51: error: cannot find symbol
  261. [javac] private final JFXPanel jfxPanel = new JFXPanel();
  262. [javac] ^
  263. [javac] symbol: class JFXPanel
  264. [javac] location: class SimpleSwingBrowser
  265. [javac] /path/to/processing4/src/processing4-processing-1278-4.0b3/build/shared/tools/ThemeEngine/src/processing/app/tools/SimpleSwingBrowser.java:52: error: cannot find symbol
  266. [javac] private WebEngine engine;
  267. [javac] ^
  268. [javac] symbol: class WebEngine
  269. [javac] location: class SimpleSwingBrowser
  270. [javac] /path/to/processing4/src/processing4-processing-1278-4.0b3/build/shared/tools/ThemeEngine/src/processing/app/tools/WebFrame.java:3: error: package javafx.application does not exist
  271. [javac] import javafx.application.Platform;
  272. [javac] ^
  273. [javac] /path/to/processing4/src/processing4-processing-1278-4.0b3/build/shared/tools/ThemeEngine/src/processing/app/tools/WebFrame.java:4: error: package javafx.embed.swing does not exist
  274. [javac] import javafx.embed.swing.JFXPanel;
  275. [javac] ^
  276. [javac] /path/to/processing4/src/processing4-processing-1278-4.0b3/build/shared/tools/ThemeEngine/src/processing/app/tools/WebFrame.java:5: error: package javafx.scene does not exist
  277. [javac] import javafx.scene.Scene;
  278. [javac] ^
  279. [javac] /path/to/processing4/src/processing4-processing-1278-4.0b3/build/shared/tools/ThemeEngine/src/processing/app/tools/WebFrame.java:6: error: package javafx.scene.web does not exist
  280. [javac] import javafx.scene.web.WebEngine;
  281. [javac] ^
  282. [javac] /path/to/processing4/src/processing4-processing-1278-4.0b3/build/shared/tools/ThemeEngine/src/processing/app/tools/WebFrame.java:7: error: package javafx.scene.web does not exist
  283. [javac] import javafx.scene.web.WebView;
  284. [javac] ^
  285. [javac] /path/to/processing4/src/processing4-processing-1278-4.0b3/build/shared/tools/ThemeEngine/src/processing/app/tools/WebFrame.java:13: error: package com.sun.javafx.webkit does not exist
  286. [javac] import com.sun.javafx.webkit.WebConsoleListener;
  287. [javac] ^
  288. [javac] /path/to/processing4/src/processing4-processing-1278-4.0b3/build/shared/tools/ThemeEngine/src/processing/app/tools/WebFrame.java:15: error: package javafx.concurrent.Worker does not exist
  289. [javac] import static javafx.concurrent.Worker.State.FAILED;
  290. [javac] ^
  291. [javac] /path/to/processing4/src/processing4-processing-1278-4.0b3/build/shared/tools/ThemeEngine/src/processing/app/tools/WebFrame.java:15: error: static import only from classes and interfaces
  292. [javac] import static javafx.concurrent.Worker.State.FAILED;
  293. [javac] ^
  294. [javac] /path/to/processing4/src/processing4-processing-1278-4.0b3/build/shared/tools/ThemeEngine/src/processing/app/tools/WebFrame.java:20: error: cannot find symbol
  295. [javac] private final JFXPanel jfxPanel = new JFXPanel();
  296. [javac] ^
  297. [javac] symbol: class JFXPanel
  298. [javac] location: class WebFrame
  299. [javac] /path/to/processing4/src/processing4-processing-1278-4.0b3/build/shared/tools/ThemeEngine/src/processing/app/tools/WebFrame.java:21: error: cannot find symbol
  300. [javac] private WebEngine engine;
  301. [javac] ^
  302. [javac] symbol: class WebEngine
  303. [javac] location: class WebFrame
  304. [javac] /path/to/processing4/src/processing4-processing-1278-4.0b3/build/shared/tools/ThemeEngine/src/processing/app/tools/SimpleSwingBrowser.java:51: error: cannot find symbol
  305. [javac] private final JFXPanel jfxPanel = new JFXPanel();
  306. [javac] ^
  307. [javac] symbol: class JFXPanel
  308. [javac] location: class SimpleSwingBrowser
  309. [javac] /path/to/processing4/src/processing4-processing-1278-4.0b3/build/shared/tools/ThemeEngine/src/processing/app/tools/SimpleSwingBrowser.java:102: error: cannot find symbol
  310. [javac] Platform.runLater(() -> {
  311. [javac] ^
  312. [javac] symbol: variable Platform
  313. [javac] location: class SimpleSwingBrowser
  314. [javac] /path/to/processing4/src/processing4-processing-1278-4.0b3/build/shared/tools/ThemeEngine/src/processing/app/tools/SimpleSwingBrowser.java:103: error: cannot find symbol
  315. [javac] WebView view = new WebView();
  316. [javac] ^
  317. [javac] symbol: class WebView
  318. [javac] location: class SimpleSwingBrowser
  319. [javac] /path/to/processing4/src/processing4-processing-1278-4.0b3/build/shared/tools/ThemeEngine/src/processing/app/tools/SimpleSwingBrowser.java:103: error: cannot find symbol
  320. [javac] WebView view = new WebView();
  321. [javac] ^
  322. [javac] symbol: class WebView
  323. [javac] location: class SimpleSwingBrowser
  324. [javac] /path/to/processing4/src/processing4-processing-1278-4.0b3/build/shared/tools/ThemeEngine/src/processing/app/tools/SimpleSwingBrowser.java:117: error: cannot find symbol
  325. [javac] if (engine.getLoadWorker().getState() == FAILED) {
  326. [javac] ^
  327. [javac] symbol: variable FAILED
  328. [javac] location: class SimpleSwingBrowser
  329. [javac] /path/to/processing4/src/processing4-processing-1278-4.0b3/build/shared/tools/ThemeEngine/src/processing/app/tools/SimpleSwingBrowser.java:128: error: cannot find symbol
  330. [javac] jfxPanel.setScene(new Scene(view));
  331. [javac] ^
  332. [javac] symbol: class Scene
  333. [javac] location: class SimpleSwingBrowser
  334. [javac] /path/to/processing4/src/processing4-processing-1278-4.0b3/build/shared/tools/ThemeEngine/src/processing/app/tools/SimpleSwingBrowser.java:134: error: cannot find symbol
  335. [javac] Platform.runLater(() -> {
  336. [javac] ^
  337. [javac] symbol: variable Platform
  338. [javac] location: class SimpleSwingBrowser
  339. [javac] /path/to/processing4/src/processing4-processing-1278-4.0b3/build/shared/tools/ThemeEngine/src/processing/app/tools/WebFrame.java:20: error: cannot find symbol
  340. [javac] private final JFXPanel jfxPanel = new JFXPanel();
  341. [javac] ^
  342. [javac] symbol: class JFXPanel
  343. [javac] location: class WebFrame
  344. [javac] /path/to/processing4/src/processing4-processing-1278-4.0b3/build/shared/tools/ThemeEngine/src/processing/app/tools/WebFrame.java:72: error: cannot find symbol
  345. [javac] Platform.runLater(() -> {
  346. [javac] ^
  347. [javac] symbol: variable Platform
  348. [javac] location: class WebFrame
  349. [javac] /path/to/processing4/src/processing4-processing-1278-4.0b3/build/shared/tools/ThemeEngine/src/processing/app/tools/WebFrame.java:73: error: cannot find symbol
  350. [javac] WebView view = new WebView();
  351. [javac] ^
  352. [javac] symbol: class WebView
  353. [javac] location: class WebFrame
  354. [javac] /path/to/processing4/src/processing4-processing-1278-4.0b3/build/shared/tools/ThemeEngine/src/processing/app/tools/WebFrame.java:73: error: cannot find symbol
  355. [javac] WebView view = new WebView();
  356. [javac] ^
  357. [javac] symbol: class WebView
  358. [javac] location: class WebFrame
  359. [javac] /path/to/processing4/src/processing4-processing-1278-4.0b3/build/shared/tools/ThemeEngine/src/processing/app/tools/WebFrame.java:85: error: cannot find symbol
  360. [javac] if (engine.getLoadWorker().getState() == FAILED) {
  361. [javac] ^
  362. [javac] symbol: variable FAILED
  363. [javac] location: class WebFrame
  364. [javac] /path/to/processing4/src/processing4-processing-1278-4.0b3/build/shared/tools/ThemeEngine/src/processing/app/tools/WebFrame.java:96: error: cannot find symbol
  365. [javac] jfxPanel.setScene(new Scene(view));
  366. [javac] ^
  367. [javac] symbol: class Scene
  368. [javac] location: class WebFrame
  369. [javac] /path/to/processing4/src/processing4-processing-1278-4.0b3/build/shared/tools/ThemeEngine/src/processing/app/tools/WebFrame.java:102: error: cannot find symbol
  370. [javac] Platform.runLater(() -> engine.load(url));
  371. [javac] ^
  372. [javac] symbol: variable Platform
  373. [javac] location: class WebFrame
  374. [javac] /path/to/processing4/src/processing4-processing-1278-4.0b3/build/shared/tools/ThemeEngine/src/processing/app/tools/WebFrame.java:107: error: cannot find symbol
  375. [javac] Platform.runLater(() -> {
  376. [javac] ^
  377. [javac] symbol: variable Platform
  378. [javac] location: class WebFrame
  379. [javac] /path/to/processing4/src/processing4-processing-1278-4.0b3/build/shared/tools/ThemeEngine/src/processing/app/tools/WebFrame.java:109: error: cannot find symbol
  380. [javac] WebConsoleListener.setDefaultListener((webView, message, lineNumber, sourceId) -> {
  381. [javac] ^
  382. [javac] symbol: variable WebConsoleListener
  383. [javac] location: class WebFrame
  384. [javac] 35 errors
  385.  
  386. BUILD FAILED
  387. /path/to/processing4/src/processing4-processing-1278-4.0b3/build/build.xml:270: The following error occurred while executing this line:
  388. /path/to/processing4/src/processing4-processing-1278-4.0b3/build/build.xml:366: The following error occurred while executing this line:
  389. /path/to/processing4/src/processing4-processing-1278-4.0b3/build/shared/tools/ThemeEngine/build.xml:24: Compile failed; see the compiler error output for details.
  390.  
  391. Total time: 4 minutes 14 seconds
  392. ==> ERROR: A failure occurred in build().
  393. Aborting...
  394. -> error making: processing4
  395.  
Advertisement
Add Comment
Please, Sign In to add comment