Advertisement
Guest User

Untitled

a guest
Jun 5th, 2019
86
0
Never
Not a member of Pastebin yet? Sign Up, it unlocks many cool features!
text 19.67 KB | None | 0 0
  1. irynah@irynah-Vostro-3560:~/Openmrs-Projects/trunk-5499/openmrs-core$ mvn clean install -e
  2. [INFO] Error stacktraces are turned on.
  3. [INFO] Scanning for projects...
  4. [INFO] ------------------------------------------------------------------------
  5. [INFO] Reactor Build Order:
  6. [INFO]
  7. [INFO] OpenMRS [pom]
  8. [INFO] openmrs-tools [jar]
  9. [INFO] openmrs-test [pom]
  10. [INFO] openmrs-api [jar]
  11. [INFO] openmrs-web [jar]
  12. [INFO] openmrs-webapp [war]
  13. [INFO]
  14. [INFO] ------------------------< org.openmrs:openmrs >-------------------------
  15. [INFO] Building OpenMRS 2.3.0-SNAPSHOT [1/6]
  16. [INFO] --------------------------------[ pom ]---------------------------------
  17. [INFO]
  18. [INFO] --- maven-clean-plugin:2.5:clean (default-clean) @ openmrs ---
  19. [INFO] Deleting /home/irynah/Openmrs-Projects/trunk-5499/openmrs-core/target
  20. [INFO]
  21. [INFO] --- buildnumber-maven-plugin:1.1:create (default) @ openmrs ---
  22. [INFO] Checking for local modifications: skipped.
  23. [INFO] Updating project files from SCM: skipped.
  24. [INFO] ShortRevision tag detected. The value is '6'.
  25. [INFO] Executing: /bin/sh -c cd /home/irynah/Openmrs-Projects/trunk-5499/openmrs-core && git rev-parse --verify --short=6 HEAD
  26. [INFO] Working directory: /home/irynah/Openmrs-Projects/trunk-5499/openmrs-core
  27. [INFO] Storing buildNumber: 77b866 at timestamp: 1559737826987
  28. [INFO] ShortRevision tag detected. The value is '6'.
  29. [INFO] Executing: /bin/sh -c cd /home/irynah/Openmrs-Projects/trunk-5499/openmrs-core && git rev-parse --verify --short=6 HEAD
  30. [INFO] Working directory: /home/irynah/Openmrs-Projects/trunk-5499/openmrs-core
  31. [INFO] Storing buildScmBranch: trunk
  32. [INFO]
  33. [INFO] --- build-helper-maven-plugin:1.5:parse-version (parse-version) @ openmrs ---
  34. [INFO]
  35. [INFO] --- maven-jar-plugin:2.3.2:test-jar (default) @ openmrs ---
  36. [WARNING] JAR will be empty - no content was marked for inclusion!
  37. [INFO] Building jar: /home/irynah/Openmrs-Projects/trunk-5499/openmrs-core/target/openmrs-2.3.0-SNAPSHOT-tests.jar
  38. [INFO]
  39. [INFO] --- license-maven-plugin:3.0:check (default) @ openmrs ---
  40. [INFO] Checking licenses...
  41. [INFO]
  42. [INFO] --- maven-install-plugin:2.4:install (default-install) @ openmrs ---
  43. [INFO] Installing /home/irynah/Openmrs-Projects/trunk-5499/openmrs-core/pom.xml to /home/irynah/.m2/repository/org/openmrs/openmrs/2.3.0-SNAPSHOT/openmrs-2.3.0-SNAPSHOT.pom
  44. [INFO] Installing /home/irynah/Openmrs-Projects/trunk-5499/openmrs-core/target/openmrs-2.3.0-SNAPSHOT-tests.jar to /home/irynah/.m2/repository/org/openmrs/openmrs/2.3.0-SNAPSHOT/openmrs-2.3.0-SNAPSHOT-tests.jar
  45. [INFO]
  46. [INFO] ------------------< org.openmrs.tools:openmrs-tools >-------------------
  47. [INFO] Building openmrs-tools 2.3.0-SNAPSHOT [2/6]
  48. [INFO] --------------------------------[ jar ]---------------------------------
  49. [INFO]
  50. [INFO] --- maven-clean-plugin:2.5:clean (default-clean) @ openmrs-tools ---
  51. [INFO] Deleting /home/irynah/Openmrs-Projects/trunk-5499/openmrs-core/tools/target
  52. [INFO]
  53. [INFO] --- buildnumber-maven-plugin:1.1:create (default) @ openmrs-tools ---
  54. [INFO]
  55. [INFO] --- build-helper-maven-plugin:1.5:parse-version (parse-version) @ openmrs-tools ---
  56. [INFO]
  57. [INFO] --- maven-resources-plugin:2.4:resources (default-resources) @ openmrs-tools ---
  58. [INFO] Using 'UTF-8' encoding to copy filtered resources.
  59. [INFO] Copying 4 resources
  60. [INFO]
  61. [INFO] --- maven-compiler-plugin:2.1:compile (default-compile) @ openmrs-tools ---
  62. [INFO] Compiling 1 source file to /home/irynah/Openmrs-Projects/trunk-5499/openmrs-core/tools/target/classes
  63. [INFO]
  64. [INFO] --- maven-resources-plugin:2.4:testResources (default-testResources) @ openmrs-tools ---
  65. [INFO] Using 'UTF-8' encoding to copy filtered resources.
  66. [INFO] skip non existing resourceDirectory /home/irynah/Openmrs-Projects/trunk-5499/openmrs-core/tools/src/test/resources
  67. [INFO]
  68. [INFO] --- maven-compiler-plugin:2.1:testCompile (default-testCompile) @ openmrs-tools ---
  69. [INFO] No sources to compile
  70. [INFO]
  71. [INFO] --- maven-surefire-plugin:2.18.1:test (default-test) @ openmrs-tools ---
  72. [INFO] No tests to run.
  73. [INFO]
  74. [INFO] --- maven-jar-plugin:2.3.2:jar (default-jar) @ openmrs-tools ---
  75. [INFO] Building jar: /home/irynah/Openmrs-Projects/trunk-5499/openmrs-core/tools/target/openmrs-tools-2.3.0-SNAPSHOT.jar
  76. [INFO]
  77. [INFO] --- maven-jar-plugin:2.3.2:test-jar (default) @ openmrs-tools ---
  78. [WARNING] JAR will be empty - no content was marked for inclusion!
  79. [INFO] Building jar: /home/irynah/Openmrs-Projects/trunk-5499/openmrs-core/tools/target/openmrs-tools-2.3.0-SNAPSHOT-tests.jar
  80. [INFO]
  81. [INFO] --- license-maven-plugin:3.0:check (default) @ openmrs-tools ---
  82. [INFO] Checking licenses...
  83. [INFO]
  84. [INFO] --- maven-install-plugin:2.4:install (default-install) @ openmrs-tools ---
  85. [INFO] Installing /home/irynah/Openmrs-Projects/trunk-5499/openmrs-core/tools/target/openmrs-tools-2.3.0-SNAPSHOT.jar to /home/irynah/.m2/repository/org/openmrs/tools/openmrs-tools/2.3.0-SNAPSHOT/openmrs-tools-2.3.0-SNAPSHOT.jar
  86. [INFO] Installing /home/irynah/Openmrs-Projects/trunk-5499/openmrs-core/tools/pom.xml to /home/irynah/.m2/repository/org/openmrs/tools/openmrs-tools/2.3.0-SNAPSHOT/openmrs-tools-2.3.0-SNAPSHOT.pom
  87. [INFO] Installing /home/irynah/Openmrs-Projects/trunk-5499/openmrs-core/tools/target/openmrs-tools-2.3.0-SNAPSHOT-tests.jar to /home/irynah/.m2/repository/org/openmrs/tools/openmrs-tools/2.3.0-SNAPSHOT/openmrs-tools-2.3.0-SNAPSHOT-tests.jar
  88. [INFO]
  89. [INFO] -------------------< org.openmrs.test:openmrs-test >--------------------
  90. [INFO] Building openmrs-test 2.3.0-SNAPSHOT [3/6]
  91. [INFO] --------------------------------[ pom ]---------------------------------
  92. [INFO]
  93. [INFO] --- maven-clean-plugin:2.5:clean (default-clean) @ openmrs-test ---
  94. [INFO] Deleting /home/irynah/Openmrs-Projects/trunk-5499/openmrs-core/test/target
  95. [INFO]
  96. [INFO] --- buildnumber-maven-plugin:1.1:create (default) @ openmrs-test ---
  97. [INFO]
  98. [INFO] --- build-helper-maven-plugin:1.5:parse-version (parse-version) @ openmrs-test ---
  99. [INFO]
  100. [INFO] --- maven-jar-plugin:2.3.2:test-jar (default) @ openmrs-test ---
  101. [WARNING] JAR will be empty - no content was marked for inclusion!
  102. [INFO] Building jar: /home/irynah/Openmrs-Projects/trunk-5499/openmrs-core/test/target/openmrs-test-2.3.0-SNAPSHOT-tests.jar
  103. [INFO]
  104. [INFO] --- license-maven-plugin:3.0:check (default) @ openmrs-test ---
  105. [INFO] Checking licenses...
  106. [INFO]
  107. [INFO] --- maven-install-plugin:2.4:install (default-install) @ openmrs-test ---
  108. [INFO] Installing /home/irynah/Openmrs-Projects/trunk-5499/openmrs-core/test/pom.xml to /home/irynah/.m2/repository/org/openmrs/test/openmrs-test/2.3.0-SNAPSHOT/openmrs-test-2.3.0-SNAPSHOT.pom
  109. [INFO] Installing /home/irynah/Openmrs-Projects/trunk-5499/openmrs-core/test/target/openmrs-test-2.3.0-SNAPSHOT-tests.jar to /home/irynah/.m2/repository/org/openmrs/test/openmrs-test/2.3.0-SNAPSHOT/openmrs-test-2.3.0-SNAPSHOT-tests.jar
  110. [INFO]
  111. [INFO] --------------------< org.openmrs.api:openmrs-api >---------------------
  112. [INFO] Building openmrs-api 2.3.0-SNAPSHOT [4/6]
  113. [INFO] --------------------------------[ jar ]---------------------------------
  114. [INFO]
  115. [INFO] --- maven-clean-plugin:2.5:clean (default-clean) @ openmrs-api ---
  116. [INFO] Deleting /home/irynah/Openmrs-Projects/trunk-5499/openmrs-core/api/target
  117. [INFO]
  118. [INFO] --- buildnumber-maven-plugin:1.1:create (default) @ openmrs-api ---
  119. [INFO]
  120. [INFO] --- build-helper-maven-plugin:1.5:parse-version (parse-version) @ openmrs-api ---
  121. [INFO]
  122. [INFO] --- jacoco-maven-plugin:0.8.0:prepare-agent (prepare-agent) @ openmrs-api ---
  123. [INFO] argLine set to -javaagent:/home/irynah/.m2/repository/org/jacoco/org.jacoco.agent/0.8.0/org.jacoco.agent-0.8.0-runtime.jar=destfile=/home/irynah/Openmrs-Projects/trunk-5499/openmrs-core/api/target/jacoco.exec,includes=org/openmrs/** -Duser.language=en -Duser.region=US -Xmx2g
  124. [INFO]
  125. [INFO] --- maven-java-formatter-plugin:0.3:format (default) @ openmrs-api ---
  126. [INFO] Using 'UTF-8' encoding to format source files.
  127. [INFO] Number of files to be formatted: 1030
  128. [INFO] Successfully formatted: 0 file(s)
  129. [INFO] Fail to format : 0 file(s)
  130. [INFO] Skipped : 1030 file(s)
  131. [INFO] Approximate time taken: 5s
  132. [INFO]
  133. [INFO] --- maven-resources-plugin:2.4:resources (default-resources) @ openmrs-api ---
  134. [INFO] Using 'UTF-8' encoding to copy filtered resources.
  135. [INFO] Copying 1 resource
  136. [INFO] Copying 133 resources
  137. [INFO]
  138. [INFO] --- maven-compiler-plugin:2.1:compile (default-compile) @ openmrs-api ---
  139. [INFO] Compiling 696 source files to /home/irynah/Openmrs-Projects/trunk-5499/openmrs-core/api/target/classes
  140. [INFO] -------------------------------------------------------------
  141. [ERROR] COMPILATION ERROR :
  142. [INFO] -------------------------------------------------------------
  143. [ERROR] /home/irynah/Openmrs-Projects/trunk-5499/openmrs-core/api/src/main/java/org/openmrs/api/db/hibernate/search/TermsFilterFactory.java:[26,39] error: cannot find symbol
  144.  
  145. [ERROR] package org.hibernate.search.filter.impl
  146. /home/irynah/Openmrs-Projects/trunk-5499/openmrs-core/api/src/main/java/org/openmrs/api/db/hibernate/search/TermsFilterFactory.java:[75,13] error: cannot find symbol
  147.  
  148. [ERROR] class TermsFilterFactory
  149. /home/irynah/Openmrs-Projects/trunk-5499/openmrs-core/api/src/main/java/org/openmrs/api/db/hibernate/search/LuceneQuery.java:[302,7] error: cannot access QueryImplementor
  150.  
  151. [ERROR] class file for org.hibernate.query.spi.QueryImplementor not found
  152. /home/irynah/Openmrs-Projects/trunk-5499/openmrs-core/api/src/main/java/org/openmrs/api/db/hibernate/search/LuceneQuery.java:[303,34] error: cannot find symbol
  153.  
  154. [ERROR] variable query of type FullTextQuery
  155. /home/irynah/Openmrs-Projects/trunk-5499/openmrs-core/api/src/main/java/org/openmrs/api/db/hibernate/search/LuceneQuery.java:[338,29] error: cannot find symbol
  156.  
  157. [ERROR] interface FullTextQuery
  158. /home/irynah/Openmrs-Projects/trunk-5499/openmrs-core/api/src/main/java/org/openmrs/api/db/hibernate/search/LuceneQuery.java:[350,29] error: cannot find symbol
  159.  
  160. [ERROR] interface FullTextQuery
  161. /home/irynah/Openmrs-Projects/trunk-5499/openmrs-core/api/src/main/java/org/openmrs/api/db/hibernate/search/LuceneQuery.java:[365,30] error: cannot find symbol
  162.  
  163. [ERROR] variable fullTextQuery of type FullTextQuery
  164. /home/irynah/Openmrs-Projects/trunk-5499/openmrs-core/api/src/main/java/org/openmrs/api/db/hibernate/search/LuceneQuery.java:[392,37] error: cannot find symbol
  165.  
  166. [ERROR] variable fullTextQuery of type FullTextQuery
  167. /home/irynah/Openmrs-Projects/trunk-5499/openmrs-core/api/src/main/java/org/openmrs/api/db/hibernate/search/LuceneQuery.java:[408,37] error: cannot find symbol
  168.  
  169. [ERROR] variable fullTextQuery of type FullTextQuery
  170. /home/irynah/Openmrs-Projects/trunk-5499/openmrs-core/api/src/main/java/org/openmrs/api/db/hibernate/HibernateContextDAO.java:[472,31] error: reference to getFlushMode is ambiguous
  171.  
  172. [ERROR] both method getFlushMode() in EntityManager and method getFlushMode() in Session match
  173. /home/irynah/Openmrs-Projects/trunk-5499/openmrs-core/api/src/main/java/org/openmrs/api/db/hibernate/HibernateContextDAO.java:[472,44] error: incompatible types: FlushModeType cannot be converted to FlushMode
  174.  
  175. [INFO] 11 errors
  176. [INFO] -------------------------------------------------------------
  177. [INFO] ------------------------------------------------------------------------
  178. [INFO] Reactor Summary for OpenMRS 2.3.0-SNAPSHOT:
  179. [INFO]
  180. [INFO] OpenMRS ............................................ SUCCESS [ 4.422 s]
  181. [INFO] openmrs-tools ...................................... SUCCESS [ 1.298 s]
  182. [INFO] openmrs-test ....................................... SUCCESS [ 0.285 s]
  183. [INFO] openmrs-api ........................................ FAILURE [ 16.320 s]
  184. [INFO] openmrs-web ........................................ SKIPPED
  185. [INFO] openmrs-webapp ..................................... SKIPPED
  186. [INFO] ------------------------------------------------------------------------
  187. [INFO] BUILD FAILURE
  188. [INFO] ------------------------------------------------------------------------
  189. [INFO] Total time: 23.295 s
  190. [INFO] Finished at: 2019-06-05T15:30:47+03:00
  191. [INFO] ------------------------------------------------------------------------
  192. [ERROR] Failed to execute goal org.apache.maven.plugins:maven-compiler-plugin:2.1:compile (default-compile) on project openmrs-api: Compilation failure: Compilation failure:
  193. [ERROR] /home/irynah/Openmrs-Projects/trunk-5499/openmrs-core/api/src/main/java/org/openmrs/api/db/hibernate/search/TermsFilterFactory.java:[26,39] error: cannot find symbol
  194. [ERROR]
  195. [ERROR] package org.hibernate.search.filter.impl
  196. [ERROR] /home/irynah/Openmrs-Projects/trunk-5499/openmrs-core/api/src/main/java/org/openmrs/api/db/hibernate/search/TermsFilterFactory.java:[75,13] error: cannot find symbol
  197. [ERROR]
  198. [ERROR] class TermsFilterFactory
  199. [ERROR] /home/irynah/Openmrs-Projects/trunk-5499/openmrs-core/api/src/main/java/org/openmrs/api/db/hibernate/search/LuceneQuery.java:[302,7] error: cannot access QueryImplementor
  200. [ERROR]
  201. [ERROR] class file for org.hibernate.query.spi.QueryImplementor not found
  202. [ERROR] /home/irynah/Openmrs-Projects/trunk-5499/openmrs-core/api/src/main/java/org/openmrs/api/db/hibernate/search/LuceneQuery.java:[303,34] error: cannot find symbol
  203. [ERROR]
  204. [ERROR] variable query of type FullTextQuery
  205. [ERROR] /home/irynah/Openmrs-Projects/trunk-5499/openmrs-core/api/src/main/java/org/openmrs/api/db/hibernate/search/LuceneQuery.java:[338,29] error: cannot find symbol
  206. [ERROR]
  207. [ERROR] interface FullTextQuery
  208. [ERROR] /home/irynah/Openmrs-Projects/trunk-5499/openmrs-core/api/src/main/java/org/openmrs/api/db/hibernate/search/LuceneQuery.java:[350,29] error: cannot find symbol
  209. [ERROR]
  210. [ERROR] interface FullTextQuery
  211. [ERROR] /home/irynah/Openmrs-Projects/trunk-5499/openmrs-core/api/src/main/java/org/openmrs/api/db/hibernate/search/LuceneQuery.java:[365,30] error: cannot find symbol
  212. [ERROR]
  213. [ERROR] variable fullTextQuery of type FullTextQuery
  214. [ERROR] /home/irynah/Openmrs-Projects/trunk-5499/openmrs-core/api/src/main/java/org/openmrs/api/db/hibernate/search/LuceneQuery.java:[392,37] error: cannot find symbol
  215. [ERROR]
  216. [ERROR] variable fullTextQuery of type FullTextQuery
  217. [ERROR] /home/irynah/Openmrs-Projects/trunk-5499/openmrs-core/api/src/main/java/org/openmrs/api/db/hibernate/search/LuceneQuery.java:[408,37] error: cannot find symbol
  218. [ERROR]
  219. [ERROR] variable fullTextQuery of type FullTextQuery
  220. [ERROR] /home/irynah/Openmrs-Projects/trunk-5499/openmrs-core/api/src/main/java/org/openmrs/api/db/hibernate/HibernateContextDAO.java:[472,31] error: reference to getFlushMode is ambiguous
  221. [ERROR]
  222. [ERROR] both method getFlushMode() in EntityManager and method getFlushMode() in Session match
  223. [ERROR] /home/irynah/Openmrs-Projects/trunk-5499/openmrs-core/api/src/main/java/org/openmrs/api/db/hibernate/HibernateContextDAO.java:[472,44] error: incompatible types: FlushModeType cannot be converted to FlushMode
  224. [ERROR] -> [Help 1]
  225. org.apache.maven.lifecycle.LifecycleExecutionException: Failed to execute goal org.apache.maven.plugins:maven-compiler-plugin:2.1:compile (default-compile) on project openmrs-api: Compilation failure
  226. at org.apache.maven.lifecycle.internal.MojoExecutor.execute (MojoExecutor.java:215)
  227. at org.apache.maven.lifecycle.internal.MojoExecutor.execute (MojoExecutor.java:156)
  228. at org.apache.maven.lifecycle.internal.MojoExecutor.execute (MojoExecutor.java:148)
  229. at org.apache.maven.lifecycle.internal.LifecycleModuleBuilder.buildProject (LifecycleModuleBuilder.java:117)
  230. at org.apache.maven.lifecycle.internal.LifecycleModuleBuilder.buildProject (LifecycleModuleBuilder.java:81)
  231. at org.apache.maven.lifecycle.internal.builder.singlethreaded.SingleThreadedBuilder.build (SingleThreadedBuilder.java:56)
  232. at org.apache.maven.lifecycle.internal.LifecycleStarter.execute (LifecycleStarter.java:128)
  233. at org.apache.maven.DefaultMaven.doExecute (DefaultMaven.java:305)
  234. at org.apache.maven.DefaultMaven.doExecute (DefaultMaven.java:192)
  235. at org.apache.maven.DefaultMaven.execute (DefaultMaven.java:105)
  236. at org.apache.maven.cli.MavenCli.execute (MavenCli.java:956)
  237. at org.apache.maven.cli.MavenCli.doMain (MavenCli.java:288)
  238. at org.apache.maven.cli.MavenCli.main (MavenCli.java:192)
  239. at sun.reflect.NativeMethodAccessorImpl.invoke0 (Native Method)
  240. at sun.reflect.NativeMethodAccessorImpl.invoke (NativeMethodAccessorImpl.java:62)
  241. at sun.reflect.DelegatingMethodAccessorImpl.invoke (DelegatingMethodAccessorImpl.java:43)
  242. at java.lang.reflect.Method.invoke (Method.java:498)
  243. at org.codehaus.plexus.classworlds.launcher.Launcher.launchEnhanced (Launcher.java:289)
  244. at org.codehaus.plexus.classworlds.launcher.Launcher.launch (Launcher.java:229)
  245. at org.codehaus.plexus.classworlds.launcher.Launcher.mainWithExitCode (Launcher.java:415)
  246. at org.codehaus.plexus.classworlds.launcher.Launcher.main (Launcher.java:356)
  247. Caused by: org.apache.maven.plugin.CompilationFailureException: Compilation failure
  248. at org.apache.maven.plugin.AbstractCompilerMojo.execute (AbstractCompilerMojo.java:613)
  249. at org.apache.maven.plugin.CompilerMojo.execute (CompilerMojo.java:116)
  250. at org.apache.maven.plugin.DefaultBuildPluginManager.executeMojo (DefaultBuildPluginManager.java:137)
  251. at org.apache.maven.lifecycle.internal.MojoExecutor.execute (MojoExecutor.java:210)
  252. at org.apache.maven.lifecycle.internal.MojoExecutor.execute (MojoExecutor.java:156)
  253. at org.apache.maven.lifecycle.internal.MojoExecutor.execute (MojoExecutor.java:148)
  254. at org.apache.maven.lifecycle.internal.LifecycleModuleBuilder.buildProject (LifecycleModuleBuilder.java:117)
  255. at org.apache.maven.lifecycle.internal.LifecycleModuleBuilder.buildProject (LifecycleModuleBuilder.java:81)
  256. at org.apache.maven.lifecycle.internal.builder.singlethreaded.SingleThreadedBuilder.build (SingleThreadedBuilder.java:56)
  257. at org.apache.maven.lifecycle.internal.LifecycleStarter.execute (LifecycleStarter.java:128)
  258. at org.apache.maven.DefaultMaven.doExecute (DefaultMaven.java:305)
  259. at org.apache.maven.DefaultMaven.doExecute (DefaultMaven.java:192)
  260. at org.apache.maven.DefaultMaven.execute (DefaultMaven.java:105)
  261. at org.apache.maven.cli.MavenCli.execute (MavenCli.java:956)
  262. at org.apache.maven.cli.MavenCli.doMain (MavenCli.java:288)
  263. at org.apache.maven.cli.MavenCli.main (MavenCli.java:192)
  264. at sun.reflect.NativeMethodAccessorImpl.invoke0 (Native Method)
  265. at sun.reflect.NativeMethodAccessorImpl.invoke (NativeMethodAccessorImpl.java:62)
  266. at sun.reflect.DelegatingMethodAccessorImpl.invoke (DelegatingMethodAccessorImpl.java:43)
  267. at java.lang.reflect.Method.invoke (Method.java:498)
  268. at org.codehaus.plexus.classworlds.launcher.Launcher.launchEnhanced (Launcher.java:289)
  269. at org.codehaus.plexus.classworlds.launcher.Launcher.launch (Launcher.java:229)
  270. at org.codehaus.plexus.classworlds.launcher.Launcher.mainWithExitCode (Launcher.java:415)
  271. at org.codehaus.plexus.classworlds.launcher.Launcher.main (Launcher.java:356)
  272. [ERROR]
  273. [ERROR] Re-run Maven using the -X switch to enable full debug logging.
  274. [ERROR]
  275. [ERROR] For more information about the errors and possible solutions, please read the following articles:
  276. [ERROR] [Help 1] http://cwiki.apache.org/confluence/display/MAVEN/MojoFailureException
  277. [ERROR]
  278. [ERROR] After correcting the problems, you can resume the build with the command
  279. [ERROR] mvn <goals> -rf :openmrs-api
  280. irynah@irynah-Vostro-3560:~/Openmrs-Projects/trunk-5499/openmrs-core$
Advertisement
Add Comment
Please, Sign In to add comment
Advertisement