Guest User

Untitled

a guest
Dec 2nd, 2014
191
Never
Not a member of Pastebin yet? Sign Up, it unlocks many cool features!
  1. ****************************
  2. Powered By MCP:
  3. http://mcp.ocean-labs.de/
  4. Searge, ProfMobius, Fesh0r,
  5. R4wk, ZeuX, IngisKahn, bspkrs
  6. Resolving: MCP Data version : {MCP_VERSION}
  7. Resolved: MCP Data version : unknown
  8. MCP Data version : unknown
  9. ****************************
  10. Resolving: net.minecraftforge:{API_NAME}:{API_VERSION}
  11. Resolved: net.minecraftforge:forge:1.7.10-10.13.2.1240
  12. Resolving: {USER_DEV}/dev.json
  13. Resolved: C:/Users/Sullivan/.gradle/caches/minecraft/net/minecraftforge/forge/1.7.10-10.13.2.1240/unpacked/dev.json
  14. Resolving: {USER_DEV}/dev.json
  15. Resolved: C:/Users/Sullivan/.gradle/caches/minecraft/net/minecraftforge/forge/1.7.10-10.13.2.1240/unpacked/dev.json
  16. Resolving: {CACHE_DIR}/minecraft/versionJsons
  17. Resolved: C:/Users/Sullivan/.gradle/caches/minecraft/versionJsons
  18. Resolving: {BUILD_DIR}/tmp/recompCls
  19. Resolved: C:/Users/Sullivan/Desktop/mod minefus/build/tmp/recompCls
  20. Resolving: {API_CACHE_DIR}/{MAPPING_CHANNEL}/{MAPPING_VERSION}//forgeSrc-{API_VERSION}.jar
  21. Resolved: C:/Users/Sullivan/.gradle/caches/minecraft/net/minecraftforge/forge/1.7.10-10.13.2.1240////forgeSrc-1.7.10-10.13.2.1240.jar
  22. Resolving: {API_CACHE_DIR}/{MAPPING_CHANNEL}/{MAPPING_VERSION}//this-{API_VERSION}-doesnt.matter
  23. Resolved: C:/Users/Sullivan/.gradle/caches/minecraft/net/minecraftforge/forge/1.7.10-10.13.2.1240////this-1.7.10-10.13.2.1240-doesnt.matter
  24. Adding repo to : >> C:\Users\Sullivan\.gradle\caches\minecraft\net\minecraftforge\forge\1.7.10-10.13.2.1240
  25. Resolving: {API_CACHE_DIR}/{MAPPING_CHANNEL}/{MAPPING_VERSION}//forgeSrc-{API_VERSION}-sources.jar
  26. Resolved: C:/Users/Sullivan/.gradle/caches/minecraft/net/minecraftforge/forge/1.7.10-10.13.2.1240////forgeSrc-1.7.10-10.13.2.1240-sources.jar
  27. Resolving: {CACHE_DIR}/minecraft/assets/indexes/1.7.10.json
  28. Resolved: C:/Users/Sullivan/.gradle/caches/minecraft/assets/indexes/1.7.10.json
  29. Resolving: {CACHE_DIR}/minecraft/assets/indexes/{ASSET_INDEX}.json
  30. Resolved: C:/Users/Sullivan/.gradle/caches/minecraft/assets/indexes/1.7.10.json
  31. All projects evaluated.
  32. Resolving: {API_CACHE_DIR}/start
  33. Resolved: C:/Users/Sullivan/.gradle/caches/minecraft/net/minecraftforge/forge/1.7.10-10.13.2.1240/start
  34. Resolving: {BUILD_DIR}/sources/java
  35. Resolved: C:/Users/Sullivan/Desktop/mod minefus/build/sources/java
  36. Resolving: {SRG_DIR}/mcp-srg.srg
  37. Resolved: C:/Users/Sullivan/.gradle/caches/minecraft/net/minecraftforge/forge/1.7.10-10.13.2.1240///srgs/mcp-srg.srg
  38. Resolving: {MCP_DATA_DIR}/methods.csv
  39. Resolved: C:/Users/Sullivan/.gradle/caches/minecraft/net/minecraftforge/forge/1.7.10-10.13.2.1240/unpacked/conf/methods.csv
  40. Resolving: {API_CACHE_DIR}/{API_NAME}-{API_VERSION}-srg.jar
  41. Resolved: C:/Users/Sullivan/.gradle/caches/minecraft/net/minecraftforge/forge/1.7.10-10.13.2.1240/forge-1.7.10-10.13.2.1240-srg.jar
  42. Resolving: {API_CACHE_DIR}/{MAPPING_CHANNEL}/{MAPPING_VERSION}//forgeSrc-{API_VERSION}.jar
  43. Resolved: C:/Users/Sullivan/.gradle/caches/minecraft/net/minecraftforge/forge/1.7.10-10.13.2.1240////forgeSrc-1.7.10-10.13.2.1240.jar
  44. Resolving: {SRG_DIR}/srg.exc
  45. Resolved: C:/Users/Sullivan/.gradle/caches/minecraft/net/minecraftforge/forge/1.7.10-10.13.2.1240///srgs/srg.exc
  46. Resolving: {USER_DEV}/conf/packaged.srg
  47. Resolved: C:/Users/Sullivan/.gradle/caches/minecraft/net/minecraftforge/forge/1.7.10-10.13.2.1240/unpacked/conf/packaged.srg
  48. Resolving: {USER_DEV}/conf/packaged.exc
  49. Resolved: C:/Users/Sullivan/.gradle/caches/minecraft/net/minecraftforge/forge/1.7.10-10.13.2.1240/unpacked/conf/packaged.exc
  50. Resolving: {MCP_DATA_DIR}/methods.csv
  51. Resolved: C:/Users/Sullivan/.gradle/caches/minecraft/net/minecraftforge/forge/1.7.10-10.13.2.1240/unpacked/conf/methods.csv
  52. Resolving: {MCP_DATA_DIR}/fields.csv
  53. Resolved: C:/Users/Sullivan/.gradle/caches/minecraft/net/minecraftforge/forge/1.7.10-10.13.2.1240/unpacked/conf/fields.csv
  54. Selected primary task 'DefaultTaskParameter{taskName='build',projectPath='null'}'
  55. Tasks to be executed: [task ':compileApiJava', task ':processApiResources', task ':apiClasses', task ':sourceMainJava', task ':compileJava', task ':processResources', task ':classes', task ':jar', task ':compileTestJava', task ':processTestResources', task ':testClasses', task ':test', task ':extractMcpData', task ':getVersionJson', task ':extractUserDev', task ':genSrgs', task ':reobf', task ':assemble', task ':check', task ':build']
  56. :compileApiJava (Thread[main,5,main]) started.
  57. :compileApiJava
  58. Skipping task ':compileApiJava' as it has no source files.
  59. :compileApiJava UP-TO-DATE
  60. :compileApiJava (Thread[main,5,main]) completed. Took 0.062 secs.
  61. :processApiResources (Thread[main,5,main]) started.
  62. :processApiResources
  63. Skipping task ':processApiResources' as it has no source files.
  64. :processApiResources UP-TO-DATE
  65. :processApiResources (Thread[main,5,main]) completed. Took 0.033 secs.
  66. :apiClasses (Thread[main,5,main]) started.
  67. :apiClasses
  68. Skipping task ':apiClasses' as it has no actions.
  69. :apiClasses UP-TO-DATE
  70. :apiClasses (Thread[main,5,main]) completed. Took 0.028 secs.
  71. :sourceMainJava (Thread[main,5,main]) started.
  72. :sourceMainJava
  73. Skipping task ':sourceMainJava' as it is up-to-date (took 0.384 secs).
  74. :sourceMainJava UP-TO-DATE
  75. :sourceMainJava (Thread[main,5,main]) completed. Took 0.413 secs.
  76. :compileJava (Thread[main,5,main]) started.
  77. :compileJava
  78. Failed to get resource: GET. [HTTP HTTP/1.1 403 Forbidden: https://libraries.minecraft.net//forgeSrc/1.7.10-10.13.2.1240/forgeSrc-1.7.10-10.13.2.1240.pom]
  79. Failed to get resource: GET. [HTTP HTTP/1.1 403 Forbidden: https://libraries.minecraft.net/org/scala-lang/scala-parser-combinators_2.11/1.0.1/scala-parser-combinators_2.11-1.0.1.pom]
  80. Failed to get resource: GET. [HTTP HTTP/1.1 403 Forbidden: https://libraries.minecraft.net/org/scala-lang/scala-swing_2.11/1.0.1/scala-swing_2.11-1.0.1.pom]
  81. Failed to get resource: GET. [HTTP HTTP/1.1 403 Forbidden: https://libraries.minecraft.net/org/scala-lang/scala-xml_2.11/1.0.2/scala-xml_2.11-1.0.2.pom]
  82. file or directory 'C:\Users\Sullivan\Desktop\mod minefus\libs', not found
  83. Skipping task ':compileJava' as it is up-to-date (took 1.996 secs).
  84. :compileJava UP-TO-DATE
  85. :compileJava (Thread[main,5,main]) completed. Took 2.017 secs.
  86. :processResources (Thread[main,5,main]) started.
  87. :processResources
  88. Skipping task ':processResources' as it is up-to-date (took 0.183 secs).
  89. :processResources UP-TO-DATE
  90. :processResources (Thread[main,5,main]) completed. Took 0.207 secs.
  91. :classes (Thread[main,5,main]) started.
  92. :classes
  93. Skipping task ':classes' as it has no actions.
  94. :classes UP-TO-DATE
  95. :classes (Thread[main,5,main]) completed. Took 0.014 secs.
  96. :jar (Thread[main,5,main]) started.
  97. :jar
  98. Skipping task ':jar' as it is up-to-date (took 0.126 secs).
  99. :jar UP-TO-DATE
  100. :jar (Thread[main,5,main]) completed. Took 0.144 secs.
  101. :compileTestJava (Thread[main,5,main]) started.
  102. :compileTestJava
  103. Skipping task ':compileTestJava' as it has no source files.
  104. :compileTestJava UP-TO-DATE
  105. :compileTestJava (Thread[main,5,main]) completed. Took 0.02 secs.
  106. :processTestResources (Thread[main,5,main]) started.
  107. :processTestResources
  108. Skipping task ':processTestResources' as it has no source files.
  109. :processTestResources UP-TO-DATE
  110. :processTestResources (Thread[main,5,main]) completed. Took 0.011 secs.
  111. :testClasses (Thread[main,5,main]) started.
  112. :testClasses
  113. Skipping task ':testClasses' as it has no actions.
  114. :testClasses UP-TO-DATE
  115. :testClasses (Thread[main,5,main]) completed. Took 0.011 secs.
  116. :test (Thread[main,5,main]) started.
  117. :test
  118. file or directory 'C:\Users\Sullivan\Desktop\mod minefus\build\classes\test', not found
  119. Skipping task ':test' as it has no source files.
  120. :test UP-TO-DATE
  121. :test (Thread[main,5,main]) completed. Took 0.02 secs.
  122. :extractMcpData (Thread[main,5,main]) started.
  123. :extractMcpData
  124. Resolving: {CACHE_DIR}/minecraft/de/oceanlabs/mcp/mcp_{MAPPING_CHANNEL}/{MAPPING_VERSION}/
  125. Resolved: C:/Users/Sullivan/.gradle/caches/minecraft/de/oceanlabs/mcp/mcp_//
  126. Skipping task ':extractMcpData' as it is up-to-date (took 0.006 secs).
  127. :extractMcpData UP-TO-DATE
  128. :extractMcpData (Thread[main,5,main]) completed. Took 0.028 secs.
  129. :getVersionJson (Thread[main,5,main]) started.
  130. :getVersionJson
  131. Executing task ':getVersionJson' (up-to-date check took 0.001 secs) due to:
  132. Task has not declared any outputs.
  133. Resolving: http://s3.amazonaws.com/Minecraft.Download/versions/{MC_VERSION}/{MC_VERSION}.json
  134. Resolved: http://s3.amazonaws.com/Minecraft.Download/versions/1.7.10/1.7.10.json
  135. Resolving: {CACHE_DIR}/minecraft/versionJsons/{MC_VERSION}.json
  136. Resolved: C:/Users/Sullivan/.gradle/caches/minecraft/versionJsons/1.7.10.json
  137. Resolving: {CACHE_DIR}/minecraft/versionJsons/{MC_VERSION}.json
  138. Resolved: C:/Users/Sullivan/.gradle/caches/minecraft/versionJsons/1.7.10.json
  139. :getVersionJson (Thread[main,5,main]) completed. Took 0.405 secs.
  140. :extractUserDev (Thread[main,5,main]) started.
  141. :extractUserDev
  142. Resolving: {USER_DEV}
  143. Resolved: C:/Users/Sullivan/.gradle/caches/minecraft/net/minecraftforge/forge/1.7.10-10.13.2.1240/unpacked
  144. Resource missing. [HTTP GET: http://repo1.maven.org/maven2/net/minecraftforge/forge/1.7.10-10.13.2.1240/forge-1.7.10-10.13.2.1240.pom]
  145. Resource missing. [HTTP HEAD: http://repo1.maven.org/maven2/net/minecraftforge/forge/1.7.10-10.13.2.1240/forge-1.7.10-10.13.2.1240-userdev.jar]
  146. Failed to get resource: GET. [HTTP HTTP/1.1 403 Forbidden: https://libraries.minecraft.net/net/minecraftforge/forge/1.7.10-10.13.2.1240/forge-1.7.10-10.13.2.1240.pom]
  147. Skipping task ':extractUserDev' as it is up-to-date (took 1.681 secs).
  148. :extractUserDev UP-TO-DATE
  149. :extractUserDev (Thread[main,5,main]) completed. Took 1.727 secs.
  150. :genSrgs (Thread[main,5,main]) started.
  151. :genSrgs
  152. Resolving: {SRG_DIR}/notch-srg.srg
  153. Resolved: C:/Users/Sullivan/.gradle/caches/minecraft/net/minecraftforge/forge/1.7.10-10.13.2.1240///srgs/notch-srg.srg
  154. 78924036cb2f21a309bc0c30e5510c89 C:\Users\Sullivan\.gradle\caches\minecraft\net\minecraftforge\forge\1.7.10-10.13.2.1240\unpacked\conf\packaged.srg
  155. 60a11a3393708238502b56047a389563 C:\Users\Sullivan\.gradle\caches\minecraft\net\minecraftforge\forge\1.7.10-10.13.2.1240\unpacked\conf\packaged.exc
  156. 30c3b9785c179d62f576a44fde7b3964 C:\Users\Sullivan\.gradle\caches\minecraft\net\minecraftforge\forge\1.7.10-10.13.2.1240\unpacked\conf\methods.csv
  157. 82a1b606bd90887f5aac4888ec4584a6 C:\Users\Sullivan\.gradle\caches\minecraft\net\minecraftforge\forge\1.7.10-10.13.2.1240\unpacked\conf\fields.csv
  158. Checksums found: 0b289600a3213f0bbaeb7869a6d21295
  159. 78924036cb2f21a309bc0c30e5510c89
  160. 60a11a3393708238502b56047a389563
  161. 30c3b9785c179d62f576a44fde7b3964
  162. 82a1b606bd90887f5aac4888ec4584a6
  163. Checksums calculated: 0b289600a3213f0bbaeb7869a6d21295
  164. 78924036cb2f21a309bc0c30e5510c89
  165. 60a11a3393708238502b56047a389563
  166. 30c3b9785c179d62f576a44fde7b3964
  167. 82a1b606bd90887f5aac4888ec4584a6
  168. Resolving: {SRG_DIR}/notch-mcp.srg
  169. Resolved: C:/Users/Sullivan/.gradle/caches/minecraft/net/minecraftforge/forge/1.7.10-10.13.2.1240///srgs/notch-mcp.srg
  170. 78924036cb2f21a309bc0c30e5510c89 C:\Users\Sullivan\.gradle\caches\minecraft\net\minecraftforge\forge\1.7.10-10.13.2.1240\unpacked\conf\packaged.srg
  171. 60a11a3393708238502b56047a389563 C:\Users\Sullivan\.gradle\caches\minecraft\net\minecraftforge\forge\1.7.10-10.13.2.1240\unpacked\conf\packaged.exc
  172. 30c3b9785c179d62f576a44fde7b3964 C:\Users\Sullivan\.gradle\caches\minecraft\net\minecraftforge\forge\1.7.10-10.13.2.1240\unpacked\conf\methods.csv
  173. 82a1b606bd90887f5aac4888ec4584a6 C:\Users\Sullivan\.gradle\caches\minecraft\net\minecraftforge\forge\1.7.10-10.13.2.1240\unpacked\conf\fields.csv
  174. Checksums found: f52a430a4c5585196ad34117c1c3e7fd
  175. 78924036cb2f21a309bc0c30e5510c89
  176. 60a11a3393708238502b56047a389563
  177. 30c3b9785c179d62f576a44fde7b3964
  178. 82a1b606bd90887f5aac4888ec4584a6
  179. Checksums calculated: f52a430a4c5585196ad34117c1c3e7fd
  180. 78924036cb2f21a309bc0c30e5510c89
  181. 60a11a3393708238502b56047a389563
  182. 30c3b9785c179d62f576a44fde7b3964
  183. 82a1b606bd90887f5aac4888ec4584a6
  184. Resolving: {SRG_DIR}/mcp-notch.srg
  185. Resolved: C:/Users/Sullivan/.gradle/caches/minecraft/net/minecraftforge/forge/1.7.10-10.13.2.1240///srgs/mcp-notch.srg
  186. 78924036cb2f21a309bc0c30e5510c89 C:\Users\Sullivan\.gradle\caches\minecraft\net\minecraftforge\forge\1.7.10-10.13.2.1240\unpacked\conf\packaged.srg
  187. 60a11a3393708238502b56047a389563 C:\Users\Sullivan\.gradle\caches\minecraft\net\minecraftforge\forge\1.7.10-10.13.2.1240\unpacked\conf\packaged.exc
  188. 30c3b9785c179d62f576a44fde7b3964 C:\Users\Sullivan\.gradle\caches\minecraft\net\minecraftforge\forge\1.7.10-10.13.2.1240\unpacked\conf\methods.csv
  189. 82a1b606bd90887f5aac4888ec4584a6 C:\Users\Sullivan\.gradle\caches\minecraft\net\minecraftforge\forge\1.7.10-10.13.2.1240\unpacked\conf\fields.csv
  190. Checksums found: 6c14054d55b512e6d6f207412f240963
  191. 78924036cb2f21a309bc0c30e5510c89
  192. 60a11a3393708238502b56047a389563
  193. 30c3b9785c179d62f576a44fde7b3964
  194. 82a1b606bd90887f5aac4888ec4584a6
  195. Checksums calculated: 6c14054d55b512e6d6f207412f240963
  196. 78924036cb2f21a309bc0c30e5510c89
  197. 60a11a3393708238502b56047a389563
  198. 30c3b9785c179d62f576a44fde7b3964
  199. 82a1b606bd90887f5aac4888ec4584a6
  200. Resolving: {SRG_DIR}/mcp-srg.srg
  201. Resolved: C:/Users/Sullivan/.gradle/caches/minecraft/net/minecraftforge/forge/1.7.10-10.13.2.1240///srgs/mcp-srg.srg
  202. 78924036cb2f21a309bc0c30e5510c89 C:\Users\Sullivan\.gradle\caches\minecraft\net\minecraftforge\forge\1.7.10-10.13.2.1240\unpacked\conf\packaged.srg
  203. 60a11a3393708238502b56047a389563 C:\Users\Sullivan\.gradle\caches\minecraft\net\minecraftforge\forge\1.7.10-10.13.2.1240\unpacked\conf\packaged.exc
  204. 30c3b9785c179d62f576a44fde7b3964 C:\Users\Sullivan\.gradle\caches\minecraft\net\minecraftforge\forge\1.7.10-10.13.2.1240\unpacked\conf\methods.csv
  205. 82a1b606bd90887f5aac4888ec4584a6 C:\Users\Sullivan\.gradle\caches\minecraft\net\minecraftforge\forge\1.7.10-10.13.2.1240\unpacked\conf\fields.csv
  206. Checksums found: f5f41c3e1d575ad4d4a8d370eb5d8674
  207. 78924036cb2f21a309bc0c30e5510c89
  208. 60a11a3393708238502b56047a389563
  209. 30c3b9785c179d62f576a44fde7b3964
  210. 82a1b606bd90887f5aac4888ec4584a6
  211. Checksums calculated: f5f41c3e1d575ad4d4a8d370eb5d8674
  212. 78924036cb2f21a309bc0c30e5510c89
  213. 60a11a3393708238502b56047a389563
  214. 30c3b9785c179d62f576a44fde7b3964
  215. 82a1b606bd90887f5aac4888ec4584a6
  216. Resolving: {SRG_DIR}/srg.exc
  217. Resolved: C:/Users/Sullivan/.gradle/caches/minecraft/net/minecraftforge/forge/1.7.10-10.13.2.1240///srgs/srg.exc
  218. 78924036cb2f21a309bc0c30e5510c89 C:\Users\Sullivan\.gradle\caches\minecraft\net\minecraftforge\forge\1.7.10-10.13.2.1240\unpacked\conf\packaged.srg
  219. 60a11a3393708238502b56047a389563 C:\Users\Sullivan\.gradle\caches\minecraft\net\minecraftforge\forge\1.7.10-10.13.2.1240\unpacked\conf\packaged.exc
  220. 30c3b9785c179d62f576a44fde7b3964 C:\Users\Sullivan\.gradle\caches\minecraft\net\minecraftforge\forge\1.7.10-10.13.2.1240\unpacked\conf\methods.csv
  221. 82a1b606bd90887f5aac4888ec4584a6 C:\Users\Sullivan\.gradle\caches\minecraft\net\minecraftforge\forge\1.7.10-10.13.2.1240\unpacked\conf\fields.csv
  222. Checksums found: b9d108bab4d4143c454a8a65ab061154
  223. 78924036cb2f21a309bc0c30e5510c89
  224. 60a11a3393708238502b56047a389563
  225. 30c3b9785c179d62f576a44fde7b3964
  226. 82a1b606bd90887f5aac4888ec4584a6
  227. Checksums calculated: b9d108bab4d4143c454a8a65ab061154
  228. 78924036cb2f21a309bc0c30e5510c89
  229. 60a11a3393708238502b56047a389563
  230. 30c3b9785c179d62f576a44fde7b3964
  231. 82a1b606bd90887f5aac4888ec4584a6
  232. Resolving: {SRG_DIR}/mcp.exc
  233. Resolved: C:/Users/Sullivan/.gradle/caches/minecraft/net/minecraftforge/forge/1.7.10-10.13.2.1240///srgs/mcp.exc
  234. 78924036cb2f21a309bc0c30e5510c89 C:\Users\Sullivan\.gradle\caches\minecraft\net\minecraftforge\forge\1.7.10-10.13.2.1240\unpacked\conf\packaged.srg
  235. 60a11a3393708238502b56047a389563 C:\Users\Sullivan\.gradle\caches\minecraft\net\minecraftforge\forge\1.7.10-10.13.2.1240\unpacked\conf\packaged.exc
  236. 30c3b9785c179d62f576a44fde7b3964 C:\Users\Sullivan\.gradle\caches\minecraft\net\minecraftforge\forge\1.7.10-10.13.2.1240\unpacked\conf\methods.csv
  237. 82a1b606bd90887f5aac4888ec4584a6 C:\Users\Sullivan\.gradle\caches\minecraft\net\minecraftforge\forge\1.7.10-10.13.2.1240\unpacked\conf\fields.csv
  238. Checksums found: 6182b2b7b25fe07e181cb690415a9337
  239. 78924036cb2f21a309bc0c30e5510c89
  240. 60a11a3393708238502b56047a389563
  241. 30c3b9785c179d62f576a44fde7b3964
  242. 82a1b606bd90887f5aac4888ec4584a6
  243. Checksums calculated: 6182b2b7b25fe07e181cb690415a9337
  244. 78924036cb2f21a309bc0c30e5510c89
  245. 60a11a3393708238502b56047a389563
  246. 30c3b9785c179d62f576a44fde7b3964
  247. 82a1b606bd90887f5aac4888ec4584a6
  248. Skipping task ':genSrgs' as task onlyIf is false.
  249. :genSrgs SKIPPED
  250. :genSrgs (Thread[main,5,main]) completed. Took 0.718 secs.
  251. :reobf (Thread[main,5,main]) started.
  252. :reobf
  253. Executing task ':reobf' (up-to-date check took 0.005 secs) due to:
  254. No history is available.
  255. :reobf FAILED
  256. :reobf (Thread[main,5,main]) completed. Took 1.351 secs.
  257.  
  258. FAILURE: Build failed with an exception.
  259.  
  260. * What went wrong:
  261. Execution failed for task ':reobf'.
  262. > MALFORMED
  263.  
  264. * Try:
  265. Run with --debug option to get more log output.
  266.  
  267. * Exception is:
  268. org.gradle.api.tasks.TaskExecutionException: Execution failed for task ':reobf'.
  269. at org.gradle.api.internal.tasks.execution.ExecuteActionsTaskExecuter.executeActions(ExecuteActionsTaskExecuter.java:69)
  270. at org.gradle.api.internal.tasks.execution.ExecuteActionsTaskExecuter.execute(ExecuteActionsTaskExecuter.java:46)
  271. at org.gradle.api.internal.tasks.execution.PostExecutionAnalysisTaskExecuter.execute(PostExecutionAnalysisTaskExecuter.java:35)
  272. at org.gradle.api.internal.tasks.execution.SkipUpToDateTaskExecuter.execute(SkipUpToDateTaskExecuter.java:64)
  273. at org.gradle.api.internal.tasks.execution.ValidatingTaskExecuter.execute(ValidatingTaskExecuter.java:58)
  274. at org.gradle.api.internal.tasks.execution.SkipEmptySourceFilesTaskExecuter.execute(SkipEmptySourceFilesTaskExecuter.java:42)
  275. at org.gradle.api.internal.tasks.execution.SkipTaskWithNoActionsExecuter.execute(SkipTaskWithNoActionsExecuter.java:52)
  276. at org.gradle.api.internal.tasks.execution.SkipOnlyIfTaskExecuter.execute(SkipOnlyIfTaskExecuter.java:53)
  277. at org.gradle.api.internal.tasks.execution.ExecuteAtMostOnceTaskExecuter.execute(ExecuteAtMostOnceTaskExecuter.java:43)
  278. at org.gradle.api.internal.AbstractTask.executeWithoutThrowingTaskFailure(AbstractTask.java:296)
  279. at org.gradle.execution.taskgraph.AbstractTaskPlanExecutor$TaskExecutorWorker.executeTask(AbstractTaskPlanExecutor.java:79)
  280. at org.gradle.execution.taskgraph.AbstractTaskPlanExecutor$TaskExecutorWorker.processTask(AbstractTaskPlanExecutor.java:63)
  281. at org.gradle.execution.taskgraph.AbstractTaskPlanExecutor$TaskExecutorWorker.run(AbstractTaskPlanExecutor.java:51)
  282. at org.gradle.execution.taskgraph.DefaultTaskPlanExecutor.process(DefaultTaskPlanExecutor.java:23)
  283. at org.gradle.execution.taskgraph.DefaultTaskGraphExecuter.execute(DefaultTaskGraphExecuter.java:86)
  284. at org.gradle.execution.SelectedTaskExecutionAction.execute(SelectedTaskExecutionAction.java:29)
  285. at org.gradle.execution.DefaultBuildExecuter.execute(DefaultBuildExecuter.java:61)
  286. at org.gradle.execution.DefaultBuildExecuter.access$200(DefaultBuildExecuter.java:23)
  287. at org.gradle.execution.DefaultBuildExecuter$2.proceed(DefaultBuildExecuter.java:67)
  288. at org.gradle.execution.DryRunBuildExecutionAction.execute(DryRunBuildExecutionAction.java:32)
  289. at org.gradle.execution.DefaultBuildExecuter.execute(DefaultBuildExecuter.java:61)
  290. at org.gradle.execution.DefaultBuildExecuter.execute(DefaultBuildExecuter.java:54)
  291. at org.gradle.initialization.DefaultGradleLauncher.doBuildStages(DefaultGradleLauncher.java:148)
  292. at org.gradle.initialization.DefaultGradleLauncher.doBuild(DefaultGradleLauncher.java:105)
  293. at org.gradle.initialization.DefaultGradleLauncher.run(DefaultGradleLauncher.java:85)
  294. at org.gradle.launcher.exec.InProcessBuildActionExecuter$DefaultBuildController.run(InProcessBuildActionExecuter.java:81)
  295. at org.gradle.launcher.cli.ExecuteBuildAction.run(ExecuteBuildAction.java:33)
  296. at org.gradle.launcher.cli.ExecuteBuildAction.run(ExecuteBuildAction.java:24)
  297. at org.gradle.launcher.exec.InProcessBuildActionExecuter.execute(InProcessBuildActionExecuter.java:39)
  298. at org.gradle.launcher.exec.InProcessBuildActionExecuter.execute(InProcessBuildActionExecuter.java:29)
  299. at org.gradle.launcher.cli.RunBuildAction.run(RunBuildAction.java:50)
  300. at org.gradle.internal.Actions$RunnableActionAdapter.execute(Actions.java:171)
  301. at org.gradle.launcher.cli.CommandLineActionFactory$ParseAndBuildAction.execute(CommandLineActionFactory.java:237)
  302. at org.gradle.launcher.cli.CommandLineActionFactory$ParseAndBuildAction.execute(CommandLineActionFactory.java:210)
  303. at org.gradle.launcher.cli.JavaRuntimeValidationAction.execute(JavaRuntimeValidationAction.java:35)
  304. at org.gradle.launcher.cli.JavaRuntimeValidationAction.execute(JavaRuntimeValidationAction.java:24)
  305. at org.gradle.launcher.cli.CommandLineActionFactory$WithLogging.execute(CommandLineActionFactory.java:206)
  306. at org.gradle.launcher.cli.CommandLineActionFactory$WithLogging.execute(CommandLineActionFactory.java:169)
  307. at org.gradle.launcher.cli.ExceptionReportingAction.execute(ExceptionReportingAction.java:33)
  308. at org.gradle.launcher.cli.ExceptionReportingAction.execute(ExceptionReportingAction.java:22)
  309. at org.gradle.launcher.Main.doAction(Main.java:33)
  310. at org.gradle.launcher.bootstrap.EntryPoint.run(EntryPoint.java:45)
  311. at org.gradle.launcher.bootstrap.ProcessBootstrap.runNoExit(ProcessBootstrap.java:54)
  312. at org.gradle.launcher.bootstrap.ProcessBootstrap.run(ProcessBootstrap.java:35)
  313. at org.gradle.launcher.GradleMain.main(GradleMain.java:23)
  314. at org.gradle.wrapper.BootstrapMainStarter.start(BootstrapMainStarter.java:30)
  315. at org.gradle.wrapper.WrapperExecutor.execute(WrapperExecutor.java:127)
  316. at org.gradle.wrapper.GradleWrapperMain.main(GradleWrapperMain.java:56)
  317. Caused by: java.lang.IllegalArgumentException: MALFORMED
  318. at net.md_5.specialsource.Jar.collectJarFiles(Jar.java:177)
  319. at net.md_5.specialsource.Jar.init(Jar.java:237)
  320. at net.md_5.specialsource.Jar.init(Jar.java:214)
  321. at net.minecraftforge.gradle.tasks.user.reobf.ObfArtifact.applySpecialSource(ObfArtifact.java:369)
  322. at net.minecraftforge.gradle.tasks.user.reobf.ObfArtifact.generate(ObfArtifact.java:348)
  323. at net.minecraftforge.gradle.tasks.user.reobf.ReobfTask.doTask(ReobfTask.java:298)
  324. at org.gradle.internal.reflect.JavaMethod.invoke(JavaMethod.java:63)
  325. at org.gradle.api.internal.project.taskfactory.AnnotationProcessingTaskFactory$StandardTaskAction.doExecute(AnnotationProcessingTaskFactory.java:218)
  326. at org.gradle.api.internal.project.taskfactory.AnnotationProcessingTaskFactory$StandardTaskAction.execute(AnnotationProcessingTaskFactory.java:211)
  327. at org.gradle.api.internal.project.taskfactory.AnnotationProcessingTaskFactory$StandardTaskAction.execute(AnnotationProcessingTaskFactory.java:200)
  328. at org.gradle.api.internal.AbstractTask$TaskActionWrapper.execute(AbstractTask.java:570)
  329. at org.gradle.api.internal.AbstractTask$TaskActionWrapper.execute(AbstractTask.java:553)
  330. at org.gradle.api.internal.tasks.execution.ExecuteActionsTaskExecuter.executeAction(ExecuteActionsTaskExecuter.java:80)
  331. at org.gradle.api.internal.tasks.execution.ExecuteActionsTaskExecuter.executeActions(ExecuteActionsTaskExecuter.java:61)
  332. ... 47 more
  333.  
  334.  
  335. BUILD FAILED
  336.  
  337. Total time: 16.095 secs
RAW Paste Data